\relax 
\citation{SHiP}
\citation{Collins1985}
\citation{SHiP,US}
\citation{SHiP,SeaQuest}
\citation{SeaQuest}
\newlabel{FirstPage}{{}{1}{}{}{}}
\@writefile{toc}{\contentsline {title}{Dark photon production, NLO}{1}{}}
\@writefile{toc}{\contentsline {abstract}{Abstract}{1}{}}
\@writefile{toc}{\contentsline {section}{\numberline {I}Introduction}{1}{}}
\newlabel{sec:intro}{{I}{1}{}{}{}}
\@writefile{toc}{\contentsline {section}{\numberline {II}Dark photons}{1}{}}
\newlabel{sec:dark_photons}{{II}{1}{}{}{}}
\@writefile{toc}{\contentsline {section}{\numberline {III}Dark photon direct production}{1}{}}
\newlabel{sec:dark_photon_direct_production}{{III}{1}{}{}{}}
\citation{Pospelov}
\citation{Blumlein}
\citation{FieldBook}
\citation{Handbook}
\citation{Collins1985}
\citation{Collins2003}
\citation{Collins1989}
\citation{Maltoni}
\citation{EllisBook}
\@writefile{lof}{\contentsline {figure}{\numberline {1}{\ignorespaces SHiP experiment setup and the three dominant production channels depending on the dark photon mass. \leavevmode {\color  {red}Mensuration of the experiment ?}.}}{2}{}}
\newlabel{fig:setup}{{1}{2}{}{}{}}
\@writefile{toc}{\contentsline {section}{\numberline {IV}Hard production}{2}{}}
\newlabel{sec:hard_production}{{IV}{2}{}{}{}}
\@writefile{toc}{\contentsline {subsection}{\numberline {A}Theory}{2}{}}
\newlabel{subsec:theory}{{IV\tmspace  +\thinmuskip {.1667em}A}{2}{}{}{}}
\@writefile{toc}{\contentsline {subsubsection}{\numberline {1}Leading order and kinematics}{2}{}}
\newlabel{subsubsec:leading_order_and_kinematics}{{IV\tmspace  +\thinmuskip {.1667em}A\tmspace  +\thinmuskip {.1667em}1}{2}{}{}{}}
\newlabel{eq:LABmomentum}{{2}{2}{}{}{}}
\citation{EllisBook}
\citation{Handbook}
\citation{Collins1985}
\@writefile{toc}{\contentsline {subsubsection}{\numberline {2}Next-to-leading order}{3}{}}
\newlabel{subsubsec:next_to_leading_order}{{IV\tmspace  +\thinmuskip {.1667em}A\tmspace  +\thinmuskip {.1667em}2}{3}{}{}{}}
\newlabel{eq:CSS}{{4}{3}{}{}{}}
\newlabel{eq:W}{{5}{3}{}{}{}}
\citation{PerfectDY}
\citation{Collins1985}
\citation{Landry2003}
\citation{Konychev2006}
\citation{Landry2003}
\citation{Konychev2006}
\citation{PerfectDY}
\@writefile{lof}{\contentsline {figure}{\numberline {2}{\ignorespaces Physical domain in the $(z,kT)$-plane for dark photons of mass $M=1$ GeV (blue), $M=3$ GeV (orange), $M=5$ GeV (green). The fiducial constraint of the SHiP experiment is respected below the dashed line. The gray region correspond to the approximate upper limit of validity of the CSS formula. \leavevmode {\color  {red}Make a better figure}}}{4}{}}
\newlabel{fig:physical_domain}{{2}{4}{}{}{}}
\@writefile{toc}{\contentsline {subsubsection}{\numberline {3}Parton dynamics}{4}{}}
\newlabel{subsubsec:parton_dynamics}{{IV\tmspace  +\thinmuskip {.1667em}A\tmspace  +\thinmuskip {.1667em}3}{4}{}{}{}}
\newlabel{eq:physical_domain}{{6}{4}{}{}{}}
\citation{}
\citation{LHAPDF6}
\citation{CT14}
\@writefile{toc}{\contentsline {subsection}{\numberline {B}Numerical implementation}{5}{}}
\newlabel{subsec:numerical_implementation}{{IV\tmspace  +\thinmuskip {.1667em}B}{5}{}{}{}}
\@writefile{toc}{\contentsline {subsubsection}{\numberline {1}CSS prediction}{5}{}}
\newlabel{subsubsec:CSS_prediction}{{IV\tmspace  +\thinmuskip {.1667em}B\tmspace  +\thinmuskip {.1667em}1}{5}{}{}{}}
\newlabel{fig:ds_dzdkT}{{IV\tmspace  +\thinmuskip {.1667em}B\tmspace  +\thinmuskip {.1667em}1}{5}{}{}{}}
\@writefile{lof}{\contentsline {figure}{\numberline {3}{\ignorespaces Differential cross section predicted by the CSS method for a dark photon of mass $M=3.25$ GeV. The points and error bars belong to the second set, while the lines correspond to the fit of the first set. \leavevmode {\color  {red}Add more masses}}}{5}{}}
\citation{Maltoni}
\newlabel{fig:s}{{IV\tmspace  +\thinmuskip {.1667em}B\tmspace  +\thinmuskip {.1667em}2}{6}{}{}{}}
\@writefile{lof}{\contentsline {figure}{\numberline {4}{\ignorespaces Integrated cross section}}{6}{}}
\@writefile{toc}{\contentsline {subsubsection}{\numberline {2}Integration and comparison}{6}{}}
\newlabel{subsubsec:integration_and_comparison}{{IV\tmspace  +\thinmuskip {.1667em}B\tmspace  +\thinmuskip {.1667em}2}{6}{}{}{}}
\newlabel{fig:ds_dz}{{IV\tmspace  +\thinmuskip {.1667em}B\tmspace  +\thinmuskip {.1667em}2}{6}{}{}{}}
\@writefile{lof}{\contentsline {figure}{\numberline {5}{\ignorespaces }}{6}{}}
\@writefile{toc}{\contentsline {section}{\numberline {V}SHiP sensitivity}{6}{}}
\newlabel{sec:ship_sensitivity}{{V}{6}{}{}{}}
\@writefile{toc}{\contentsline {section}{\numberline {VI}A comment on bremsstrahlung}{6}{}}
\newlabel{sec:a_comment_on_bremsstrahlung}{{VI}{6}{}{}{}}
\@writefile{toc}{\contentsline {section}{\numberline {VII}Conclusions}{6}{}}
\newlabel{sec:conclusions}{{VII}{6}{}{}{}}
\@writefile{toc}{\contentsline {section}{\numberline {VIII}Sample distribution}{6}{}}
\newlabel{sec:sample_distribution}{{VIII}{6}{}{}{}}
\bibdata{DarkPhotonProductionNotes,references}
\bibcite{SHiP}{{1}{}{{}}{{}}}
\bibcite{Collins1985}{{2}{}{{}}{{}}}
\bibcite{US}{{3}{}{{}}{{}}}
\bibcite{SeaQuest}{{4}{}{{}}{{}}}
\bibcite{Pospelov}{{5}{}{{}}{{}}}
\bibcite{Blumlein}{{6}{}{{}}{{}}}
\bibcite{FieldBook}{{7}{}{{}}{{}}}
\bibcite{Handbook}{{8}{}{{}}{{}}}
\bibcite{Collins2003}{{9}{}{{}}{{}}}
\bibcite{Collins1989}{{10}{}{{}}{{}}}
\bibcite{Maltoni}{{11}{}{{}}{{}}}
\bibcite{EllisBook}{{12}{}{{}}{{}}}
\bibcite{PerfectDY}{{13}{}{{}}{{}}}
\bibcite{Landry2003}{{14}{}{{}}{{}}}
\bibcite{Konychev2006}{{15}{}{{}}{{}}}
\bibcite{LHAPDF6}{{16}{}{{}}{{}}}
\bibcite{CT14}{{17}{}{{}}{{}}}
\bibstyle{unsrt}
\providecommand\NAT@force@numbers{}\NAT@force@numbers
\newlabel{fig:distribution}{{VIII}{7}{}{}{}}
\@writefile{lof}{\contentsline {figure}{\numberline {6}{\ignorespaces Above: Shift and normalization of the distribution function depending on the choice of the last step size $dx$. The other parameters are $x_{min}=0$, $x_{max}=10$, $x_0=2$, $\sigma =4$ and $N=100$. Only the region where the blue curve is larger than the dashed line corresponds to admissible values of $dx$. Below: Representation of the distributed $N$ coordinates for three different values of $dx$.}}{7}{}}
\@writefile{toc}{\contentsline {section}{\numberline {}References}{7}{}}
\newlabel{LastBibItem}{{17}{7}{}{}{}}
\newlabel{LastPage}{{}{7}{}{}{}}
