{
  "artifactGenerations" : [ ],
  "artifactId" : "my-project",
  "groupId" : "veris.finos.legend",
  "metamodelDependencies" : [ ],
  "projectDependencies" : [ ],
  "projectId" : "44196387",
  "projectStructureVersion" : {
    "extensionVersion" : 2,
    "version" : 12
  }
}