digraph "DataStructure::ILinearDataStructure&lt; T &gt;"
{
 // LATEX_PDF_SIZE
  edge [fontname="Helvetica",fontsize="10",labelfontname="Helvetica",labelfontsize="10"];
  node [fontname="Helvetica",fontsize="10",shape=record];
  Node1 [label="DataStructure::ILinearData\lStructure\< T \>",height=0.2,width=0.4,color="black", fillcolor="grey75", style="filled", fontcolor="black",tooltip="An interface of methods that our linear data structures should have."];
  Node1 -> Node2 [dir="back",color="midnightblue",fontsize="10",style="solid",fontname="Helvetica"];
  Node2 [label="DataStructure::SmartFixed\lArray\< T \>",height=0.2,width=0.4,color="black", fillcolor="white", style="filled",URL="$classDataStructure_1_1SmartFixedArray.html",tooltip="A data structure that wraps a fixed array."];
}
