{
  "type": "service_account",
  "project_id": "yhack-2017",
  "private_key_id": "8efa7580dd878d05e1f5b2f30376c489a8e031f1",
  "private_key": "-----BEGIN PRIVATE KEY-----\nMIIEvAIBADANBgkqhkiG9w0BAQEFAASCBKYwggSiAgEAAoIBAQDV/6QUZ6nObcGh\n9zPtPuKsP/fjW1TGYGLf3xXcnw4iOsaM2EyBie97BkLc+vmJZDuKo3jt1/uJX/NV\nRLZeWHtJArcWI/iP1Xyw2c5iU9rgbpsslCrtugobJ68q3MdaiZKroAne4tYvaDSR\nY1S45CSBf35xlMA1qYBzqDLTg6Qyk04TNsak5aj4OMhVU7M82Fyj0fQ9Eama0eeU\neDBx88X9XVWaIqgJn34puQq/3rhNN1+kUC1wtzu5kYUaSXm/UBWgqPQysFmGa77i\nZALORXC7yJ1PjdwppckDOtc+a/KJSrwTJC+O4ptHTJ13SrRm970myUJ4zOQzzwdA\n4+6NVOzVAgMBAAECggEAQtFqexCPHax5jEfyh75d6miizvOiebp4xOwUGGn1cMyn\nWCzlXoEiLGidEgCvT63jRXubc7A/kvpJsTMeOkEoZXiakCg1ITwIjfPEFEGYkwEW\nJIozCT1QkIAImrqK6IMSL9JtopFzTSQdXdQFDSH3IBQd9/r5NQgy2moHTLHK4Bs6\nUcQtY04EonczxmnPa1Rmiwlj004n7y5iGqcqW99CvnvqXYD/bv+2k4QwD6Sh041B\ngXuA2WgjtpOEZRmeTeGLMeWDZp2UmTpnpT9fdF0FGg69U+LeVcs79CsdiUQ5C86I\norY+jO6TVPV+BytmYUhs3hBCff3MRPgwmiujVAVXdQKBgQDucyrJgnleC0GlXORp\nS8+r96fBLvtfnD9oCHx0IutmI1hSyxgY0PiVwg6ZWNQA6z/sq8jb5b64V/EkjBVh\n0FyxHk9l24uOME1s7N4FHXUmttBaGs3F+w9i71GKmPQDiQXI1+zu/sybeikXW+cV\nPcWi3aHoSSeMjp8Yhvb5OrEkVwKBgQDlv8RXA/rsoPq2KPFS6ORWJ4fUMU3VB9am\nt2QY2Poa2PkT9Ir3ggYHk/ScHXWpaAIR1+0pUrYxtGE5oMGX6IweUgae9xBv7Ofz\nnC+/hHIkhlqqFWjMhmpwvn1Tcn3fQzrsfDI+qLehTb9qecy270M3CoAIDWOI05Uf\nMxK7wRkcswKBgCREgA2GOs+DBskQB+28Ciot0OYhLzqrmTlJkSRY61Ttq1Fsco3T\nuvuMOIw6ZoR9Q4vL1REdMJT5S0QzykzGVFLcOVdUvTUzQ5N9s4czo83voGEUEpg6\nR2zU2aIrAXJINQkHTpJLTvOW8QkMgWlJq/XJoAakmc9XIfupC4d81dShAoGAVeUq\nTLYKPCm7UhtgjfTQWX2SBL0iMkEp+U6bN8b3Ss5P4SwOQJb2FiM00qEY+msOSwmF\ne2uW/mJH7zmw51BkAnn8S7ZnCNFzrtp354xm+Eza3LgAZGbkqJ4vUOF/Oddy0jNk\nvZRqgv4EUJSU+tfdM1jToS8QRXmFSRLZMCTzdI0CgYBB1LDfAbOTtUH2DCyn3qf2\nfgDGknfajDlARMLDYRYjJ9akMznpUM/AOuNi5Y+joY1lBVnugNCNVImspiak9oFe\nYfGKhHlz0gZ1pV4t9d+lgGLA9H1szcjKA7lMkzhMeWnkw+sE3ED3qxeXRAj0oRKX\n+4UbnEuM2k3kaWUIGQXO8A==\n-----END PRIVATE KEY-----\n",
  "client_email": "predictor@yhack-2017.iam.gserviceaccount.com",
  "client_id": "113002780595913708034",
  "auth_uri": "https://accounts.google.com/o/oauth2/auth",
  "token_uri": "https://accounts.google.com/o/oauth2/token",
  "auth_provider_x509_cert_url": "https://www.googleapis.com/oauth2/v1/certs",
  "client_x509_cert_url": "https://www.googleapis.com/robot/v1/metadata/x509/predictor%40yhack-2017.iam.gserviceaccount.com"
}
