{
    "type": "service_account",
    "project_id": "yhack-2017",
    "private_key_id": "58ffb2c4000bc306dcea514ec8acb4ec9a037262",
    "private_key": "-----BEGIN PRIVATE KEY-----\nMIIEvQIBADANBgkqhkiG9w0BAQEFAASCBKcwggSjAgEAAoIBAQCot7sRNT2JDr+Z\n01hLHuTQ6Bvk2SL/qT+pQiHQSbCLYmOwbZxGvxWhvFHmWZ9kmn4CQOSmhyJXvAVy\nHWtHOv5c3Jzir5JRLA2CsM4Hp1yVB78HzaBm7Fk932RAKtJiwrFgMRncUFtYB8h+\nyFfN9o/v/yCKujsMnBTl0S0kz+uJROp8d62/DCRlTvg9TwevkdCt9TnwAbrPLVcr\nzgOEYwzxm76mX316YKZwCRkWcYEhWrCbhbI5jD6jxwTAv7tncPjVp560zwzD2NbS\n8CHaHh30p0T5Exr4fUIpe+B2X127xHfG0WTUlhwTjJI5ba5UdLYlJRkI4RrmH5ru\ngCLsPnEdAgMBAAECggEAAixXrwQ6C4Vn8hHMWISzMCkFOaCTDar+7xhdz3fbhngZ\nI6EjJbAkFbC+If2eitEIoCZ41iz1xB6KYsAT7SzKhk9bKqUAo/tcHdusKQy+qbbE\nqajm5jHTgR4FsGPne4PZfWKJ3DzMExQKlkN7X2OhKAIScmcCsrS3T4cvEdh8cV4E\nrMJF4bjS1hUECjFKN3VZ5aMc0XcpDEzu04n3q5b/8tAmxyt0rx6TiwY8QPqYGBVl\nGoUalkWi1vnLwJl8FCSQMgyvGJ/tHbf1A+xmdML+S/M2bPspXvs5wEu+BGyv+zP3\nqdveVmbQhpO3vMpQGMNM1BSw/4GZT+TfXX2PUbKu6wKBgQDj4sP/z90Zjt3SaaEG\nPH4XJQBGepPY008Tdoji5EDGCZQiaqsFM/JuRuUv5DJhZBt+Fx/vh7TGD1aL53Pq\nl6lla/GrXYUOslfsTl+eLJc2vCS/yD8rGSqClrAFmlgt3Xl3WRE3baXYg4HKtMxG\nRl7aWhI1hamJJNYsaE8ZJHrJywKBgQC9iEfHNRKritL2QNqC0I+ZSsk+sYgCZM0X\nisaBJSlxRH40+kgzXL36Nw5ld4lZdLiYYxPMSPKuBTXF6HANK/o35WAVndcV+1f0\ntpO8L7C8LOHU1pUOTnAYBF5IsHLSS8jX8inah+WfFAl4kU0vhmirtmVM4pzcqWzV\nkn8IfTZztwKBgCd2fISPJXWolOc8HYNr9FXjtXF/Bp1UsmvnafsIleL1g66WFDmZ\nblEEe+nYNZVB9bTXIlOjh32I6G7fzOYCD3adw8LuNf1+itVEGTDV/fWfjSmc7rty\n5zaoC6FcwgpnQQKW7PFRTpf45gAJYRqGUySy1lZoaBx0wZX9Fj1/YLgTAoGBAKcR\nPvw5KzjtCSKqbjLLdxkP1C8gPJynkCWFXY8vW8WNM5atXAFyab/q0hTc9sRU3/br\ntuLnFowQ6aKHTmY98rVcyoKjfJnS0WhTnAxRGX/2LCb587AFskdpala2uq/mv6ai\nvwPzsJO2DNcrdZdD6nYaNFc+ljjoW5gzJykrflknAoGAEZXMAohs0ERPKtKhvp7O\n8l/6ucJDOVPeq7Kyx4YI+Q82kNbvzrXeSZSrvV4nk0AU7QYwmUZSMqk3GRc1oe6g\n4h6yHYyThFdHAi3v74cTymFw46lP8mbEaqoxbvVomJj7bQCMYqqUdLpkcOXLb38v\nmDoI8iunX8PcQVTh4mEZH/Y=\n-----END PRIVATE KEY-----\n",
    "client_email": "firebase-adminsdk-9byoh@yhack-2017.iam.gserviceaccount.com",
    "client_id": "105964284734948196818",
    "auth_uri": "https://accounts.google.com/o/oauth2/auth",
    "token_uri": "https://accounts.google.com/o/oauth2/token",
    "auth_provider_x509_cert_url": "https://www.googleapis.com/oauth2/v1/certs",
    "client_x509_cert_url": "https://www.googleapis.com/robot/v1/metadata/x509/firebase-adminsdk-9byoh%40yhack-2017.iam.gserviceaccount.com"
}
