[
{"CONDITION_NAME": "Obstructive Sleep Apnea", "ICD_CODE": "G47.33", "NICD": "G47_33"},
{"CONDITION_NAME": "Ataxic cerebral palsy", "ICD_CODE": "G80.4", "NICD": "G80_4"},
{"CONDITION_NAME": "Tachycardia", "ICD_CODE": "R00.0", "NICD": "R00_0"},
{"CONDITION_NAME": "Other abnormalities of heart beat", "ICD_CODE": "R00.8", "NICD": "R00_8"},
{"CONDITION_NAME": "Cough with hemorrhage", "ICD_CODE": "R04.2", "NICD": "R04_2"},
{"CONDITION_NAME": "Diarrhea", "ICD_CODE": "R19.7", "NICD": "R19_7"},
{"CONDITION_NAME": "Unspecified fracture of specified metacarpal bone with unspecified laterality", "ICD_CODE": "S62.308", "NICD": "S62_308"},
{"CONDITION_NAME": "Broken internal left hip prosthesis", "ICD_CODE": "T84.011", "NICD": "T84_011"},
{"CONDITION_NAME": "Displacement of permanent sutures", "ICD_CODE": "T85.622", "NICD": "T85_622"},
{"CONDITION_NAME": "Peanut Allergy", "ICD_CODE": "Z91.010", "NICD": "Z91_010"},
{"CONDITION_NAME": "Chronic viral hepatitis B without delta-agent", "ICD_CODE": "B18.1", "NICD": "B18_1"},
{"CONDITION_NAME": "HIV disease resulting in other bacterial infections", "ICD_CODE": "B20.1", "NICD": "B20_1"},
{"CONDITION_NAME": "Type 2 diabetes mellitus with hyperglycemia", "ICD_CODE": "E11.65", "NICD": "E11_65"},
{"CONDITION_NAME": "Alcohol abuse with intoxication delirium", "ICD_CODE": "F10.121", "NICD": "F10_121"},
{"CONDITION_NAME": "Chronic kidney disease", "ICD_CODE": "N18.9", "NICD": "N18_9"},
]
