^E:\PROGRAM FILES\VISUALSTUDIOPROJECTS\PRACTICEWORK13\X64\DEBUG\PRACTICEWORK13.OBJ
E:\PROGRAM FILES\VISUALSTUDIOPROJECTS\PRACTICEWORK13\X64\DEBUG\PRACTICEWORK13.EXE
E:\PROGRAM FILES\VISUALSTUDIOPROJECTS\PRACTICEWORK13\X64\DEBUG\PRACTICEWORK13.ILK
E:\PROGRAM FILES\VISUALSTUDIOPROJECTS\PRACTICEWORK13\X64\DEBUG\PRACTICEWORK13.PDB
