{
	"info": {
		"_postman_id": "61a06dc3-6fe2-44f6-8635-ee617eb28c38",
		"name": "Contamination",
		"schema": "https://schema.getpostman.com/json/collection/v2.1.0/collection.json"
	},
	"item": [
		{
			"name": "download",
			"request": {
				"method": "GET",
				"header": [],
				"url": {
					"raw": "{{BASE_URL}}/download?file=testfile",
					"host": [
						"{{BASE_URL}}"
					],
					"path": [
						"download"
					],
					"query": [
						{
							"key": "file",
							"value": "testfile"
						}
					]
				}
			},
			"response": []
		},
		{
			"name": "sysinfo",
			"request": {
				"method": "GET",
				"header": [],
				"url": {
					"raw": "{{BASE_URL}}/sysinfo",
					"host": [
						"{{BASE_URL}}"
					],
					"path": [
						"sysinfo"
					]
				}
			},
			"response": []
		},
		{
			"name": "set_config",
			"request": {
				"method": "POST",
				"header": [],
				"body": {
					"mode": "raw",
					"raw": "{\n    \"test_user_key_1\": \"testvalue1\",\n    \"test_user_key_2\": \"testvalue2\"\n}",
					"options": {
						"raw": {
							"language": "json"
						}
					}
				},
				"url": {
					"raw": "{{BASE_URL}}/set_config",
					"host": [
						"{{BASE_URL}}"
					],
					"path": [
						"set_config"
					]
				}
			},
			"response": []
		}
	],
	"event": [
		{
			"listen": "prerequest",
			"script": {
				"type": "text/javascript",
				"exec": [
					""
				]
			}
		},
		{
			"listen": "test",
			"script": {
				"type": "text/javascript",
				"exec": [
					""
				]
			}
		}
	],
	"variable": [
		{
			"key": "BASE_URL",
			"value": "http://localhost:8000",
			"type": "default"
		}
	]
}