*** Life<FredkinCell> 1x1 ***

Generation = 0, Population = 1.
0

Generation = 1, Population = 0.
-

Generation = 2, Population = 0.
-

Generation = 3, Population = 0.
-

Generation = 4, Population = 0.
-

Generation = 5, Population = 0.
-

*** Life<FredkinCell> 5x5 ***

Generation = 0, Population = 5.
-----
--0--
-----
00---
0--0-

Generation = 1, Population = 12.
--0--
-0-0-
000--
-100-
1-0-0

Generation = 2, Population = 9.
-----
-1--0
1--0-
0--1-
-010-

Generation = 3, Population = 10.
-0--0
--0--
2-01-
1---0
-1--0

Generation = 4, Population = 13.
0--0-
0-1-0
3--2-
2-0-1
--101

Generation = 5, Population = 10.
10---
-----
-00-0
3-1-2
11---

Generation = 6, Population = 13.
210--
0-1-0
-1--1
4-2-3
-2--1

Generation = 7, Population = 10.
---00
1-2-1
3-02-
-----
---02

Generation = 8, Population = 13.
2--1-
2-3-2
4--3-
4-2-3
--113

Generation = 9, Population = 10.
31---
-----
-10-1
5-3-4
12---

Generation = 10, Population = 13.
420--
2-3-2
-2--2
6-4-5
-3--3

*** Life<FredkinCell> 10x10 ***

Generation = 0, Population = 19.
--0--0--00
------0-0-
----------
--------0-
0--0-00---
-0-00-----
0--0-----0
----------
---0--0---
----------

Generation = 1, Population = 38.
-0-00--0-1
--0-----1-
------0---
0--0-000-0
--0101100-
0--11-0--0
--01----0-
0-----0--0
--0-00-0--
---0--0---

Generation = 2, Population = 46.
0-01100-0-
----0-0---
0-00--1-00
-0-10---0-
-01-12-110
-002-01-0-
-01----0-0
-0-00-----
00-011--00
----------

Generation = 3, Population = 52.
--1-2----1
---010-0-0
-01-002--1
-1----0--0
01----12-1
01-31-2-10
01-100--0-
--0----00-
1---220011
00-000--00

Generation = 4, Population = 41.
-0-13--002
-001--0---
0-20-1--0-
----0---0-
-21112231-
12---030--
--1-11----
--------1-
2-0--3-1--
-1-11-----

Generation = 5, Population = 45.
011-40-1-3
--12-----0
-0--0--011
01-1100--0
----2334-1
2-03114---
0---2--00-
0---0----0
-0--------
--022--0--

Generation = 6, Population = 48.
1--151---4
00-310----
-1-01--1-2
1--2-1-0--
-2113--5-2
3-1--2-010
-11----11-
1--010-0--
---0---1-1
--1-300-0-

Generation = 7, Population = 44.
2-1-6-0-0-
---4--00--
02-1-122--
-1------0-
0322433-13
-------12-
02--2-02--
-----1---0
2--12--21-
-1-24-10--

Generation = 8, Population = 37.
---1--11-4
-0-5--1---
1--2-23---
1---1---1-
14----4524
--13-24---
1311-11--0
-0-01-----
--0-----2-
------2---

Generation = 9, Population = 44.
-11261-2--
----1----0
2-2313-21-
--------2-
-5-24---35
-2----5-2-
24222--21-
-1--2-0-10
----2-02-1
--1--0-00-

Generation = 10, Population = 46.
22--72--04
00-5-0----
--3-24-3--
110--1----
16-3534546
-----2-1--
3----1132-
-2----1---
-00133---2
-1-2--2-1-

*** Life<FredkinCell> 15x15 ***

Generation = 0, Population = 23.
--------0------
---------------
----0----0-----
---------------
---------------
--0-----------0
--0-----0---0-0
----00---0-----
---------------
-----------0--0
---------------
0--0-0--0------
0-----0--------
------------0-0
-0-------------

Generation = 1, Population = 70.
-------0-0-----
----0---00-----
---0-0--0-0----
----0----0-----
--0-----------0
-010----0---001
-01000-0---0--1
--00110---0-0-0
----00---0-0--0
----------0-00-
0--0-0--0--0--0
100----0-0-----
10-0---00---0-0
00----0----0---
0-0---------0-0

Generation = 2, Population = 67.
----0-0-010----
---------------
--0---001--0---
--0-----------0
--1-0---00--0-1
0----0---0--1-2
0---1-0-----0--
---1--1--------
--0-----0---0-1
0--00---0---110
1-----0--------
2110-001--000--
210-0---1------
1--0-0--0-0-0--
10-0--0--------

Generation = 3, Population = 124.
---0----1-10---
--0-0--0-000---
-010-01-200-0-0
-0-00-00-0-0001
002----01-001--
101-0----100--3
10---010-0-0101
0----1200-----0
00-00-0010-0102
10-1100010-0---
--0-0-1-0-00-00
32210112-01-10-
32---00-20-0---
-0-10--01----0-
-1-10--00-0-0--

Generation = 4, Population = 58.
---------1--0--
--1-----------0
0-2--1--3---101
----10---1-----
--------2------
2-----0---111-4
2-----2-010---2
-0-1-----0---0-
1-----1--------
--0----1--0----
-01-----1---0-1
-33-12-3----2--
-3--0-----0----
--------2-00--0
12---00--------

Generation = 5, Population = 119.
--0-----1-10-00
0020-0--00----1
--30-210---02--
0-002-0-0-0-001
0---0000--001-1
30---010----2-5
3--0-03-12--1-3
0---1----1--0--
--00-0---00--0-
1-11-----0-01-0
1-2000-0-0001--
34---3----10300
34-01--0201-0-0
1---0000---100-
230-01100-00--0

Generation = 6, Population = 101.
0-1--0-02121-1-
1----1---1--0-2
--410-2130-1---
1--1------1-1--
--2--1---0--20-
4110-1---11----
--1-1--02-00--4
1001-12----01-0
-0--0-1-111-1--
2-22---11----1-
-0-1------1-2--
4---141-0021---
4--1-0--------1
-00-1111200-110
--1--2211-1----

Generation = 7, Population = 124.
1--001-1-2-20--
20-0-2--0--0-0-
-052123---0-2-1
-002-00001-02--
--30020-2100-11
5--10210----205
-0---0-132---05
2112-2---10---1
1100-020--202-2
--3----2----1-0
1-22-010--20---
5--1252-1-32--0
5-----00---00-2
-1-12-223---2--
--21--32-020000

Generation = 8, Population = 64.
2-1-----2---1--
--2--------1---
-16---------30-
1--3-1--1------
0---1-1--2-----
----1-2-0-1-3-6
31----3-------6
--2---------1--
-2------1------
---2--0-1--02-1
2---0-2--0-----
-4---63----3-01
6-----1-2-----3
--0-3-3-4-01---
--3--2--11--1-1

Generation = 9, Population = 104.
--20---1-2---1-
2--0----0-0-00-
-2---2--3---411
2---2--0----20-
10--22202---2-1
-1-12----1----7
42--10413-0--07
21-2--2-0--0-01
1--0--2021-0--2
203--01-2-013--
-----0-0--2-20-
5-3--743103--1-
--0-1---301---4
111--14--012---
-341---2-2-----

Generation = 10, Population = 104.
203-0-0-2----20
---102--11---1-
0-62--3-40015-2
30-331-11--03-1
--3-3--13--0312
5--232--0---3--
-310--5--2--1-8
3--3-------1--2
-2-10-3--22---3
--4-1---30-2--1
-0--0--11--0--1
--41---42143-2-
-----0----2----
222--25--1232-0
--5202---3-0---

*** Life<FredkinCell> 10x10 ***

Generation = 0, Population = 41.
--0-0-0-00
-----00---
----0-00--
----0--00-
0-0--0--0-
00-0---0-0
-00-00-000
0---00--0-
0--0---0--
0-00-0--0-

Generation = 1, Population = 44.
-0---01-11
--0-011-00
---010----
0-001----0
10----001-
------01-1
0-10----1-
1-0---001-
-0-1--0-0-
1-1---0--0

Generation = 2, Population = 43.
0---------
---0------
0-0-----0-
1011--00--
-1-000-120
-000-0----
1--10--02-
2010-0--20
0---00-01-
-0---010--

Generation = 3, Population = 43.
-0-0------
----0---0-
1010--0--0
-12---1-00
---1--0--1
---1-10--1
20121001--
3----10031
100-110---
--1-------

Generation = 4, Population = 48.
0-------1-
0-00-110--
2121-01001
---1-0--11
-1-20--1--
00--0-1-02
---3------
-0-002-1-2
----22--10
1-20001---

Generation = 5, Population = 56.
1000-01--1
-0----2-00
--32-1211-
1---11-0--
-2------2-
1-011--113
2-1410012-
3---1---33
100133--2-
--3-112000

Generation = 6, Population = 47.
21-1-1-0-2
-10--1-0--
2-431-32--
--2-2-111-
1--2-0-13-
20-2-----4
---5---230
---0-20-44
--1------0
1-40-2--11

Generation = 7, Population = 51.
3-0--2-1--
0--0-22-00
-15--1-3--
-13-31---1
2--30-0---
-1--11--15
201-10-341
---1-311-5
1021--0-2-
---1--202-

Generation = 8, Population = 46.
4---031--2
1-0--33-11
------3---
---1---11-
-2-41--13-
22--2-----
3125-10-52
--121-2--6
2--23---3-
10-212---1

Generation = 9, Population = 50.
510114-1-3
2--0--4-2-
2-53--4--1
-132-----1
-3---00--1
-3-23-11-5
-23--2--6-
-----33147
3--34-00-0
-1--232---

Generation = 10, Population = 51.
---2-51-1-
--0---50-1
31-41153-2
--4-31--1-
2----1--3-
2-034--216
3-4--30372
3012--425-
--24--1-31
--4------1

Generation = 11, Population = 47.
-----6-1--
2--0036-22
42-5226-13
---2-2--2-
33-4120---
----51----
-2-5-41---
----1-5367
3-3-4320--
-15---2--2

Generation = 12, Population = 44.
5--2-71--3
3-0-1--0--
-3-63---2-
--4---113-
44--2-113-
2--3-21---
3-------72
301-2-64-8
-04-------
-2-22-3-2-

Generation = 13, Population = 51.
61--182-1-
41--2----2
---7-26333
11---2-241
-5---222-1
--0-53---6
--4514--8-
-1----7569
-1-----031
13533----2

Generation = 14, Population = 48.
--02--3---
--0-33-023
--5-3--444
2-423--352
-6---3--3-
--13-4-2-7
----2---92
32-22-86--
---44---42
24--43-0-3

Generation = 15, Population = 53.
-1-3----13
-1-0-46-3-
43-7--65-5
-1----1---
--0--42241
--2455---8
32453-13+-
43--3-976-
--4-5-205-
355--4--24

Generation = 16, Population = 51.
62-41831-4
-----5-043
54-83-764-
-2-2---35-
--1---3---
2-356-1-19
-35644-4--
--1---+-79
-15-63-16-
4--3-----5

Generation = 17, Population = 52.
73-5-9--15
----36-15-
6---428-5-
-343--1--2
4-24244--1
-346-5222+
-4-755--+-
-3---3---+
-2-47422-2
-----4-0--

Generation = 18, Population = 51.
84--1+3--6
-1---7626-
--5--3-66-
245-32-3-3
--3--55---
--57-63-3-
3-5--6--+2
4-1-3--7-+
33-5-----3
-5-3-53125

Generation = 19, Population = 46.
9-052+----
-2---873--
6468--87--
3-6-43145-
4----6--41
2368-7--4-
4----7----
-322--+-7-
--56-42---
-6-4-6----

Generation = 20, Population = 47.
-41----1--
430---8-6-
-579-398--
-4735425--
---4----52
3--9--325-
54--58----
-43-33+--+
-3-7---26-
4-55-7----

*** Life<FredkinCell> 9x9 ***

Generation = 0, Population = 41.
-----0--0
0--000-0-
00-0-0-0-
0-0--00-0
-00--0---
000-0--0-
-0-00--00
000-000-0
0--00--0-

Generation = 1, Population = 42.
0--0-10--
1-0--1-1-
11010-01-
1-1-0110-
0-10-1-00
1--01-01-
0--11----
-11-1-1-1
1--1-----

Generation = 2, Population = 34.
10----1--
-010-2-20
2------20
-0---221-
-----2-11
-0-1-01--
1---20-00
022-2----
------0-0

Generation = 3, Population = 36.
2--0----0
1--1--0--
-101---3-
--1-0--20
---00---2
----1121-
200---011
--3-3-10-
100-00---

Generation = 4, Population = 38.
30010-10-
2---02--0
-21----4-
--2-122--
---11-013
100---3-0
3--1--1-2
-2--40---
2----1-0-

Generation = 5, Population = 35.
-----121-
30---3-2-
-3-1-----
--30---20
0012-21--
--1111-1-
40----2-3
0-3-5--01
-----2--0

Generation = 6, Population = 45.
30--0---0
4-1104030
-41200--0
10-112-31
1--31-213
-0-2-----
-101----4
12-----12
2-0---0-1

Generation = 7, Population = 40.
-1--1-2-1
5--2-5--1
2-2--1-4-
--32--2-2
2014-232-
-11---31-
-2--2---5
--30---23
30-1-2-02

Generation = 8, Population = 40.
--0--1--2
6---06--2
3-32020-0
--4-123--
31---3---
-2--1----
430--0216
124--01-4
4102-----

Generation = 9, Population = 40.
31-1-2213
70---7-3-
4-------1
--52---32
4---14---
1--2-1310
---1--3--
2-5-5--25
-213020-2

Generation = 10, Population = 48.
-------24
8-1208042
5-32-2-42
-063-234-
51142----
22131-4-1
---2--41-
-26-6-13-
-32-1-103

Generation = 11, Population = 39.
3-0112---
9--3-9--3
64430--5-
1--41----
-------23
-32---51-
4-03205--
2--07-24-
4---2--14

Generation = 12, Population = 35.
4-12--2-4
--1--+0--
7-----0--
2----2--2
51142---4
-4--1----
53-43-61-
-2--80---
53--32--5

Generation = 13, Population = 48.
---31-3--
-02-0+143
844--2152
--64---43
-2-----25
2--3-1511
64-540726
2-6-9--45
6-23--11-

Generation = 14, Population = 46.
-1-4-24-4
---3-+-5-
955---2-3
20-512-54
-----4-36
34241-6-2
750-518-7
-27-+-25-
7--4-22--

Generation = 15, Population = 40.
4--5--52-
9--4-+--3
-66302--4
--66--3-5
--1-253-7
-53---71-
--156-928
2--0+-36-
----33---

Generation = 16, Population = 38.
51161-63-
+---0+--4
-77----5-
--7-124--
---43-438
364---8-2
7--6--+-9
-2--+0---
7----4-1-

Generation = 17, Population = 35.
-----274-
+0---+-5-
-8-3-----
--86---55
5215-55--
--5411-1-
85----+-+
2-7-+--65
-----5--5

Generation = 18, Population = 45.
51--1---4
+-240+164
-97402--4
20-712-66
6--63-638
-6-5-----
-616----+
32-----76
7-2---2-6

Generation = 19, Population = 40.
-2--2-7-5
+--5-+--5
9-8--3-5-
--88--4-7
7217-574-
-75---81-
-7--6---+
--70---87
83-4-5-17

Generation = 20, Population = 40.
--1--2--6
+---0+--6
+-94042-4
--9-125--
83---6---
-8--1----
881--1+2+
328--03-8
9425-----

*** Life<FredkinCell> 8x8 ***

Generation = 0, Population = 27.
---00---
--00--00
-0-0----
0-0-0000
000---0-
-0-----0
0---0---
0000-0--

Generation = 1, Population = 32.
----1000
--11-011
---1-0--
1-101-11
-1-00-10
01--0---
100----0
---10-0-

Generation = 2, Population = 31.
--0-211-
-02-012-
0-0-010-
-02--0--
020-1---
-2--100-
-11-----
00-21---

Generation = 3, Population = 31.
--1--2-0
-13-1-31
-------0
1-3011--
1---201-
--00--10
-22--00-
1-0320--

Generation = 4, Population = 31.
--20--11
02---142
00-1-1-1
2-4-2--1
22-0-1--
0--1-021
-330----
-0------

Generation = 5, Population = 31.
0-312---
----1-53
1-0-020-
-----112
330122--
12-----2
----0000
11-3----

Generation = 6, Population = 24.
--4--211
-----1-4
-----311
-0-02223
-4------
---1---3
----1---
22---000

Generation = 7, Population = 32.
-0-12---
--3-1---
-0-1-422
21-1-33-
350-221-
-20---2-
13----0-
330--1-1

Generation = 8, Population = 38.
0-42-2--
-2--2-54
-1020-33
-242244-
---13320
13-11--3
-43---1-
-4132-0-

Generation = 9, Population = 39.
-0532--1
-33131--
1213144-
2-5--553
3--2-43-
2-0---24
-5-0-02-
3-2-3-11

Generation = 10, Population = 33.
0-64--1-
-4-----4
-3-42---
-262-6-4
-50---40
33-1-035
1---1130
-4-3-1-2

Generation = 11, Population = 33.
-07522--
-5--3---
1-1-3---
237-2-55
-6-2-4-1
--0-1--6
25-02-41
----3213

Generation = 12, Population = 31.
0---331-
-63-----
2-2--443
-4-2366-
-7----4-
33--2---
363131-2
34----2-

Generation = 13, Population = 32.
--754-21
07-13--4
--3---54
-573-77-
--02--51
-4--3-36
4---424-
---33---

Generation = 14, Population = 28.
0-86--3-
18---15-
23443---
26---885
-7----6-
----404-
----5---
3-24--2-

Generation = 15, Population = 34.
10974-41
2-3--2-4
3---44-4
-7-3-996
-80-34--
-4-1---6
4-3-6---
--35-2-3

Generation = 16, Population = 31.
--+-535-
-84-335-
4-4-555-
-87--+--
391-4---
-5--404-
-64-----
34-63---

Generation = 17, Population = 31.
--+--4-1
-95-4-64
-------4
2-833+--
4---546-
--01--56
-75--24-
4-3742--

Generation = 18, Population = 31.
--+7--52
2+---375
43-4-5-5
3-9-4--6
59-2-5--
3--2-067
-861----
-4------

Generation = 19, Population = 31.
1-+85---
----4-86
5-4-565-
-----+97
6+1356--
45-----8
----6242
45-7----

Generation = 20, Population = 24.
--+--452
-----3-7
-----765
-8-34++8
-+------
---2---9
----7---
56---223

*** Life<FredkinCell> 20x20 ***

Generation = 0, Population = 46.
--0----------0----0-
--------------------
-----------------00-
-0-----0--0---------
0-------0-0---------
0------------------0
0-------0-----------
---0-----0----0-----
--0-----------------
-----0-----00-----00
--0-----------------
------0----------0--
-----------------0--
--------------------
----00---0----------
--------------0--0--
---------0---0------
--0------00---------
-0-0---0--------0--0
---0-0----------0---

Generation = 1, Population = 128.
-0-0--------0-0--0-0
--0----------0---0--
-0-----0--0-----0110
--0---0--010-----00-
1---------10-------0
-0--------0-------0-
10-0---0------0----0
0---0-----0--0-0----
-0---0---0-00-0---00
----0-0---0110---011
-0-0-00----00----000
--0--0-0--------010-
------0---------010-
----00---0-------0--
---0110-0-0---0--0--
----00---------00-0-
--0-----01--0----0--
-------00-10-0--0--0
0-01000-000----0100-
-001--00-------010-0

Generation = 2, Population = 126.
0-0-0------0-0-001--
-0-----0--0---------
0-0-----0-1--0-01-21
0--0-0--01--0------0
--0---0---2-0----00-
0100---0-01---0--0-0
------0-0-----------
10-----0--------0-0-
--0-0---0-----------
------10--1--1--0--2
0-0-0------------1--
----01--0--00--0--1-
--0-00---0-----0---0
------0-------0-----
--01--1--0-0-0---1--
--0------00-0--11--0
-0-000---2-----00--0
0--000-11--10-0-10--
-0-2---------00--110
-11----1-00---0-2-0-

Generation = 3, Population = 201.
-0---0-0-------1-20-
0-0-0-0--01------000
10---0--1020---12-3-
100----0-2101--00001
--10----003-100-0-10
1-110-0-01-000-0010-
--00-0----0---0-0000
21--0---0------0---0
0----000-00--0----00
0----021-0-11-00--1-
----1-000-0000-0---0
0--01-00--0110010---
-0--------000--10---
---00-10---0-----0-0
-0-21120010-0--0--00
--10000-0110--0---01
--0-1-00-3-0----1-01
-0011--22-121010----
-103-0--0000-1101-21
0-2---0--110--1--01-

Generation = 4, Population = 120.
------0-000---0-----
1------------------1
2-0-----2-----0----1
-1---00--3-1--------
--2---0-----211---2-
--2-10-----11--1-210
------------0----11-
-2---00------0---00-
------1-0-1------0--
10-----201----1-0022
----201-10----------
--01-----01--1---1-0
--0------0---------0
--0--0---0010-----01
0-03-2-112---0--0--1
---1-11---2--0--1012
-----0---4---0------
0--2---------12-1---
----0----1-10--121-2
-13----1--2-0-2--1--

Generation = 5, Population = 193.
0----0--1-10-0-1---0
200---0--01-------02
30-0-000---0-0-1--32
--0-01-0-----0----01
--300010-0-0--2---3-
-13-21----122------1
-00-0-0-----1--0022-
2-0-01-00-0---0-01-0
0-----2010-0-00---00
210-0023-----1--11-3
000-3-20-1---00-0-0-
-0-2-10--1211-0-0--1
-0---0--0-0000---1--
00--0110-1--1---0012
------22--00-1001-0-
0--2-22-01-00-01----
0---11--0---0----001
-00--0-----2--302--0
010--0-00-02--123---
02410-0-0--01----210

Generation = 6, Population = 189.
1-0-0--0-0-1----0--1
311--01--1-0-----0-3
----0-1-20---1--2143
1-1--2--03--11-0-01-
--4-------31---0-040
1-413-00--23-001021-
--1-----0---20-11330
321--2---0--0-10---1
-----0--211----0-011
32-----4---11-10-2-4
---04-3--2-0-----1-0
--0-1-----32--1-1---
--00--0----1-1--02--
1-00122-0-01200--123
-0-3123--21--211-11-
101-0--0-22--0---0-2
1-0-22-01--010---1--
0--2--02---3-1-1---1
--1--101--13-1-3--2-
-35-10-111--2020-3-1

Generation = 7, Population = 190.
201------1-20--1--02
---001-----100--010-
-0-0--2--120-20-3-5-
--20---0----2--10121
-0--00100-------01-1
--5-4-11-1--2---1-21
----000---0----2244-
4--0030-01-01021--0-
--0-012-322---0----2
430000------2-2---2-
00-1----1-0----0-2-1
-01-21----431---21-1
001-0-100-0-0201---0
-0--233--1-2-----234
01---3----2--322-2-1
-1-2-2-10------11-1-
-010-3012----100120-
100--0-3----1--220--
0-2---12--2-0-1-3--2
04--2-0--2--31----1-

Generation = 8, Population = 145.
3-2-00--1-----0----3
3----2-----21-----1-
3-0-----22----11----
-13--201-31----2-23-
1-4---2-1-------1---
------2-0--3-0------
1-1-111-00---0--3-5-
-2-1--1----1--3---1-
--1-1----33-------1-
-4111----1-1--3----4
-1-24--0--1-----0302
01-2-2-0-15---113---
1-------101----2----
1--0-4----------0--5
1203---21---04--13-2
--13--2--22---02--2-
-12--4---4---2---3-1
-11-11----132-3----1
--330---0----1-34---
-5-1--1-1--0-2--23--

Generation = 9, Population = 209.
4---1-00-1-200-1----
-1---31--11320-0-1--
4010--2-3--0022-31--
12400312--21---30341
-050---02-31-1----4-
----4-----2--10---2-
-0-02-2--10-21-2--60
----0-200---1--101-1
-02-212-3-40-----02-
4-2220-402--21-01225
--03--31122---------
---32--10-63-122--11
--------21-1---30--0
---1--30-10-20--1-36
--1413-32-2015---413
112-0-----300013-0-2
1-3--5--2500--001-02
1-22--0-2-2-3---2002
-1-4--12112--214---2
0-52-0--222--32--41-

Generation = 10, Population = 176.
---0-0-1-21-1--202--
32-0-42------101021-
--2--0-0--21133--2-3
------2-03-2---41452
--6-00--3-4--2-01---
--5151210----21--2--
1--13-3--2----03----
--1--33-----2-3----2
-1-032---35100--01-2
-4333-----1-32-1-336
01-44-4--3--0-0-03--
----32--1----2---12-
----0-10---2-----20-
---2--4-------0-22-7
1--5243-3231-6-2--24
--3312-1--4-112-11--
-1-----1----1--1---3
21--1-13---3---2--13
0---0----233--25--23
-56------3-03---252-

*** Life<FredkinCell> 15x15 ***

Generation = 0, Population = 76.
--0--0-----0---
-----0-0--0---0
00---0----00---
0-----000--0000
-----0----00-0-
0000---000-0--0
0-------00-0---
-000-0--00---0-
--0-00---------
0-0-000-0-00---
-0-0-0000------
-0----0-0------
-0-0----0-----0
0------0------0
-000-0------0--

Generation = 1, Population = 119.
-0-00100----0-0
000-0---0010-0-
-10-01--00---0-
1----01-1001-11
-0000-----11010
---100011-0-0--
10---0--11-1000
-1110100--000-0
0--0-1---000-0-
-010---01-110--
-10-0---1000---
0-0---10-0----0
-1--0-0-10---01
-00--00-----001
-1-1--00---0-00

Generation = 2, Population = 105.
-1011--1-00--0-
1--0-00--1-101-
0------0110-0--
-0-00-2--11-02-
-1-1-0-0--2212-
0---11---01--0-
2---0-00-2-----
0--2---1-0----1
-00-02---1-1---
--2--001--2-1--
--10-000-11---0
--10-0-1---0--1
-200-0-02-0---2
011--11-00--1-2
020-0--10-0-0--

Generation = 3, Population = 106.
-2-22-----1--10
2--10110---21-0
1---0101---0-0-
-1--10-0--211-1
-2-2-10-003-230
1-------1----10
-0--101------00
1---01-2--00-0-
-1-01---020---0
-----11-1031-00
-12--111-2--001
--21--1--00-00-
------0--0--00-
--2---2-11002-3
-3-----2-0--100

Generation = 4, Population = 97.
------01-0---2-
3-0--22-0---2-1
2---1-121-----0
-20--1-1---2--2
-3--0-10---2-41
-0-11--12-1--21
2-00-12-1-0101-
-1--1-0----1-11
---1-20--311-01
--20---1--421-1
02--0--21-1----
---20---011-11-
---0-0-0--0-1--
---0-1302---3-4
0-------01-----

Generation = 5, Population = 111.
0-0----20-1----
4--1-33-1--2-12
3--0---3-1-000-
--101-----231--
0---1121---3--2
-10---0---20-3-
--1--2-02--2-20
---2---2000-02-
-1-213--04220-2
0-3--1-2--53202
13-0111--2---01
002----1--2--21
--0-01012-1---2
0-21---1--004--
-3-1-00--20-1-0

Generation = 6, Population = 106.
1----1-3-----20
-0-2-44-2--32-3
41---1--1-011--
-221--2---3---2
------320-3----
-2-111112031-41
--2-1-2---03031
-1-3--0--1----1
--0---00-5-31-3
1--00-1--0-4313
2--1-2221-10-12
-1----12--301-2
---01---3---1-3
-1----32--1--0-
--02-11-03-02--

Generation = 7, Population = 112.
---2220----0-3-
41---55031---14
52--12132--2-0-
---21-3--1--12-
--0-1-43-0---4-
1-022--23---0--
-0--22--22-4-42
1----1--02-----
0--21311-----0-
20--11-2-155424
3-2213-322-1--3
--2-0---01-1-2-
--0121-1-0--204
0---0--32---4--
--13-2-214013--

Generation = 8, Population = 118.
1203-3--001--4-
--0206-1421-225
--0--3-4-10-1--
12-321-1-23-232
031-----013-252
-2--3----0---41
2-----2-3---053
2--31-----01--1
--032-----23-1-
31-0221-1--6-3-
43------331--14
01---0-2-2-2132
02---2-2-11--15
-1-11134-11---4
03240---2----0-

Generation = 9, Population = 112.
2-1-240--1-0-5-
4-13-7--5-2--36
5-101---221--0-
---4---2134-34-
--2--1--1-----3
13-2-11-31--052
3--0-2----0-164
31---10-02---22
--1-3-1-05-4-2-
--3-3-2-2-57---
54221-2--421-2-
122-01-30--3--3
-301--0--2----6
0-2-22--2--0-05
14-5--1---0-3--

Generation = 10, Population = 108.
3-233513--1--6-
--2--8-16-3-247
6---2---3322---
1-25-133-4--4--
0--212---13--54
-403-22--2-1-63
-021--2--2----5
-2-3-------1-3-
0-2-43--1-25-3-
3--0----3--84--
-5--233-3532---
--3--2-412-41-4
0--222--3-1----
1-3-3334----41-
-52----224-1--0

Generation = 11, Population = 126.
-----6---120-7-
-13-095--2-3358
72---314-433100
--3----41-4---2
1-23-343124----
--143--23-3---4
31322-30330--66
-3-4-10-02-2-4-
11--54112-36143
4---3-22--595--
----344346-30-4
1---0-15----2--
130333-242---16
2141-4--211-52-
-6-502---5-----

Generation = 12, Population = 94.
-22--7--0---08-
--4-1---6--44--
8-1---2-3-44211
--4---35----4-3
--3-14----53---
--2---234--1--5
424--2-1-4--1--
3-15--1-1--30-2
--2--5-2-5--254
5--0--333---6--
---24----73-1--
2-3----61---3--
24144-0-5---2-7
--52--3---2-6--
-72---1--6--30-

Generation = 13, Population = 124.
33-3--1311---90
4-----51-2--558
---023344-55---
12-52--6---3544
-3--254-126----
1--432345--2-6-
--5-2--2--0426-
432611---204143
-1335--3--3-3--
-1-1--444159--4
----544-484--2-
3242---7--34-34
---55-126210---
216--4-42-----5
18---2222--1-10

Generation = 14, Population = 116.
-4--37-4--2----
5---1-62-3--66-
-21-3-4-546-2--
2---3137144---5
143336----732-4
---5-345--33075
--6--2-3----37-
54-7-21-13-5-54
-24----4-5--4--
52323--552-+---
5-226----953134
4---0218124---5
--1-632-7-2-21-
-27--5-53-2---6
----0--3-60--2-

Generation = 15, Population = 128.
--23-8151--009-
-143-9--6434-78
832--3------3-1
32--424-255--46
---4474-1-84-5-
142634--52-4-8-
4--22--4-404-86
6-----2-2-----5
13-355-5--36--4
-3-3-24--35+634
-5-37-4-4+64---
52--132-235--36
2-2------2--327
23-2363--1-062-
-825--2427-13--

*** Life<FredkinCell> 9x9 ***

Generation = 0, Population = 34.
--00-0--0
0----0--0
-0-0---0-
0----0000
-0---0-0-
00----0-0
00-0-0---
--00000--
----00-0-

Generation = 1, Population = 47.
0011-1001
--0-010-1
0---0--10
-0-00---1
010-01-10
-100-0-0-
--01010-0
0-111-1--
--0---0-0

Generation = 2, Population = 36.
1-220-1--
--10-2---
--0----21
01011--0-
1--------
------010
0-1-12-0-
--22-0-0-
001-001--

Generation = 3, Population = 46.
---311-0-
002-0--01
0--0000-2
--1-2001-
2-000-0-0
--0-0-121
--212-0--
--33--110
1--0112--

Generation = 4, Population = 38.
10-422-1-
--3--2---
1-01-1--3
-12-31-21
--1-11--1
01----2--
-032---0-
00-41-2-1
-0------0

Generation = 5, Population = 47.
2125----1
--40--001
-0120-0-4
-231-2-32
212-----2
1-000---1
01----0--
113-2--12
-1101-201

Generation = 6, Population = 41.
3-3-2-1-2
0051-2--2
1---111--
-3--3-043
-23011---
----10222
1-32-2---
---4302--
--2---31-

Generation = 7, Population = 36.
4145-2--3
1-62-3003
201--2---
-4------4
2-----0--
11-0----3
--4---000
1-3--1---
-1--1--21

Generation = 8, Population = 32.
--5--3--4
--7--4---
-1--13-2-
05---204-
32-0-1-1-
-20-1---4
--5---1--
-144-----
---0--332

Generation = 9, Population = 50.
-1652411-
--82--003
-2-224134
-631-3-54
-33-1202-
---0--2--
-1--22-00
125-3--12
-1-1114-3

Generation = 10, Population = 44.
4276--2--
-0-3041--
23-3-52-5
074----6-
3---231--
----10324
-2---31--
2-64-1--3
-2222-534

Generation = 11, Population = 43.
53----31-
1-84-5203
-4142--3-
185-3-0--
4-30-4-22
12-0----5
---2-4---
----322-4
-333316--

Generation = 12, Population = 39.
-4-6-----
2---063-4
2--5--24-
-96-43-64
----2-13-
-30-1---6
125325---
-264-----
14--42-34

Generation = 13, Population = 40.
-----43-4
3--41--0-
3---25--5
-+71-4-75
---0-42-2
---0--3--
2--4361-0
237-3--14
2---53-45

Generation = 14, Population = 42.
5--6-541-
4085-6--4
4-15--246
-+--4-086
-3-----33
1-0--0-2-
3---4--01
3-84-2--5
3-33-4---

Generation = 15, Population = 34.
6--7---2-
5-96-7305
5------57
-+------7
-4--24-4-
23-0----6
-2---61--
----332-6
4----56-5

Generation = 16, Population = 38.
74-825-3-
--+--8---
6-15-5--8
-+7-44-88
--3-35--3
34----3--
-354---0-
33-44-3-7
-4------6

Generation = 17, Population = 47.
8579----4
--+6--305
-4262-2-9
-+81-5-99
444-----4
4-001---6
34----1--
448-5--18
-5335-647

Generation = 18, Population = 41.
9-8-2-4-5
50+7-8--6
6---353--
-+--4-0++
-55035---
----20327
4-54-6---
---4633--
--4---75-

Generation = 19, Population = 36.
+599-5--6
6-+8-9307
742--6---
-+------+
4-----2--
44-0----8
--6---101
4-8--4---
-5--5--67

Generation = 20, Population = 32.
--+--6--7
--+--+---
-5--37-5-
1+---50+-
55-0-5-4-
-50-2---9
--7---2--
-494-----
---3--778
