*** Life<ConwayCell> 4x4 ***

Generation = 0, Population = 7.
*.*.
***.
....
*.*.

Generation = 1, Population = 6.
*.*.
*.*.
*.*.
....

Generation = 2, Population = 3.
....
*.**
....
....

Generation = 3, Population = 0.
....
....
....
....

Generation = 4, Population = 0.
....
....
....
....

Generation = 5, Population = 0.
....
....
....
....

*** Life<ConwayCell> 6x6 ***

Generation = 0, Population = 16.
***...
**.*..
.***..
***...
.***..
.*....

Generation = 1, Population = 7.
*.*...
...*..
...*..
*.....
...*..
.*....

Generation = 2, Population = 2.
......
..**..
......
......
......
......

Generation = 3, Population = 0.
......
......
......
......
......
......

Generation = 4, Population = 0.
......
......
......
......
......
......

Generation = 5, Population = 0.
......
......
......
......
......
......

*** Life<ConwayCell> 12x13 ***

Generation = 0, Population = 11.
....*..*...*.
..*..........
.*...........
.............
....*.....**.
.............
.............
.........*...
.............
.......*.....
...*.........
.............

Generation = 1, Population = 0.
.............
.............
.............
.............
.............
.............
.............
.............
.............
.............
.............
.............

Generation = 2, Population = 0.
.............
.............
.............
.............
.............
.............
.............
.............
.............
.............
.............
.............

Generation = 3, Population = 0.
.............
.............
.............
.............
.............
.............
.............
.............
.............
.............
.............
.............

Generation = 4, Population = 0.
.............
.............
.............
.............
.............
.............
.............
.............
.............
.............
.............
.............

*** Life<ConwayCell> 12x13 ***

Generation = 0, Population = 11.
*..........*.
.**..........
.............
.............
.............
*............
.............
.............
*....*.*.....
.............
.............
...*...*...*.

Generation = 1, Population = 2.
.*...........
.*...........
.............
.............
.............
.............
.............
.............
.............
.............
.............
.............

Generation = 2, Population = 0.
.............
.............
.............
.............
.............
.............
.............
.............
.............
.............
.............
.............

Generation = 3, Population = 0.
.............
.............
.............
.............
.............
.............
.............
.............
.............
.............
.............
.............

Generation = 4, Population = 0.
.............
.............
.............
.............
.............
.............
.............
.............
.............
.............
.............
.............

Generation = 5, Population = 0.
.............
.............
.............
.............
.............
.............
.............
.............
.............
.............
.............
.............

*** Life<ConwayCell> 4x4 ***

Generation = 0, Population = 6.
***.
*.*.
....
..*.

Generation = 1, Population = 5.
*.*.
*.*.
.*..
....

Generation = 2, Population = 3.
....
*.*.
.*..
....

Generation = 3, Population = 2.
....
.*..
.*..
....

*** Life<ConwayCell> 5x5 ***

Generation = 0, Population = 6.
**...
***.*
.....
.....
.....

Generation = 1, Population = 5.
*.*..
*.*..
.*...
.....
.....

Generation = 2, Population = 3.
.....
*.*..
.*...
.....
.....

Generation = 3, Population = 2.
.....
.*...
.*...
.....
.....

Generation = 4, Population = 0.
.....
.....
.....
.....
.....

*** Life<ConwayCell> 6x6 ***

Generation = 0, Population = 4.
*..**.
..*...
......
......
......
......

Generation = 1, Population = 2.
...*..
...*..
......
......
......
......

Generation = 2, Population = 0.
......
......
......
......
......
......

Generation = 3, Population = 0.
......
......
......
......
......
......

*** Life<ConwayCell> 6x6 ***

Generation = 0, Population = 4.
......
...**.
.*.*..
......
......
......

Generation = 2, Population = 6.
...*..
..*.*.
..*.*.
...*..
......
......

Generation = 4, Population = 6.
...*..
..*.*.
..*.*.
...*..
......
......

Generation = 6, Population = 6.
...*..
..*.*.
..*.*.
...*..
......
......

*** Life<ConwayCell> 12x12 ***

Generation = 0, Population = 4.
............
*...........
.*..........
..*.........
...*........
............
............
............
............
............
............
............

Generation = 1, Population = 2.
............
............
.*..........
..*.........
............
............
............
............
............
............
............
............

Generation = 2, Population = 0.
............
............
............
............
............
............
............
............
............
............
............
............

Generation = 3, Population = 0.
............
............
............
............
............
............
............
............
............
............
............
............

Generation = 4, Population = 0.
............
............
............
............
............
............
............
............
............
............
............
............

*** Life<ConwayCell> 6x7 ***

Generation = 0, Population = 3.
*......
..*....
...*...
.......
.......
.......

Generation = 1, Population = 0.
.......
.......
.......
.......
.......
.......

Generation = 2, Population = 0.
.......
.......
.......
.......
.......
.......

Generation = 3, Population = 0.
.......
.......
.......
.......
.......
.......
