*** Life<FredkinCell> 9x9 ***

Generation = 0, Population = 5.
---------
---------
---------
----0----
---0000--
---------
---------
---------
---------

Generation = 1, Population = 12.
---------
---------
----0----
----1-0--
--011-10-
---0000--
---------
---------
---------

Generation = 2, Population = 20.
---------
----0----
---0100--
--0---1--
-01220210
----1----
---0000--
---------
---------

Generation = 3, Population = 31.
----0----
----1-0--
---12--0-
--10-0--0
012-3-3-1
-000-0-00
--011-10-
---0000--
---------

Generation = 4, Population = 15.
---0100--
---------
---------
0-------1
123----1-
---------
---------
----1----
---0000--

Generation = 5, Population = 27.
--01--10-
---0100--
0-------0
1-1------
--42--3--
000----0-
----1----
----2-0--
--011-10-

*** Life<FredkinCell> 9x9 ***

Generation = 0, Population = 2.
---------
---------
---------
---------
----00---
---------
---------
---------
---------

Generation = 1, Population = 8.
---------
---------
---------
----00---
---0110--
----00---
---------
---------
---------

Generation = 2, Population = 8.
---------
---------
----00---
---------
--01--10-
---------
----00---
---------
---------

Generation = 3, Population = 32.
---------
----00---
---0110--
--000000-
-01211210
--000000-
---0110--
----00---
---------

Generation = 4, Population = 7.
----00---
---------
---------
---------
01------1
---------
---------
---------
----00---

Generation = 5, Population = 22.
---0110--
----00---
---------
00------0
121----1-
00------0
---------
----00---
---0110--

*** Life<FredkinCell> 9x9 ***

Generation = 0, Population = 5.
---------
---------
---------
---------
---------
---------
--00000--
---------
---------

Generation = 1, Population = 14.
---------
---------
---------
---------
---------
--00000--
-01---10-
--00000--
---------

Generation = 2, Population = 18.
---------
---------
---------
---------
--00000--
---------
0120-0210
---------
--00000--

Generation = 3, Population = 27.
---------
---------
---------
--00000--
-01---10-
00--0--00
1--1-1--1
00--0--00
-01---10-

Generation = 4, Population = 14.
---------
---------
--00000--
---------
---------
---------
-12---21-
---------
--20002--

Generation = 5, Population = 35.
---------
--00000--
-01---10-
--00000--
---------
-00---00-
1231-1321
-0-000-0-
-03---30-

Generation = 6, Population = 28.
--00000--
---------
0120-0210
---------
-0-000-0-
---------
2-4-0-4-2
---------
0-4-0-4-0

Generation = 7, Population = 30.
-01---10-
00--0--00
1--1-1--1
0-0-0-0-0
0--1-1--0
0000-0000
---------
---------
---------

Generation = 8, Population = 18.
--20002--
---------
---------
---------
--12021--
---------
2241-1422
---------
---------

Generation = 9, Population = 35.
-03---30-
--00000--
---------
--00000--
-02---20-
00--0--00
3--2-2--3
0000-0000
---------

Generation = 10, Population = 18.
01--0--10
---------
---------
---------
---------
---------
-2-303-2-
---------
0040-0400

*** Life<FredkinCell> 9x9 ***

Generation = 0, Population = 3.
---------
---------
---------
----0----
----0-0--
---------
---------
---------
---------

Generation = 1, Population = 10.
---------
---------
----0----
---0100--
---01--0-
----0-0--
---------
---------
---------

Generation = 2, Population = 12.
---------
----0----
----1-0--
--0---1--
--0-2-0-0
----1----
----0-0--
---------
---------

Generation = 3, Population = 29.
----0----
---0100--
--002-10-
-010-0-00
-01-3-1--
--00-0--0
---01--0-
----0-0--
---------

*** Life<FredkinCell> 9x9 ***

Generation = 0, Population = 1.
---------
---------
---------
---------
----0----
---------
---------
---------
---------

Generation = 1, Population = 4.
---------
---------
---------
----0----
---0-0---
----0----
---------
---------
---------

Generation = 2, Population = 4.
---------
---------
----0----
---------
--0---0--
---------
----0----
---------
---------

Generation = 3, Population = 16.
---------
----0----
---0-0---
--0-0-0--
-0-0-0-0-
--0-0-0--
---0-0---
----0----
---------

*** Life<FredkinCell> 9x9 ***

Generation = 0, Population = 6.
---------
-0-------
--0------
---0-----
----0----
-----0---
------0--
---------
---------

Generation = 1, Population = 4.
-0-------
0--------
---------
---------
---------
---------
-------0-
------0--
---------

Generation = 2, Population = 6.
--0------
---------
0--------
---------
---------
-------0-
--------0
-----0---
------0--

Generation = 3, Population = 12.
-0-0-----
0-0------
-0-------
0--------
-------0-
------0--
-----0---
----0---0
-------0-

Generation = 4, Population = 10.
--0-0----
---------
0--------
-------0-
0-------0
---------
--------0
---0-----
----0-0--

Generation = 5, Population = 16.
-0---0---
0-0-0----
-0-----0-
------0--
-0-------
0--------
---0---0-
--0---0-0
-------0-

*** Life<FredkinCell> 9x9 ***

Generation = 0, Population = 5.
---------
---------
---------
---0-----
--0000---
---------
---------
---------
---------

Generation = 1, Population = 12.
---------
---------
---0-----
---1-0---
-011-10--
--0000---
---------
---------
---------

Generation = 2, Population = 20.
---------
---0-----
--0100---
-0---1---
01220210-
---1-----
--0000---
---------
---------

Generation = 3, Population = 31.
---0-----
---1-0---
--12--0--
-10-0--0-
12-3-3-10
000-0-00-
-011-10--
--0000---
---------

Generation = 4, Population = 14.
--0100---
---------
---------
-------1-
-3----121
---------
---------
---1-----
--0000---

Generation = 5, Population = 29.
-01--10--
--0100---
-------0-
-1-----2-
1-2--3232
-0----000
---1-----
---2-0---
-011-10--

*** Life<FredkinCell> 9x9 ***

Generation = 0, Population = 5.
---------
---------
---0-----
----0----
-----0---
----0----
------0--
---------
---------

Generation = 1, Population = 10.
---------
---0-----
--0------
---------
----0-0--
---0--0--
----00-0-
------0--
---------

Generation = 2, Population = 16.
---0-----
----0----
-0-------
--0-0-0--
------10-
--0-0-1--
----11--0
----0----
------0--

Generation = 3, Population = 27.
--0------
-0---0---
0-----0--
------1--
-----0210
-0--102-0
--0022-0-
---01-0-0
----00-0-

Generation = 4, Population = 16.
---0-0---
----0----
------10-
0-------0
-0-------
0-------1
--11----0
----2----
-----10--

Generation = 5, Population = 29.
--0-0-0--
------00-
0---0021-
------1--
0-0------
--00---02
0022---01
--0---0-0
-----210-

*** Life<FredkinCell> 9x9 ***

Generation = 0, Population = 5.
---------
---------
---0-----
--0000---
---------
---------
---------
---------
---------

Generation = 1, Population = 12.
---------
---0-----
---1-0---
-011-10--
--0000---
---------
---------
---------
---------

Generation = 2, Population = 20.
---0-----
--0100---
-0---1---
01220210-
---1-----
--0000---
---------
---------
---------

Generation = 3, Population = 30.
---1-0---
--12--0--
-10-0--0-
12-3-3-10
000-0-00-
-011-10--
--0000---
---------
---------

Generation = 4, Population = 11.
---2-----
---------
-------1-
-3----121
---------
---------
---1-----
--0000---
---------

Generation = 5, Population = 28.
--0-0----
---2---0-
-1-----2-
1-2--3232
-0----000
---1-----
---2-0---
-011-10--
--0000---

*** Life<FredkinCell> 9x9 ***

Generation = 0, Population = 5.
---------
--0------
---------
----0----
---------
------0--
---------
--------0
--------0

Generation = 1, Population = 17.
--0------
-0-0-----
--0-0----
---0-0---
----0-0--
-----0-0-
------0-0
-------01
-------01

Generation = 2, Population = 4.
---------
0--------
---------
---------
---------
---------
--------1
--------2
------0--

Generation = 3, Population = 12.
0--------
-0-------
0--------
---------
---------
--------0
-------02
------003
-----0-01

Generation = 4, Population = 10.
---------
0-0------
---------
0--------
--------0
--------1
--------3
------1-4
----0-0--

Generation = 5, Population = 20.
0-0------
---0-----
--0------
-0------0
0------01
-------0-
------00-
----002-5
---0--101

*** Life<FredkinCell> 9x9 ***

Generation = 0, Population = 5.
---------
--0------
---------
----0----
---------
------0--
---------
--------0
--------0

Generation = 1, Population = 17.
--0------
-0-0-----
--0-0----
---0-0---
----0-0--
-----0-0-
------0-0
-------01
-------01

Generation = 2, Population = 4.
---------
0--------
---------
---------
---------
---------
--------1
--------2
------0--

Generation = 3, Population = 12.
0--------
-0-------
0--------
---------
---------
--------0
-------02
------003
-----0-01

Generation = 4, Population = 10.
---------
0-0------
---------
0--------
--------0
--------1
--------3
------1-4
----0-0--

Generation = 5, Population = 20.
0-0------
---0-----
--0------
-0------0
0------01
-------0-
------00-
----002-5
---0--101

*** Life<FredkinCell> 9x9 ***

Generation = 0, Population = 9.
---------
---------
---------
----000--
---000---
----000--
---------
---------
---------

Generation = 1, Population = 16.
---------
---------
----000--
-----110-
--01-10--
-----110-
----000--
---------
---------

Generation = 2, Population = 28.
---------
----000--
---011---
--00-2-10
-012-210-
--00-2-10
---011---
----000--
---------

Generation = 3, Population = 34.
----000--
-----110-
----22-00
---10-1-1
01-3-3-10
---10-1-1
----22-00
-----110-
----000--

Generation = 4, Population = 22.
---011---
----022--
---------
000------
12-----21
000------
---------
----022--
---011---

Generation = 5, Population = 40.
--012----
-----330-
000-220--
-111---11
231---132
-111---11
000-220--
-----330-
--012----
