*** Life<FredkinCell> 4x4 ***

Generation = 0, Population = 10.
00-0
-0-0
-000
-0-0

Generation = 1, Population = 10.
1--1
--0-
01-1
0101

Generation = 2, Population = 4.
-0--
---0
---2
-2--

Generation = 3, Population = 12.
1-01
-001
-103
0-01

Generation = 4, Population = 4.
-0--
---2
---4
-2--

Generation = 5, Population = 12.
1-01
-003
-105
0-01

*** Life<FredkinCell> 5x5 ***

Generation = 0, Population = 19.
--000
000-0
-0000
0000-
-0000

Generation = 1, Population = 13.
0----
111--
01-1-
1--10
--111

Generation = 2, Population = 14.
1-0--
222--
1-02-
2--2-
0022-

Generation = 3, Population = 11.
2010-
3-3--
-1--0
--0-0
----1

Generation = 4, Population = 12.
--210
4-4-0
--021
-----
--222

Generation = 5, Population = 7.
20---
-----
11---
-----
-03-3

*** Life<FredkinCell> 4x4 ***

Generation = 0, Population = 10.
--00
0000
-0-0
0-0-

Generation = 1, Population = 9.
0---
1111
01-1
-0--

Generation = 2, Population = 11.
1-00
22--
-202
-100

Generation = 3, Population = 9.
2011
--1-
-31-
0-1-

Generation = 4, Population = 11.
3-22
22--
-422
-120

Generation = 5, Population = 9.
4033
--1-
-53-
0-3-

Generation = 6, Population = 11.
5-44
22--
-642
-140

Generation = 7, Population = 9.
6055
--1-
-75-
0-5-

Generation = 8, Population = 11.
7-66
22--
-862
-160

Generation = 9, Population = 9.
8077
--1-
-97-
0-7-

Generation = 10, Population = 11.
9-88
22--
-+82
-180

*** Life<FredkinCell> 4x4 ***

Generation = 0, Population = 16.
0000
0000
0000
0000

Generation = 2, Population = 8.
-22-
2--2
2--2
-22-

Generation = 4, Population = 8.
-44-
4--4
4--4
-44-

Generation = 6, Population = 8.
-66-
6--6
6--6
-66-

Generation = 8, Population = 8.
-88-
8--8
8--8
-88-

Generation = 10, Population = 8.
-++-
+--+
+--+
-++-

*** Life<FredkinCell> 4x4 ***

Generation = 0, Population = 14.
--00
0000
0000
0000

Generation = 2, Population = 7.
---0
0--2
-0-2
-22-

Generation = 4, Population = 7.
---2
0--2
-2-4
-24-

*** Life<FredkinCell> 5x5 ***

Generation = 0, Population = 12.
-0-00
000--
0---0
0--00
-0---

Generation = 3, Population = 12.
1-2--
--3-0
100--
----1
1102-

Generation = 6, Population = 7.
-2--4
-----
-1--2
-----
221--

Generation = 9, Population = 12.
-26-5
0-3-0
-10-2
-----
-22-1

Generation = 12, Population = 7.
--736
-----
4--2-
-----
6--5-

Generation = 15, Population = 12.
1-83-
-----
4-02-
1-1-1
7-65-

Generation = 18, Population = 7.
-5--+
-----
-4--5
-----
857--

*** Life<FredkinCell> 6x6 ***

Generation = 0, Population = 19.
00-000
--000-
00--00
-----0
-0---0
0-000-

Generation = 3, Population = 14.
--0---
-23-3-
-1--1-
2-01-1
1--0--
-2-1--

Generation = 6, Population = 24.
3-3011
-23162
----20
3---01
401023
1--4-0

Generation = 9, Population = 20.
44----
-56--5
14--3-
4232-4
--1136
433---

Generation = 12, Population = 22.
-4-2-1
---47-
-7304-
5562--
5-443-
-34543

Generation = 15, Population = 18.
-5435-
---776
1-4--3
---54-
----37
56--56

Generation = 18, Population = 18.
--545-
0---+6
-84-6-
767-4-
8---47
---85-

*** Life<FredkinCell> 6x6 ***

Generation = 0, Population = 35.
000000
000000
00000-
000000
000000
000000

Generation = 1, Population = 15.
-1111-
1-----
1---10
1-----
1----1
-1111-

Generation = 2, Population = 18.
-2--20
2-00-0
-0-021
-0--0-
2-00--
-2--2-

Generation = 3, Population = 12.
----3-
--1---
-10-3-
-1-01-
--110-
-----0

Generation = 4, Population = 17.
--11-0
--20--
1--041
12--20
--22--
--11--

Generation = 5, Population = 12.
-2----
20-1--
2---5-
-3-0--
2----1
-2--2-

Generation = 6, Population = 13.
-311--
------
31-0-1
1----0
-0-2--
--11--

Generation = 7, Population = 19.
04-23-
2-2--0
-2---2
23--21
--2301
--2-2-

Generation = 8, Population = 15.
-5134-
3----1
33----
3----2
2-----
-2313-

Generation = 9, Population = 18.
-6--5-
4021--
440---
----2-
3-2301
-3--40

Generation = 10, Population = 10.
-7---0
--32--
-5--5-
-3--3-
-03---
------

*** Life<FredkinCell> 2x2 ***

Generation = 0, Population = 2.
00
--

Generation = 5, Population = 0.
--
--

*** Life<FredkinCell> 1x1 ***

Generation = 0, Population = 1.
0

Generation = 1, Population = 0.
-

*** Life<FredkinCell> 5x5 ***

Generation = 0, Population = 16.
0000-
0000-
-0---
0-0-0
000-0

Generation = 5, Population = 10.
0--12
-----
--02-
3-5-3
--13-

Generation = 10, Population = 13.
-4245
1-2-1
03-5-
-----
43-6-

*** Life<FredkinCell> 10x10 ***

Generation = 0, Population = 10.
0---------
----0-----
-0--------
----00----
---------0
----------
----0-----
----------
---0-----0
0---------

Generation = 1, Population = 32.
-0--0-----
00-0-0----
0-0--0----
-0-0110--0
----00--0-
----0----0
---0-0----
---00----0
0-0-0---0-
-0-0-----0

Generation = 2, Population = 30.
-10-------
--0-010---
1--0-----0
--012-10--
-0--1--0-0
----10----
--01--0---
0---------
-0--10-0-0
--0-------

Generation = 3, Population = 52.
02-0000---
0-101-10-0
-00100-00-
0-12--2-0-
0------1--
-00--1-0-0
0012---0--
--000000-0
---021----
---000-0-0
