*** Life<FredkinCell> 50x50 ***

Generation = 0, Population = 30.
--------------------------------------------------
--------------------------------------------------
--------------------------------------------------
--------------------------------------------------
---------------------------0----------------------
--------------------------------------------------
--------------------------------------------------
--------------------------------------------------
-------------------------0------------------------
------------0-------------------------------------
--------------------------------------------------
-------------0------------0-----------------------
-------------0------------------------------------
--------------------------------------------------
--------------------------------------------------
-----0--------------------------------------------
-------------0---------0--------------------------
--------------------------------------------------
--------------------------------------------------
---------------0----------------------------------
------------------------------------------------0-
--0-----------------------------------------------
-----------------------0--------------------------
--------------------------------------------------
--------------------------------------------------
----------0---------------------------------------
--------------------------------------------------
--------------------------------------------------
-0--------0-----0-----0--------------0------------
--------------------------------------------------
--------------------------------------------------
------0-------------------------------------------
--------------------------------------------------
--------------------------------------------------
--------------------------------------------------
--------------------------------------------------
----0---------------------0-----------------------
--------------------------------------------------
--------------------------------------------------
--------------------------------------------------
--------0-----------------------------------------
-----------0------------------------------------0-
--------------------------------------------------
--------------------------------------0-----------
--------------------------------------------------
----------------------------------------0---------
--------------------------------------------------
-----------0--------------------------------------
--------------------------------------------------
--------------------------------------0--------0--

Generation = 1, Population = 118.
--------------------------------------------------
--------------------------------------------------
--------------------------------------------------
---------------------------0----------------------
--------------------------0-0---------------------
---------------------------0----------------------
--------------------------------------------------
-------------------------0------------------------
------------0-----------0-0-----------------------
-----------0-0-----------0------------------------
------------00------------0-----------------------
------------010----------0-0----------------------
------------010-----------0-----------------------
-------------0------------------------------------
-----0--------------------------------------------
----0-0------0---------0--------------------------
-----0------0-0-------0-0-------------------------
-------------0---------0--------------------------
---------------0----------------------------------
--------------0-0-------------------------------0-
--0------------0-------------------------------0-0
-0-0-------------------0------------------------0-
--0-------------------0-0-------------------------
-----------------------0--------------------------
----------0---------------------------------------
---------0-0--------------------------------------
----------0---------------------------------------
-0--------0-----0-----0--------------0------------
0-0------0-0---0-0---0-0------------0-0-----------
-0--------0-----0-----0--------------0------------
------0-------------------------------------------
-----0-0------------------------------------------
------0-------------------------------------------
--------------------------------------------------
--------------------------------------------------
----0---------------------0-----------------------
---0-0-------------------0-0----------------------
----0---------------------0-----------------------
--------------------------------------------------
--------0-----------------------------------------
-------0-0-0------------------------------------0-
--------0-0-0----------------------------------0-0
-----------0--------------------------0---------0-
-------------------------------------0-0----------
--------------------------------------0-0---------
---------------------------------------0-0--------
-----------0----------------------------0---------
----------0-0-------------------------------------
-----------0--------------------------0--------0--
-------------------------------------0-0------0-0-

Generation = 2, Population = 111.
--------------------------------------------------
--------------------------------------------------
---------------------------0----------------------
--------------------------------------------------
-------------------------0---0--------------------
--------------------------------------------------
-------------------------0-0----------------------
------------0-------------------------------------
-----------------------0---0----------------------
----------0--10-----------0-----------------------
-------------1-----------0------------------------
-----------01--0--------0---0---------------------
-----------0---0----------------------------------
-----0-------1------------0-----------------------
-----------------------0--------------------------
---0---0------------------------------------------
-----------0---0-----0---0------------------------
-----0---------0----------------------------------
-------------0---------0------------------------0-
--0----------0---0--------------------------------
-----------------------0----------------------0---
0---0----------0----------------------------------
---------------------0---0----------------------0-
--0-------0---------------------------------------
-----------------------0--------------------------
--------0---0-------------------------------------
-0--------1-----0-----0--------------0------------
----------1---------------------------------------
---0----0---0-0---0-0---0----------0---0----------
------0-------------------------------------------
-0--------0-----0-----0--------------0------------
----0---0-----------------------------------------
--------------------------------------------------
------0-------------------------------------------
----0---------------------0-----------------------
--------------------------------------------------
--0---0-----------------0---0---------------------
--------------------------------------------------
----0---0-----------------0-----------------------
-----------0------------------------------------0-
------0---0---------------------------------------
---------0---0------------------------0-------0---
--------0-----------------------------------------
-----------0------------------------0-----------0-
--------------------------------------------------
-----------0------------------------------0-------
--------------------------------------------------
---------0---0------------------------0-0------0--
--------------------------------------------------
-----------0------------------------0-0-0----0-0-0

Generation = 3, Population = 369.
--------------------------------------------------
---------------------------0----------------------
--------------------------0-0---------------------
-------------------------0-0-0--------------------
------------------------0-0-0-0-------------------
---------------------------0-0--------------------
------------0-----------0---0---------------------
-----------0-0---------0-0------------------------
----------0-000-------0-0---0---------------------
---------0-00-10-------0--------------------------
----------00-2-0------------0---------------------
----------0-2-010------0---0-0--------------------
-----0----01-1010-------0-0-0---------------------
----0-0----00-00-------0-0-0----------------------
---0-0-0-----0--------0-0-0-----------------------
--0-0-0-0--0---0-----0-0-0------------------------
---0-0-0--0-0-010---0-0-0-0-----------------------
----0-0----0-0010----0-0-0----------------------0-
--0--0------0100-0----0-0----------------------0-0
-0-0--------010-0-0---------------------------0-0-
0-0-0--------0-0-0----0-0--------------------0-0--
-0-0-0--------0-0----0-0-0--------------------0-0-
0-0-0-----0----0----0-0-0-0--------------------0-0
-0-0-----0-0---------0-0-0----------------------0-
--0-----0-0-0---------0-0-------------------------
-0-----0-000-0--0-----00-------------0------------
0-0-----00200--0-0---0-0------------0-0-----------
-0-0----00200-0-0-0-0-0-0----------0-0-0----------
--0-0-00-000---0-0---0-0-0--------0-0-0-0---------
-0-0-0-00-0-0-0-0-0-0-0-0----------0-0-0----------
0-0-0-0-00-0---0-0---0-0------------0-0-----------
-0-0-0-0-00-----0-----0--------------0------------
----0-0-0-----------------------------------------
----00-0------------------0-----------------------
---0-00------------------0-0----------------------
--0-0-0-----------------0-0-0---------------------
-0-0-0-0---------------0-0-0-0--------------------
--0-0-0-0---------------0-0-0---------------------
---0-0-0-0-0-------------0-0--------------------0-
----0-0-0---0-------------0--------------------0-0
-----0-0-----0------------------------0-------0-0-
------0-----0-0----------------------0-0-----0-0--
-------0---0-0----------------------0-0-------0-0-
--------0-0-0----------------------0-0---------0-0
------------------------------------0-----0-----0-
----------0-0----------------------------0-0------
---------0-0-0------------------------0-0-0----0--
--------0-0-0-0----------------------0---0----0-0-
---------0-0-0----------------------0--------0---0
----------0-0----------------------0-----0--0-----

Generation = 4, Population = 114.
---------------------------0----------------------
--------------------------------------------------
--------------------------------------------------
--------------------------------------------------
-----------------------0-0-----0------------------
------------0-------------------------------------
--------------------------------------------------
-------------1------------0-----------------------
-------------1-------0-----0-0--------------------
--------0-------0---------------------------------
--------------------------------------------------
-----0---0-------0----0-------0-------------------
---------0---2---0-----0-0------------------------
------------1-------------------------------------
--------------------------------------------------
-0-------0---0-1----------0-----------------------
---------0---0---0-0-------0--------------------0-
--0-----------------------------------------------
-----------------------0--------------------------
-----0-----0-------0------------------------------
-------------1---------0--------------------0---0-
0-----0---0---------------------------------------
-------------------0-------0----------------------
---------------0----------------------------------
-0--------1-----0-----1--------------0----------0-
--0---0-------0-----------------------------------
-----------------------1--------------------------
------0-------------------------------------------
-0---01-----0-0---0-0-----0------0-------0--------
----------1---------------------------------------
--------------------------------------------------
--0-------1---------------------------------------
-0--1-----0-----0-----0---0----------0------------
--------------------------------------------------
--------------------------------------------------
------1-------------------------------------------
0---------------------0-------0-------------------
-----------0------------------------------------0-
--------------------------------------------------
--------------------------------------0-----------
------------0-------------0-----------------------
-------0-------0------------------------0---0---0-
--------------------------------------------------
-----------0----------------------0-------0-------
--------0-----------------------------------------
-----------0------------------------0-0-----0--00-
--------------------------------------------------
-------0-------0-------------------------------0--
--------------------------------------------------
-----------0----------------------0-----0-00-----0

Generation = 5, Population = 386.
--------------------------0-0---------------------
---------------------------0----------------------
--------------------------------------------------
-----------------------0-0-----0------------------
------------0---------0---0---0-0-----------------
-----------0-0---------0-0-----0------------------
------------00------------0-----------------------
------------020------0---0---0--------------------
--------0---020-0---0-0-------0-------------------
-------0-0---1-0-0---0-----0-0--------------------
-----0--00------00----0-------0-------------------
----0-0-010--1--010--0---0---0-0------------------
-----0--010---0-010-------0---0-------------------
---------0-0-----0-----0-0------------------------
-0-------0--00-0----------0-----------------------
0-0-----010-01--00-0-----0----------------------0-
-00-----010-01010---0-------0------------------0-0
-0-0-----0---0---0-0---0---0--------------------0-
--0--0-----0-------0--0-0-------------------------
----0-0---0-01----0-0-----------------------0---0-
0----00---000-0----0--0-0------------------0-0-0-0
-0---0-0-0-0-0-----0---0---0----------------0---0-
0-----0---0----0--0-0-----0-0---------------------
-0--------0---0----0--0----0---------0----------0-
0-----0--0-0--0--0---0-0------------0-0--------0-0
---0-0-0--0--0-00-----00-------------0----------0-
--0-----------0-------0-0-------------------------
-0----10----0-0---0-0--0--0------0-------0--------
0-0-01-0--00---0-0---0---0-0----0-0-----0-0-------
-0---00--0-00-0---0-0-----0------0-------0--------
--0-----------------------------------------------
---00----020----0-----0---0----------0------------
0--0-0---010---0-0---0-0-0-0--------0-0-----------
-0--0-----0-----0-----0---0----------0------------
------0-------------------------------------------
0----0-0--------------0-------0-------------------
-0----0----0---------0-0-----0-0----------------0-
0---------0-0---------0-------0----------------0-0
-----------0--------------------------0---------0-
------------0-------------0----------0-0----------
-------0---0-0-0---------0-0----------0-0---0---0-
------0-0---0-0-0---------0------------0-0-0-0-0-0
-------0---0---0------------------0-----0-0-0---0-
--------0-0-0--------------------0-0-----0-0------
-------0-0------------------------0-0-0---0-0--00-
--------0-0-0----------------------0---0---0-00110
-------0---0---0--------------------0-0-----0---0-
------0-0-----0-0-----------------------------0-0-
-------0---0---0------------------0-----0-00---0-0
----------0-0--------------------0-0---0--110---0-

Generation = 6, Population = 360.
-------------------------0-0-0--------------------
--------------------------------------------------
-----------------------0-0-0---0------------------
------------0-------------------------------------
---------------------0-0-0-0-0---0----------------
----------0--10-----------0-----------------------
-------------1-------0-0-0-0-0-0------------------
--------0--01--00-------0---0---------------------
-----------0---0---0---0-0-0-0-0------------------
-----00--10--21--10---0---0---0-------------------
---------1-------1---0-0-0-0-0--------------------
---0----1--02--11--00---0---0---0-----------------
-------0-----------0-0-0-0-0----------------------
-0---0----0--100-1----0---0---0-------------------
-------------------0---0-0-0--------------------0-
--10---0----12-1-1------0---0---------------------
-------0---------0-0-0-0-0---0----------------0---
01--00---1-0-1-1---1------0-----------------------
---------0-------0-1-0-0-0-0----------------0-----
0-00--10-01--2---0---0----------------------------
-----------1---0---1-0-0-0-0--------------0-------
0-0-01-----10--0---1------------------------------
-0--------1--0--00---000-0---0-------0------0-----
0-0-------1--01--0--------------------------------
---0----0---0-1---000--10--0-------0---0------0---
0-----0-0---0--11---------------------------------
-----00---2-0-1-0-0-001--00------0---0---0------0-
--0-0-2-0-2---1-----------------------------------
----1--10-1-0-0---0-0-000---0--0---0---0---0------
--0---1-0-1-1-------------------------------------
----000---0-0-0-0-0-0-0----------0---0---0--------
0---1---0-3-0-------------------------------------
--01--0-0---0-0---0-0-------0------0---0----------
--0---0---1---------------------------------------
00--0-----0-----0---------0---0------0------------
----0---0--0------------------------------------0-
0-0-----------------0---0---0---0-----------------
------0--0---0------------------------0-------0---
0-----------0---------0---0---0-------------------
-------0---0---0--------------------0-------0-----
----------0---0---------0---0---------------------
-----0---0-0-0---0----------------0-------0-------
--------0---0-------------0-----------------------
-------0-0-0-0-0----------------0-----0-----0--0--
------0---0---------------------------------------
-------0-0-0-0-0--------------------0-0-0----1-2-1
--------0-----------------------------------------
-----0---0---0---0----------------0-0-0-0-0000-01-
--------------------------------------------------
-------0-0-0-0-0----------------0-0-0-0--0-210----

Generation = 7, Population = 752.
------------------------0-----0-------------------
-----------------------0-----0-0------------------
------------0---------0-----0-0-0-----------------
-----------0-0-------0-------0-0-0----------------
----------0-000-----0-----0---0-0-0---------------
---------0-00-10---------0-0---0-0----------------
--------0-00-2-00---0---0-0-0---0-----------------
-------0-00-2-0-10-0-0-0-0-0-0--------------------
-----00-00-1-2-1-0--0---0-0-0-0-0-----------------
----01100-1-032-0-1----0-0-0-0--------------------
---0-00--2-00200-2-0--0-0-0-0---0-----------------
--0-0-----0131022-0-10-0-0-0---0-0----------------
-0-0-00---01020-01010-0-0-0---0-0-----------------
0-0-0-00-0-012-1--0----0-0-0-0-0----------------0-
-000-0-0--0-0-0---0-0---0-0---0----------------0-0
-0210-010--023---20--0-0-0--------------------0-0-
0000000101-00---01-1----0-----0--------------0-0--
1200110002------0-0-0----0---0--------------0-0---
-00000000--0---001-2-1----0-0--------------0-0----
--110021--2-0-00010-0-0-------------------0-0-----
---00000-0-2-1010002-1------0------------0-0------
-0--120-----1-01-0020-0----0-0-------0----0-0-----
0-0-00---02--1--1-0001-1--0-0-0-----0-0----0-0----
-0------0020---0-1-0000-00-0-0-----0-0-0----0-0---
----0-001010102-0-1-1012100-0-----0-0-0-0----0-0--
-0-0--1-1000-002-0-0-0000000-----0-0-0-0-0----0-0-
0-0--110-03-1-201---1-210110----0-0-0-0-0-0----0-0
-0--10301--0-0-00----0-0000-0--0-0-0-0-0-0-0----0-
---021121---1-10-0----1-10-0-00-0-0-0-0-0-0-0-----
-0-0--201----0--0------00---0--0-0-0-0-0-0-0------
0-00---0-0-------------0--------0-0-0-0-0-0-------
-00-2--01-4--0--0-----0-----0----0-0-0-0-0--------
00-2-01-10-01--0-0---0-----0-0----0-0-0-0---------
0-1-001000200-0-0-0-0-----0-0-0----0-0-0----------
11-0100-001----0-0-------0-0-0-0----0-0---------0-
-00010-0-0--0---0---0---0-0-0-0-0----0---------0-0
---00-0-00-0-0-----0-0-0-0-0-0-0-0----0-------0-0-
--0--0-00-0---0-----0-0-0-0-0-0-0----0-0-----0-0--
-0----00-0-----0-----0-0-0-0-0-0----0-0-----0-0---
0-----0-0-------0-----0-0-0-0-0----0-0-----0-0----
-----0-0---0-----0-----0-0-0-0----0-0-----0-0-----
----0-0---0-0---0-0-----0-0-0----0-0-----0-0------
-----0---0-0-0-0-0-------0-0----0-0---0---0-0--0--
--------0-0-0---0---------0----0-0---0-0---0-00-0-
-----0-0-0-0--------------------0---0---0---00---0
--------0-0-----0------------------0-----0--0-----
-----0---0-0---0-0----------------0-------000---00
----0-0---0-0-0-0-0--------------0--------1--1-120
-----0-0---0---0-0--------------0-------000----00-
------0---------0--------------0-------00--3-10---

Generation = 8, Population = 120.
-------------------------0------------------------
------------0-------------------------------------
---------------------------0----------------------
-------------1------------0-----------------------
-------------1-----0---------------0--------------
--------------------------------------------------
--------------------------------------------------
-----0--------------------------------------------
-------------3---1-----0---------0----------------
----1---------------0-----------------------------
--------------------------------------------------
-----0---------3--1--1------------0---------------
-----1---------------0-----0--------------------0-
--1-----------------------------------------------
-----------------------0--------------------------
-1-----------4------------------------------------
-----1---------1-----0---0-----0------------------
----------0-0-------------------------------------
--------------------------------------------------
-------2-----2---------0--0-----------------------
-0--------0--2--1-----0--------------0--0---0-----
----2-----0---------------------------------------
---------------0---------------0------------------
-----00-------------------------------------------
-------------1---------3--------------------------
--0---------------0-------------------------------
--------------------------------------------------
---------------1----------------------------------
--0-32--20----2---0-----2-0--11--------------0--0-
--0-----------------------------------------------
-----------------------1--------------------------
0-------------0-----------------------------------
--------2-----------------------------------------
----------31------------------------------------0-
--------------------------------------------------
--------------------------------------0-----------
-00-------0-0---0-0---0-----------0--0------------
----------------------------------------0---------
--------------------------------------------------
------1----0--------------------------------------
0---------------0---------------------------------
---0---------------0------------------0-0---0--0--
--------------------------------------------------
------------------------------0-------0-------10--
----0---------------------0-----------------------
-----------0--------------------0---------------1-
--------------------------------------------------
---0---------------0--------------------0---------
--------0-----------------------------------------
-----------0------------------0-------01-----21-0-

Generation = 9, Population = 436.
------------0-----------0-0-----------------------
-----------0-0-----------0-0----------------------
------------00--------------0---------------------
------------020----0-----0---------0--------------
------------020---0-0-----0-------0-0-------------
-------------1-----0---------------0--------------
-----0--------------------------------------------
----0-0------2---0-----0---------0----------------
----00------0-0-0-0-0-0-0-------0-0---------------
---0-1-------3---1-0-0-0---------0----------------
----00---------0--0-00------------0---------------
----010-------0-21-0120----0-----0-0------------0-
--0-020--------1--0-010---0-0-----0------------0-0
-0-0-0---------------0-0---0--------------------0-
-00----------0--------0-0-------------------------
0-2--0------2-01-----0-0-0-----0------------------
-0--0-0---0-010-0---0-0-0-0---0-0-----------------
-----1---2---1-1-----0---0-----0------------------
-------0--0-01---------0--0-----------------------
-0----2-0-2-030-0-------00-0---------0--0---0-----
0-0-0--0-0120301-0---1----0---------0-00-0-0-0----
-0-0-2---011-0-10-----0--------0-----0--0---0-----
----000---2---0-1-------------0-0-----------------
----0110-----0-0-------0-------0------------------
--0--00-----1-2---1---1-1-------------------------
-0-0---------0---0-0---0--------------------------
--0------------0--0-------------------------------
--0-10--10------0-0-----0-0--00--------------0--0-
-01-4312311--0---0-0---0---00220------------0-00-0
-01000--10----0---0----00-0--00--------------0--0-
0-0-----------0-------0-0-------------------------
-0------1----0-0-------0--------------------------
0------0-010--0---------------------------------0-
--------00420----------------------------------0-0
----------10--------------------------0---------0-
-00-------0-0---0-0---0-----------0----0----------
0110-----0---0-0---0-0-0---------0-00---0---------
-00-------0-0---0-0---0-----------0--0-0-0--------
------0----0----------------------------0---------
0----0-0--0-0---0---------------------------------
-0-0--0----0---0-0-0------------------0-0---0--0--
0-0-0-----------0-0-0----------------0---0-0-00-0-
---0---------------0----------0---------0---0-0---
----0---------------------0--0-0-----0-0-----0210-
---0-0-----0-------------0-0--0-0-----0-------000-
----0-----0-0-------------0----0-0-------------2-1
---0-------0-------0------------0-------0-------0-
--0-0---0---------0-0------------------0-0--------
---0---0-0-0-------0----------0-------000----00-0-
--------0-0-0----------------0-0-----0120---132--0

Generation = 10, Population = 372.
-----------------------0-0------------------------
----------0--10-----------0-----------------------
-------------1-----0---------0-----0--------------
-----------01--0--------0---0---------------------
-----------0---0-0---0-----0-----0---0------------
-----0-------2------------0-----------------------
-----------------0-0---0---------0-0--------------
---01--0------------0-----------------------------
-----------1-------0-0---0-----0---0--------------
--0---1--------0-----10-----------0---------------
-----1-------2---2---1-0---0-----0--------------0-
--001--0-----1--32-1---0--------0---0-------------
---0---0-----------1-----0---0----------------0---
01--01-------2-1--0--1------------0---------------
---------------0-----0-----0---0----------------0-
--31------003--2----------------------------------
---0---1-----2---1-1---0---0-0---0----------------
-2-----00-0-0-0--------0--0-----------------------
-0---0----1--2-00----10--0-----0-----0--0---0-----
----00---0-01--0-----0--11--0---------------------
---0----0--31-1---0-0---0------0---0--11------0---
--0--3-00---11---------0--0-----------------------
-0--------3--1--20----01-----0---0---0--0---0-----
--00---10-2-------0-------------------------------
-----------0---------0---0-----0------------------
0---001--------21---0-----------------------------
--1-01--00---02---1----10-1--00--------------0--0-
-------------0---01-------------------------------
0-205-----201-------0-112-01---10----------0--11--
----1---------10----------------------------------
--1-00---0----1---0--0--100--00--------------0--0-
0---------400---0-------------------------------0-
------1---2------------0--------------------------
0-------11--100-----------------------0-------0---
-10-----0-2-0---0-0---0-----------0--0------------
----------10------------------------0-----------0-
1--10---0-0-0---0-0-----0-------0--11--0----------
------0----0------------------------------0-------
000-------0-0-----0---0-----------0--0------------
---00---00---0-----0------------------0-----0--0--
0-0-----------0---0-------------------------------
-0---00----0-----0---0--------0-----0---0----1-0-0
0---0-----------0---------0-----------------------
---0-------0-------0--------0-------0-0------1-2-0
--0---0-----------------0---0---------------------
---0-----0---0-----0--------------0---0-0------3--
----0---0-----------------0-----------------------
-0---0-----------0---0--------0-0------1--1--10---
------0---0---------------------------------------
---0-----0-0-0-----0--------0-0-0---0123-0-324-0--

*** Life<FredkinCell> 5x5 ***

Generation = 0, Population = 4.
0----
-0---
--0--
---0-
-----

Generation = 1, Population = 2.
-----
-----
-----
----0
---0-

Generation = 2, Population = 2.
-----
-----
----0
-----
--0--

Generation = 3, Population = 6.
-----
----0
---0-
--0-0
-0-0-

*** Life<FredkinCell> 3x3 ***

Generation = 0, Population = 1.
0--
---
---

Generation = 5, Population = 0.
---
---
---

*** Life<FredkinCell> 50x50 ***

Generation = 0, Population = 15.
--------------------------------------------------
--------------------------------------------------
--------------------------------------------------
----------------------------0---------------------
--------------------------------------------------
--------------------------------------------------
---------------------------------------------0----
--------------------------------------------------
--------------------------------------------------
--------------------------------------------------
--------------------------------------------------
--------------------------------------0-----------
--------------------------------------------------
--------------------------------------------------
--------------------------------------------------
--------------------------------------------------
------------------0-------------------------------
--------------------------------------------------
--------------------------------------------------
--------------------------------------------------
--------------------------------------------------
--------------------------------------------------
--------------------------------------------------
--------------------------------------------------
--------------------------------------------------
------------------------------0-------------------
--------------------------------------------------
--------------------------------------------------
--0-----------------------------------------------
--------------------------------------------------
--------------------------------------------------
---------------0----------------------------------
--------------------------------------------------
--------------------------------------------------
--------------------------------------------------
--------------------------------------------------
---0----------------------------------------------
--------------------------------------------------
--------------------------------------------------
-----------------------------------------------0--
--------------------------------------------------
--------------------------------------------------
--------0-----------------------------------------
-----------------------------------------0--------
--0-----------------------------------------------
--------------------------------------------------
-----------------------------------0--------------
------------------------0-------------------------
------------0-------------------------------------
--------------------------------------------------

Generation = 1, Population = 60.
--------------------------------------------------
--------------------------------------------------
----------------------------0---------------------
---------------------------0-0--------------------
----------------------------0---------------------
---------------------------------------------0----
--------------------------------------------0-0---
---------------------------------------------0----
--------------------------------------------------
--------------------------------------------------
--------------------------------------0-----------
-------------------------------------0-0----------
--------------------------------------0-----------
--------------------------------------------------
--------------------------------------------------
------------------0-------------------------------
-----------------0-0------------------------------
------------------0-------------------------------
--------------------------------------------------
--------------------------------------------------
--------------------------------------------------
--------------------------------------------------
--------------------------------------------------
--------------------------------------------------
------------------------------0-------------------
-----------------------------0-0------------------
------------------------------0-------------------
--0-----------------------------------------------
-0-0----------------------------------------------
--0-----------------------------------------------
---------------0----------------------------------
--------------0-0---------------------------------
---------------0----------------------------------
--------------------------------------------------
--------------------------------------------------
---0----------------------------------------------
--0-0---------------------------------------------
---0----------------------------------------------
-----------------------------------------------0--
----------------------------------------------0-0-
-----------------------------------------------0--
--------0-----------------------------------------
-------0-0-------------------------------0--------
--0-----0-------------------------------0-0-------
-0-0-------------------------------------0--------
--0--------------------------------0--------------
------------------------0---------0-0-------------
------------0----------0-0---------0--------------
-----------0-0----------0-------------------------
------------0-------------------------------------

Generation = 2, Population = 59.
--------------------------------------------------
----------------------------0---------------------
--------------------------------------------------
--------------------------0---0-------------------
---------------------------------------------0----
----------------------------0---------------------
-------------------------------------------0---0--
--------------------------------------------------
---------------------------------------------0----
--------------------------------------0-----------
--------------------------------------------------
------------------------------------0---0---------
--------------------------------------------------
--------------------------------------0-----------
------------------0-------------------------------
--------------------------------------------------
----------------0---0-----------------------------
--------------------------------------------------
------------------0-------------------------------
--------------------------------------------------
--------------------------------------------------
--------------------------------------------------
--------------------------------------------------
------------------------------0-------------------
--------------------------------------------------
----------------------------0---0-----------------
--0-----------------------------------------------
------------------------------0-------------------
0---0---------------------------------------------
---------------0----------------------------------
--0-----------------------------------------------
-------------0---0--------------------------------
--------------------------------------------------
---------------0----------------------------------
---0----------------------------------------------
--------------------------------------------------
-0---0--------------------------------------------
-----------------------------------------------0--
---0----------------------------------------------
---------------------------------------------0---0
--------0-----------------------------------------
-----------------------------------------0-----0--
--0---0---0---------------------------------------
---------------------------------------0---0------
0---0---0--------------------------0--------------
------------------------0----------------0--------
--0---------0--------------------0---0------------
----------------------0---0-----------------------
----------0---0--------------------0--------------
------------------------0-------------------------

Generation = 3, Population = 232.
----------------------------0---------------------
---------------------------0-0--------------------
--------------------------0-0-0-------------------
-------------------------0-0-0-0-------------0----
--------------------------0-0-0-------------0-0---
---------------------------0-0-------------0-0-0--
----------------------------0-------------0-0-0-0-
-------------------------------------------0-0-0--
--------------------------------------0-----0-0---
-------------------------------------0-0-----0----
------------------------------------0-0-0---------
-----------------------------------0-0-0-0--------
------------------------------------0-0-0---------
------------------0------------------0-0----------
-----------------0-0------------------0-----------
----------------0-0-0-----------------------------
---------------0-0-0-0----------------------------
----------------0-0-0-----------------------------
-----------------0-0------------------------------
------------------0-------------------------------
--------------------------------------------------
--------------------------------------------------
------------------------------0-------------------
-----------------------------0-0------------------
----------------------------0-0-0-----------------
--0------------------------0-0-0-0----------------
-0-0------------------------0-0-0-----------------
0-0-0------------------------0-0------------------
-0-0-0---------0--------------0-------------------
0-0-0---------0-0---------------------------------
-0-0---------0-0-0--------------------------------
--0---------0-0-0-0-------------------------------
-------------0-0-0--------------------------------
---0----------0-0---------------------------------
--0-0----------0----------------------------------
-0-0-0--------------------------------------------
0-0-0-0----------------------------------------0--
-0-0-0----------------------------------------0-0-
--0-0----------------------------------------0-0-0
---0----0-----------------------------------0-0-0-
-------0-0-------------------------------0---0-0-0
--0---0-0-0-----------------------------0-0---0-0-
-0-0-0-0-0-0---------------------------0-0-0---0--
0-0-0-0-0-0------------------------0--0-0-0-0-----
-0-0-0-0-0--------------0---------0-0--0-0-0------
0-0-0---0---0----------0-0-------0-0-0--0-0-------
-0-0-------0-0--------0-0-0-----0-0-0-0--0--------
--0-------0-0-0------0-0-0-0-----0-0-0------------
---------0-0-0-0------0-0-0-------0-0-------------
----------0---0--------0-0---------0--------------

Generation = 4, Population = 57.
--------------------------------------------------
--------------------------------------------------
---------------------------------------------0----
------------------------0-------0-----------------
--------------------------------------------------
--------------------------------------------------
-----------------------------------------0-------0
----------------------------0---------0-----------
--------------------------------------------------
--------------------------------------------------
---------------------------------------------0----
----------------------------------0-------0-------
------------------0-------------------------------
--------------------------------------------------
--------------------------------------------------
--------------------------------------0-----------
--------------0-------0---------------------------
--------------------------------------------------
--------------------------------------------------
--------------------------------------------------
------------------0-------------------------------
------------------------------0-------------------
--------------------------------------------------
--------------------------------------------------
--0-----------------------------------------------
--------------------------0-------0---------------
--------------------------------------------------
---------------0----------------------------------
0-----0-------------------------------------------
------------------------------0-------------------
--------------------------------------------------
-----------0-------0------------------------------
--00----------------------------------------------
--------------------------------------------------
--------------------------------------------------
---------------0-------------------------------0--
-------0------------------------------------------
--------------------------------------------------
--------0-----------------------------------------
-----------------------------------------0-0-----0
--00----------------------------------------------
--------------------------------------------------
----0-------0----------------------0--------------
------------------------0------------0-------0-0--
0-----0-----0-------------------------------------
--------------------------------------------------
--------0----------------------0-------0----------
--------------------0-------0------------0--------
--0-----0---0---0---------------------------------
------------------------0-------------------------

Generation = 5, Population = 215.
--------------------------------------------------
---------------------------------------------0----
------------------------0-------0-----------0-0---
-----------------------0-0-----0-0-----------0----
------------------------0-------0-----------------
-----------------------------------------0-------0
----------------------------0---------0-0-0-----0-
---------------------------0-0-------0-0-0-------0
----------------------------0---------0-----------
---------------------------------------------0----
----------------------------------0-------0-0-0---
------------------0--------------0-0-----0-0-0----
-----------------0-0--------------0-------0-------
------------------0-------------------------------
--------------------------------------0-----------
--------------0-------0--------------0-0----------
-------------0-0-----0-0--------------0-----------
--------------0-------0---------------------------
--------------------------------------------------
------------------0-------------------------------
-----------------0-0----------0-------------------
------------------0----------0-0------------------
------------------------------0-------------------
--0-----------------------------------------------
-0-0----------------------0-------0---------------
--0----------------------0-0-----0-0--------------
---------------0----------0-------0---------------
0-----0-------0-0---------------------------------
-0---0-0-------0--------------0-------------------
0-----0----------------------0-0------------------
-----------0-------0----------0-------------------
--00------0-0-----0-0-----------------------------
-0110------0-------0------------------------------
--00----------------------------------------------
---------------0-------------------------------0--
-------0------0-0-----------------------------0-0-
------0-0------0-------------------------------0--
-------00-----------------------------------------
-------0-0-------------------------------0-0-----0
--00----0-------------------------------0---0---0-
-0110------------------------------------0-0-----0
--000-------0----------------------0--------------
---0-0-----0-0----------0---------0-00-------0-0--
0---0-0----------------0-0---------00-0-----0---0-
-0---0-0---0-0----------0------------0-------0-0--
0-----0-0---0------------------0-------0----------
-------0-0----------0-------0-0-0-----0-00--------
--0---------0---0--0-0-----0-0-0-------00-0-------
-0-0---0-0-0-0-0-0--0---0---0------------0--------
--0-----0---0---0------0-0------------------------

Generation = 6, Population = 206.
---------------------------------------------0----
------------------------0-------0-----------------
-------------------------------------------0---0--
----------------------0---0---0---0---------------
-----------------------------------------0---0---0
------------------------0---0---0-----0-----------
---------------------------------------0---0---0-0
--------------------------0---0-----0---0---------
-----------------------------------------0---0---0
----------------------------0-----0---0---0-------
------------------0------------------------0---0--
--------------------------------0---0---0---0-----
----------------0---0------------------------0----
----------------------------------0---0---0-------
--------------0---0---0---------------------------
------------------------------------0---0---------
------------0---0---0---0-------------------------
--------------------------------------0-----------
--------------0---0---0---------------------------
------------------------------0-------------------
----------------0---0-----------------------------
----------------------------0---0-----------------
--0---------------0-------------------------------
--------------------------0---0---0---------------
0---0---------------------------------------------
---------------0--------0---0---0---0-------------
0-0---0-------------------------------------------
-------------0---0--------0---0---0---------------
0-0-0---0-----------------------------------------
-----------0---0---0--------0---0-----------------
0-00--0-------------------------------------------
---------0---0---0---0--------0-------------------
01--10--------------------------------------------
-----------0---0---0---------------------------0--
--00---0------------------------------------------
-------------0---0---------------------------0---0
-----0--10----------------------------------------
---------------0-------------------------0-0---0-0
--00--01--0---------------------------------------
---------------------------------------0-0-0-0-0-0
01---0--0---0----------------------0--------------
------------------------0------------0---0-0-0-0-0
0--1------0-0-0------------------0---1------------
----------------------0---0--------1---0---0-0-0-0
0-0-------0-0-0----------------0---0---0----------
--------------------0---0---0--------0---0---0-0--
0-0-----0-0-----0------------0---0---0---1--------
------------------0---0-0-0---0--------1---0------
0---0-0-0---------0------------0-------0----------
--------------------0-0-0-0-0------------0--------

*** Life<FredkinCell> 6x6 ***

Generation = 0, Population = 4.
0----0
------
------
------
------
0----0

Generation = 1, Population = 8.
-0--0-
0----0
------
------
0----0
-0--0-

Generation = 2, Population = 8.
--00--
------
0----0
0----0
------
--00--

Generation = 3, Population = 24.
-0110-
0-00-0
10--01
10--01
0-00-0
-0110-

Generation = 4, Population = 16.
-1221-
1----1
2----2
2----2
1----1
-1221-

*** Life<FredkinCell> 4x4 ***

Generation = 0, Population = 16.
0000
0000
0000
0000

Generation = 5, Population = 8.
-55-
5--5
5--5
-55-

Generation = 10, Population = 8.
-++-
+--+
+--+
-++-

*** Life<FredkinCell> 6x6 ***

Generation = 0, Population = 16.
-0000-
0----0
0----0
0----0
0----0
-0000-

Generation = 1, Population = 16.
-1--1-
1-00-1
-0--0-
-0--0-
1-00-1
-1--1-

Generation = 2, Population = 8.
------
--11--
-1--1-
-1--1-
--11--
------

Generation = 3, Population = 16.
--00--
--22--
02--20
02--20
--22--
--00--

Generation = 4, Population = 8.
-1--1-
1----1
------
------
1----1
-1--1-

*** Life<FredkinCell> 5x5 ***

Generation = 0, Population = 9.
-----
-000-
-000-
-000-
-----

Generation = 1, Population = 16.
-000-
0-1-0
01-10
0-1-0
-000-

Generation = 2, Population = 16.
-111-
1-2-1
12-21
1-2-1
-111-

Generation = 3, Population = 16.
-222-
2-3-2
23-32
2-3-2
-222-

Generation = 4, Population = 16.
-333-
3-4-3
34-43
3-4-3
-333-

*** Life<FredkinCell> 5x5 ***

Generation = 0, Population = 13.
0-0-0
-0-0-
0-0-0
-0-0-
0-0-0

Generation = 1, Population = 8.
-0-0-
0---0
-----
0---0
-0-0-

Generation = 2, Population = 0.
-----
-----
-----
-----
-----

*** Life<FredkinCell> 2x2 ***

Generation = 0, Population = 1.
0-
--

Generation = 1, Population = 2.
-0
0-
