*** Life<FredkinCell> 6x25 ***

Generation = 0, Population = 17.
0-----0----------00------
-00000------------0------
--------------------0----
-00---------0-----0------
------0------------------
-------0-----------------

Generation = 2, Population = 41.
--1-1-0-0------01201-----
0---0200----0---0-2-1----
0----------------0----0--
122--0-0--0---0-0-0-1----
----0---0-----------0----
-00--0-0-0--0-----0------

Generation = 4, Population = 42.
----3-2---0--01-----000--
-2110-2-00----0---4---1--
0-----1---------101-----0
12---0000-----0-0-----1--
1-0-------1------00------
----00-----10------------

Generation = 6, Population = 67.
0-2---4---01-212-2-3-0-1-
--11--2---000-2-2-----3-1
------1-0----0-110-1-0--0
34-01--0--10----2---2-1-1
3-0-1-1-1---1--0-2211---0
11212---000321--0-----0--

Generation = 8, Population = 37.
0-------010---3---------0
---313-2-2-2-0----5-----3
------3-----0-------1-1--
---21----1--0-------4---1
------1-------1--42-1----
-14122---------0--1------

Generation = 10, Population = 51.
--3----0-3-10-3-2---1----
-32-1-3--4--20-03-----4--
1---0-3--0----0--1----1--
-----21--13--110--1------
----1-1-2------0--21-----
2---2-00-0--32-0103-----0

Generation = 12, Population = 59.
--5--05---1--4---3--1----
1-24-4-224----3--0--2---4
1-1------0----2---1-----0
45333--1-----3-0--3-4-2-1
4-1---1-212--01-05--300--
------0-10--540---300-0--

Generation = 14, Population = 75.
---0-070-413143--5-43-0-2
3-----54-40221--4--14-5--
1-1-21-002-01-4-1---20--0
653-54-1-1-12--03--0--4-3
6-----31-34-----2-4-5-21-
3251-----0-------050-12--

Generation = 16, Population = 43.
107---9-1-----5---1-3-2--
-5-------622-1--61-161---
1---2---------4--22------
-53354-1----25--51----6--
--------2-----------5-4--
-25---------6-----7----0-

Generation = 18, Population = 60.
-2-14-----3-2----51-5---2
-73-35--28----5-8----3-0-
-13---------3-43--413----
77--7-21----47--71---1-14
6---3-4---5---1--7--5-6-1
4----3-1--0--60--27-1220-

Generation = 20, Population = 68.
-4--419-2---2---373-5----
-93---66--23-27--153----5
-3--3-4---0--1------52---
-734-523---2-9--91--61-34
602-5-6-----3-3-3--------
64623-2122247-0-2---12-2-

*** Life<FredkinCell> 15x23 ***

Generation = 0, Population = 18.
-----------------------
--------0--------------
0----------------------
------------------0----
-----------------------
--------------------00-
-0---------0-----------
-0---------------------
-0----------------0---0
--0--------------------
---------------------0-
-------0---------------
--0---0----------------
---------0-------------
-------0---------------

Generation = 5, Population = 143.
-0--0---0---0-------00-
000010-0-0---0-----0110
0-1-10--0-0---0-----000
0---0------0-0-0--0--02
11------0-----0-0--0---
01-0-0---0------11--1--
2---01-1------0--00-01-
----0-010-----00-020100
--210----0---0-0-01-11-
-10---1-0-00--0--000---
-110----00010---0-1--21
--2-0-0----10----00--00
12----231----0---0-0-0-
0---0-000--00-0---0--00
-0-20--1-10-00------0-0

Generation = 10, Population = 139.
------0-00-0-0--1-1--0-
--1-1--0--0---0---134-0
1-3-2---1-10------20--2
1-2--0-------0---1---02
--02-111-1---------0-1-
-----32--01---1-2-21---
3411-414--10--2-03--21-
---21-----0000---12----
0-2---002--2-11-02-1--2
--3--0--53110--0--0----
0-2-11-011-1----1--112-
-14-10--1-1--1--1----3-
--2-----1--1-1-01310--2
2--12--0--------------0
0---0----221--11102--1-

Generation = 15, Population = 159.
------123--1-1--10---00
-----21-212---02003-513
----5100--2---1-033-033
---32311--22-0-022---0-
---4146-04-30-414----2-
--4-15-2401-1361----424
-5-414291--1--4----2341
1-2-30-2-----30--23-32-
-5-1--10---31--23-61---
----------22-2-10--1-3-
-1-1--13-12------543--3
0---1-21-----3-1-1--1--
-------5633-0----6---25
5---3---0-2-2--211---1-
-0-3----143-1521--4-2--

Generation = 20, Population = 111.
--------------2-1------
--2-532--2--------4-5-4
---3------2-60---3321--
3-----3-1----0--23-----
--1---6-1---11---0-----
23---7--73--246---4---4
-----5-9-----45207---4-
--3----2-3--05---3---3-
0-6-3-4--31--1--366--34
----1---762---0-2----41
-2-3-4-3-3-------5-4---
---4-------1-3---1-----
--6-1-57-----30-472-1-6
-1---4---4--3----10----
---4-2--26-61-----4---3

*** Life<FredkinCell> 20x26 ***

Generation = 0, Population = 18.
--------------------------
--------------------------
---0--------0-----------0-
--------0-----------------
--------------------------
-----------0--------------
0--------------0----------
--------------------------
--------------------------
-------------------0------
-------------------0------
------0-------------------
------------0-------------
------------0-------------
-------------------------0
----------------0---------
-----0--------------------
--------------------------
---------------0---------0
-----0--------------------

Generation = 4, Population = 63.
---0--------0-----------0-
-----------0--------------
1------01------10---0---0-
----0-------0-------------
--------------------------
-------1-------1---0------
--010------11-----------0-
------0-0-----------------
------------0-------------
-----------01--1-------0--
0----------------------0-0
--0-------1-----0---------
-----0--1-------1---------
--------0-------0--1------
---------------0---0-0-0-0
-----10-----2-------0-----
-0-------0--1-------------
-----3------0-------------
-----------0---0---0-0-0--
-0-------0------0---------

Generation = 8, Population = 61.
2--------------0----------
-----------1-------0------
---21------1----2--1------
0-----0-0-------0---------
---0--------------------0-
---0--------3------0------
------301--------------0-0
----------------0---------
-----1--------------------
-----------2-------------3
---1-------02--0--------1-
1----0--1-----0-----------
----0---------------1-----
----13-----1--------3-----
1----------------0-4-----0
--------0---------------0-
-1---0-------1------------
----------------0--0------
-------0---------0-----0-0
-2----0-----00------------

Generation = 12, Population = 145.
--2-------------4-------0-
---0---0---32----------0--
------42----1--5----1----1
----------2-----2---0-----
1----2-1-------2----1---0-
-------23------20--1---0-1
--42------12---00----2-220
-----00-----1-0-0---1-----
-0-10----0----------0---0-
---001-1---41--2---112-3--
2-----11---1---121--2--31-
-10-----203-5---2-1-----0-
20------2----0--2-------0-
11-----210-2---1---3----21
--011--1---153---0-----010
01--163-0----11-----0---0-
----11-----------1--0-----
-5--051----0-3-1-------1--
1--1---0---1-1-----------0
-40--1---12------1-2----0-

Generation = 16, Population = 59.
-----0-------------------1
------------2-------------
--2-----3--2---7---3----01
-----1------------------0-
-------------------2------
---2-2-------------1-----2
--------------321----2---1
--------------------------
3----2---------0----------
---2-------5----22--------
---2-------------5-------1
------------5---------2---
--12----------------------
--1---2-----------------4-
---------1-3-------5------
2------------------51-----
---------1-----------0----
--------------------------
3--1-----1-51--4-----2--1-
--------33-4---------2----

*** Life<FredkinCell> 17x20 ***

Generation = 0, Population = 18.
--------------0-----
--------------------
---0-------------0--
--------------------
-------------0------
---0------0---------
--------------0-----
----0---------------
--------------------
-------0--0---------
---0-------0--------
------------0-------
------0-------------
--------------------
-------------0------
-----------0--------
-0--------------0---

Generation = 3, Population = 158.
--0-0------0----110-
-0-0-0------00-000-0
0-000-0---0-01-10-0-
-00200---0---0---0-0
-002-0--0----021--0-
0-0-2100-0--1-0000--
-00000000--0-200-0--
-01-00110--0000-0---
---1-000000-00-0----
-0--1--02-00-00-----
0-0---1--10-0-------
-0-000---0-0-0-0----
--0110---0010-------
-0-00-0-0-011--00---
0-0--0-0-002-00110--
---0--0-0-0002-0--0-
0---0----0--0-1----0

Generation = 6, Population = 131.
-0-2-0-00-211---243-
-0--10--0---0-------
---1-0----10-211-010
--03----------1-----
----------0-01-2101-
0-------0---1---0---
------1-1---0-1013-1
0-1---2----0--0-----
----0---1-1--10--00-
0--------2-311------
-00---2---101--2-0--
--1---01-101-1----0-
12--2---11-100-1210-
----00-0-0-----00---
-000--00-1150-014-10
-----1-0------1--1--
---01220000-122100--

Generation = 9, Population = 134.
---2-1-------0-0-4-0
--0-2---10---000--0-
---2---00-2-----0---
---3-00--0-0---0-0-0
---4-110---00---2-2-
-01-21----1-102---2-
---0-0-0-----320-421
---1--3---012---0-0-
0-0--------001-0-11-
-0---------3----0---
0-0-------111---110-
00---0----140-0-10-0
-3-13-----21-0-1----
0-0-010--0-1-------0
-----231--1-10-2--23
--0-120-00---21-0-02
--031-2111-----1-0-0

Generation = 12, Population = 127.
--03-10--0---103-5-1
--14--------------0-
-----1---2-2-----2-3
--1-----0--32---0---
--0---23-00--2-42232
2-40--21------3-----
-211-------4-3334--2
0---0-311--42--00---
10-2--2---1-3-0--410
2-1---2---2---2----1
-3----------1----41-
0-203--31--4---2---1
-62430--3322--0---0-
--1---01------01--1-
--1--5--1------3--24
0--2---0---22--204-3
12--2-2--1---2-2---1

Generation = 15, Population = 152.
-3-3--3-303---1-45--
-3--42--2--2-----00-
000-02-30---0-4---33
002---0--2-3---01---
-3-71------01--73343
--5-633--31-2-4-2--0
---11-4-20--2-444---
3--4-1--4-242----1-1
-302---010--6410----
-0-1105022-3--3112-2
43242--02-----35----
11-----------3---0--
--25---03------33-1-
1-2-2-12-2---2-13-12
--4---3-2---3------4
3-121431-----2530--3
---4--22--------0034

Generation = 18, Population = 142.
-613--313-4-3226--51
-----------32-------
0--303--1-3--54-0344
----1--1-2-4-0-----1
24-8-3-4--2----73--4
--5-743-3-24-1--20-1
043-1------6355-----
--14--414--53-2--1-1
33-5-12--03265--1--0
-0---15---3-2--22--3
-3---0--22-1-2----30
1-2---1----------1--
---8-10---3-3214----
-23333--1----3------
1--1-----1-63--4432-
-1-5-4----14---3----
--27-52-2-1-3--50---

Generation = 21, Population = 188.
-72-25-2--4-----77-4
-3-46---2--62010--01
02-61436-24716---444
0023---422--51-220--
550---2--2--1378-4--
32-0856-433-22-----2
---34252-017-66-663-
-0-41---5-4-4--01---
4--6--302-636--12---
401552504-6--47--3-3
-62--160334-13-5----
-122--4-11----02---1
-7-9-10-6----3-5333-
-334-32412--14-132--
23--2-34-2-74--5-4-6
31-62-3---14-4-307-3
155---3--2--4-4--0--

Generation = 24, Population = 118.
1-37-----043--4-+-65
---4---3--27-----2-4
05-7----1-----552---
--54-------5-------3
------3722----7-374-
------7---4435-3---3
--4---8-3-2+----7-6-
---71-------51----3-
-3-7--4-5-74--4-3-10
--46--6--2-45--3--1-
4--6--733--2--5-4---
--33------46-5------
7-----3--33----66-6-
--4-5--5------1---24
2-------254---3--4--
--47-5----25-------4
1--8-5--4--1--4-2-3-

*** Life<FredkinCell> 20x27 ***

Generation = 0, Population = 20.
------------------0--0-----
0--------------------------
---------------------------
-----0---------------------
-------------0-------------
--0------------------------
-----0----------------0----
---------------------------
----------------0----------
---------------------------
---------------------------
---------------------------
---------------------------
-----0-------------0-------
-------------------0-------
------0--------------------
---0----------------0------
0-------0------------------
---------------------------
0-------------0---------0--

Generation = 2, Population = 71.
----------------0-0110-0---
0-0--0---------------------
-------------0----0--0-----
0-00---0-------------------
-----1-----0---0------0----
0---01---------------------
---0---0-----0--0---0---0--
--0------------------------
-----0--------0---0---0----
---------------------------
----------------0----------
-----0-------------0-------
-------------------1-------
---0--10---------0---0-----
---0-------------0--10-----
0---01-------------1-------
-0---0------------01--0----
--0-------0---0---------0--
---0----------------0------
0-0-----0---0-0-0-----0-0-0

Generation = 4, Population = 70.
-------------00--0----0--0-
0---1----------------------
-----1------------0--01----
-0-------0-----------------
---------0------100--1-----
------1--------------------
-0-------0--------0-------0
-----1---------------------
------------01------0------
--0--1-------------0-------
-----1-------------1--0----
------1--------------------
---1------------0---1------
00------10-----0-------0---
---------------0-------0---
0-0-------0---0---------0--
-------0--------0-------1--
0-0--1------0-0----1----0--
-------------------1-------
0-0-0-0-0-0-------0-1-----0

Generation = 6, Population = 177.
-----0-----0122-102112-110-
01----0--0-----------------
---0---0-1---00---01-23100-
1--10-00---0---------------
-1---2-0-2-0--013-2-1110--0
-1--12--00-----------------
---0---0-0-000---10--0--0-0
--00-110-----------0-------
-0---0---001--10---0------0
0--11310---------0---0-----
-------0----00--00--11--0--
000-00---0-----0---2---0---
-1------------00---3---1---
---2---2---0-01--1---1--10-
---1---0-----0---1--20--00-
-0--11---1--0-001--2--002-0
-----2---0----01--12--01--0
--01--110-0-0---101-100-2--
-------0--------00---0--1--
----000-0-----0-0--1--0----

Generation = 8, Population = 66.
-----0----1--2--3-----0--21
--1---0-1------------------
-------------2-------------
-0---1-------1-------------
-----4---------------1-----
1---32----1--------0-------
-1-----------21---20-0--0--
------1--------------------
---0----1---------1-11--0--
--------1------------------
---------------------------
2----2--------0---------0--
-------------0-------------
121--------0-01---------1--
-----1-----1----------0----
--------1-----0------------
-----------00---1---0-----2
0-------2-------1----------
-------------------3-------
-----0--0-------2--1-------

Generation = 10, Population = 182.
---0-0-01-122-413-2-1-03-4-
13---00-1-1--0-------------
----------00-4-00----33--10
2-2-23210-01---0---0-------
-3-0---1------1---2--1-10--
12-1-2-01---01---0---0-----
-----1--0--11--1-340-0110-0
0----2----0--------2-------
-----01---0--22-0---33-10-0
0----4----0---0---------1--
---0----1----1----0-21--1--
-2-0---00--0000-0-----0-0-0
-----1---------0------0----
3-3401--21-200-20-----1-1-0
---2---1-0-31---0-------2-0
-00---0-1-00110---------2--
-----3---112-1-----3----1-2
0-1--12---0-----3-13-------
-----------00---10--11----0
0--0-021--0---0--113-0-----

Generation = 12, Population = 197.
-1---21-----436--02-1-2-143
-----0--3---0------0-------
-1---1---32---1-2113-55-132
-----32----------0---------
-5-2-4--131--0--402-331-2-0
32--4---12----01-------0---
-2---1---20--331--4-0-11-00
011-------2--11---------0--
----12-1----242-01--550-000
-10--6----21012----1----1--
-1---3-----1-31---02-30-1--
-21-2-2-011---2---1-1-----0
---1----01-00---100--1--0-0
-25-0133-10----2030-0-----2
-1-----1-2-----1--01------2
1---2---1-0-3-2-3-04----2--
-------00---23-1----1-1----
00---1--2--1-10-5--32---4--
-----0-----2---1---5--10---
01--1----1----012---2--0---

Generation = 14, Population = 247.
----1-3220-3-38-5-4-13-4---
---0-0-1------0------1-----
---1--0--5411--0431---7--3-
20-2-5-321--0-1--------0---
-7---60-1-3-1011-2-053--2--
-412-411---00-0-0----1--01-
-2-10--1-20-2331-4---031--2
2--1-2---04-03--1--3--002-0
--01-221----2--12--1-5-2202
------21--43--41120-010-1--
---105--3---2-31-10245-0311
3-322-2--33-114210-4--2----
-2----0-------1-1-2-21-3--0
-2---1-----2-132-5----2----
-----2---------3-22---0----
--1-2-01-300-321---4001-2--
-1----12-----301-0--3--22-2
222---424--3-12-523322-04-0
---0----11--21-3------3-20-
2--1112211--0-2342-4-20210-

Generation = 16, Population = 66.
--00-3-----------1-1-------
2----0--3-----2-0--1-------
---------------------------
4--------1----3------1--0--
-7-----------------------0-
5-----------2-0---0-----0--
------0--2-----------0-----
2-------1------------------
1--1-2--------------7------
--2---2--------------------
-------------4-----4-------
-------------------6-------
---------------------------
4--5-----2---------1-2-----
---3--------------41-0-----
--------2-------------1----
----1------2----3--5-1-----
4-----4-------2-7-------6--
-----2----------------5----
2-1--1--3-------4-------3--

Generation = 18, Population = 164.
122-1--3-------1-----3-----
--22--23-21-1---001-----0--
-101-2-----------3-4-----3-
4-2--6-44--1------0---110-0
---2--0--5-----------4-2---
5-1-----141-2-------020-0-0
03-212-31--2-------01--1-1-
----------4-1-2---0-----2--
3111-231-1---4----13-71----
-------------------3-------
0--1-6-----2---2-2--65-----
3-43--3--4-------0-8-------
---2---------1----2--3-----
447--2-34--2-----6---441---
-2--13-----4-----3--3--1---
---1-----50---3-4--511-----
--01-53--2---41--2----12---
----12--4---0-2---3-----6-1
---11--1---3----1--622--3--
---223-33-0-------1---2---0

Generation = 20, Population = 184.
3-----45-2---4-1-----3-4-4-
-54--1--343-1--02--20--10--
--01-40--6-------5-4-6-----
4-4-48--6-1--2---00-0----10
071--7-----------2-156---0-
7---553---3-------010-2---0
--1--4----1------4-2-----1-
3-3------0--1-2----5-1--2--
--1-2--3-1------3-------30-
0-32--3--15-1-4---05-1--1--
---3--0--------2-426---1---
5--------------4------21---
0--413-----2----2--445-----
6---14-5-----34228-----130-
-----3-3-----113-5-1---3-0-
1-1-21--3---4---4-17----3-1
0------41---2----2--4--4-0-
--4312--40--0---9-33-4--8-1
-0-1-4---1---------8-45---0
-22-----51----3-5-----2-4-0

Generation = 22, Population = 239.
---11---34-----------3-6---
--4--34---501----13-2------
1-23--2218-1-6-----606-----
6144--36-212---1---02------
--131-01-63----2-43---2--2-
9--3-552165--20-0--10-2-03-
-5-4-6--12--4--21---1--11--
---2-4-1-241----31-70--14--
4--32--3-102--32------2--23
-1---7-1-1741--1-3--0---3-0
11052--231-2-4-41----7--4--
7--43341-44-1--62-282--12--
04-------2-------136-703-1-
8-861-3762-4-364-8---5--30-
----3---03---1---7---1-----
3-1-4---56--63524--72-12301
2312-556-----6---226------4
--65-----0-42-3-94--46-08--
12---6-23--33------+-4---10
32---524--10----5--523-----

Generation = 24, Population = 157.
32--346---1--4------23---4-
-76---4----2312-4-5---0----
-3-----------6-----6-----3-
61------74---34-12-0-1--12-
-----8---8-------6---8-----
---375---65---2-----03----1
052--6-------44---4--1---1-
4-----1---------3-----0----
-12-444-2---35--32---9----3
1---274-3-9---4----6----5--
-----------4---------72----
--5--3--16-2--5-2----1-----
-6-----------------------3-
-6+6-55-----136-381------0-
---4-41--51--1-------30--14
5-----1-5------------------
2-1-27--2---38--5---52--30-
4-6---5-4-----3-+-----0-+--
-2-3----------1---1--4--4--
-2-24-2--23--0-------34-4--

Generation = 26, Population = 262.
-----4-7--134--2--5-452----
-9-3------643-404252-2---0-
23-30-4--942-6-1----18-1-5-
81--5+-8-4-2-36--2--2------
2-14-+-----1--13--52-8-3---
--15-7---6-2-34-122--5-1-31
-5----0414-2-6-43--31-----3
--321-3--3----3---28-2----1
-3---6-34----74-------22543
--4329415294--4-34--------2
--1-362-33--4---25-787-3512
-25---5-38-4--5--2-----121-
-----32--303-2---------3-51
-6+---58742-3-8-5-3306-1---
1-06----1----3-32--2-5--3-6
-233623---2-83---02---3-40-
-3-24968-413-+22--27--2-32-
64852-5--1--325-+-5-67----2
14152---5----1--2--+-661431
4----525745-20345--533626-1

*** Life<FredkinCell> 14x22 ***

Generation = 0, Population = 22.
--------------0-------
----0--0-0------------
-----------0----------
----------------------
----------------------
----0---00----0-----0-
--------0-------------
---------0------------
0-0-----------0-------
-------0-----00-------
----------------------
----------------------
----------------------
------0-----00----0---

Generation = 2, Population = 68.
-----------00-0-0-----
--0--110-0-1----------
---------1---00-------
-------00-----0-----0-
--------1--0----------
--0----1-2100---0-0---
0-0---0---0---1-------
----0---00-0-0------0-
--0-0---0---0---0-----
-----0-----01--10-----
0-0-----------1-------
------00----0-0---0---
----------------------
----0-0-0-0122100-0-0-

Generation = 4, Population = 67.
----------10------0---
0--1-3-2---3-10-----0-
-------00-----01------
---------0------------
0-1-------------------
1----0--143-2-1-0-0-0-
----1------11---------
-----1-------0--------
0-0-2-0---0-------0---
---00-1-1-12120--1--0-
--------0-------------
------2--0--00----0---
0-0-----------0-------
--0----0002--2--20----

Generation = 6, Population = 118.
-------1-13021100-0-1-
0111---4-1-503-00-1---
1-0--11--2-101--100---
---0----001-00--0-0---
--1----03--11-10------
3-20-01-34-2-0------0-
--1-1----1---02---1---
1---2100-1---0-0001---
----4-2-2--0----1---1-
-00-0-3----2122-1--1--
----1---------3---1---
--10--2-00112--0------
--2-0---1---1---1-----
1-2-00---0----1-42-0--

Generation = 8, Population = 62.
1-1---1-0-----1-------
-13-1--601--05-0-1--1-
---1---------------1--
----------------------
-----------1----------
304-1--2-4--42---01---
0-------------4-1-----
-1----2-----12---01---
----4---2-2---2-------
----0051-0-----2-----0
-----------0----------
-------1-----21-------
1-2-----------1-------
1----2--0-4-------0--0

Generation = 10, Population = 140.
1--1------3-4-1-0--0--
0-3314-8-3---71--120--
211--22-2--1--0--1---0
0-------0------0--1-0-
2--0-----1---12-0--0--
-0-112-2-45-641-02310-
2-3-3---1-121---1-2---
1110422-1-113411123100
0-0-----2-22--2-------
-11200-330-3122---01-0
0-0-3---111--1--------
1---00311-123---0-0---
--2-1------02---2-----
--40-21-----222-4-011-

*** Life<FredkinCell> 17x10 ***

Generation = 0, Population = 11.
----------
0-00------
-0--------
----------
-0--------
----------
--------0-
----------
---0------
----------
----------
----------
----------
-----0----
------0---
---------0
-0--------

Generation = 4, Population = 34.
----------
---23-10--
-2---1--0-
----------
-0-2-0----
0-00------
-0--1---0-
----------
-0-----1--
-----1----
------0-0-
---------0
-0-1------
-1-------0
-01-------
-----0-0-0
-0---00---

Generation = 8, Population = 41.
---0----2-
---45-5-02
-4---3---1
----------
-2---0---0
1-20-1----
1---1-0---
---------1
-0-2-----2
0-10------
----------
---------0
-1----2---
-1---0-0--
1-----2-0-
-0-0------
---1-2---0

Generation = 12, Population = 60.
----0--14-
------6-02
0--40-0003
---------2
-2-----11-
-1-----01-
30--32--01
-----0-2-5
-0---22--6
-1-01-1---
----1---2-
-2-2-1-1-2
--1-------
1-1--2----
---1-1--23
---4-3-0-1
2----3--21

*** Life<FredkinCell> 18x28 ***

Generation = 0, Population = 13.
----------------------------
----------------------------
------------------------0---
----------------------------
----------------------------
----------------------------
----------------------------
----0--------------0--------
-------------0--------------
----------------------------
----------------------------
--------------0-------------
--0------------------0------
0----0----------------------
--------------------0-------
----------------------------
--0------------------0------
------------------0---------

Generation = 1, Population = 50.
----------------------------
------------------------0---
-----------------------0-0--
------------------------0---
----------------------------
----------------------------
----0--------------0--------
---0-0-------0----0-0-------
----0-------0-0----0--------
-------------0--------------
--------------0-------------
--0----------0-0-----0------
00-0-0--------0-----0-0-----
-00-0-0-------------00------
0----0-------------0-0------
--0-----------------00------
-0-0--------------0-0-0-----
--0--------------0-0-0------

Generation = 2, Population = 46.
------------------------0---
----------------------------
----------------------0---0-
----------------------------
------------------------0---
----0--------------0--------
-------------0--------------
--0---0----------0---0------
-----------0---0------------
----0---------0----0--------
--0----------0-------0------
0----0------0---0-----------
1---0--------------01--0----
0-10---0------0-------------
------------------0---0-----
0----0------------0---------
0---0--------------01--0----
----------------0-0-0-------

Generation = 3, Population = 135.
-----------------------0-0--
----------------------0-0-0-
---------------------0-0-0-0
----------------------0-0-0-
----0--------------0---0-0--
---0-0-------0----0-0---0---
--0-0-0-----0-0--0-0-0------
-0-0-0-0---0-0-00-0-0-0-----
--0-0-0---0-0---00-0-0------
--00-0-----0------0-00------
00-000----------0--00-0-----
100---0----0---0-0-000-0----
-00----0----0-0-0-01200-0---
1-21--0-0----0-0--000-00----
--00-0-0------0--010-0-0----
10----0----------01-0-00----
10-0------------0-01-00-0---
0---0----------0---010-0----

Generation = 4, Population = 46.
------------------------0---
----------------------------
--------------------0-------
----0--------------0--------
-------------0--------------
----------------------------
------------------------0---
0-------0-----01-------0----
--1------0-------1---1------
0----1----------------------
--------------------1-------
----0-----0-------01--------
1-1---0------0---0---1---0--
-03-0----0--------1---------
----------------0-------0---
--------------0---2---------
2-----0----------0-------0--
1----0--------0-------0-----

Generation = 5, Population = 128.
-----------------------0-0--
--------------------0---0---
----0----------------0------
---0-0-------0----0---------
----0-------0-0----0--------
-------------0----------0---
0-------0-----00---------0--
-00----0-----01200---00-----
-0-0-0----0---000-0-0-00----
-00-0-0--0-------0--00------
0---00----0-------0--0------
1-00-00--0-0-0----12-0---0--
-020-0-0-00-0-0-0-012-0-0-0-
-1---00-0-0--0--0--0-0--00--
-00-0----0----00-0-----0-0--
1-----0------0-00--0----00--
30-----0--------0-----0-0-0-
20--0--------0-0-0---0-0-0--

Generation = 6, Population = 137.
--------------------0-0-0-0-
----0--------------0--------
-------------0----0---0-0---
--0---0----------0---0------
-----------0---0----0---0---
0---0---0-----00---0---0----
--0------0---0---0---00---0-
--1--00---0-01--11---1---0--
0---0--0---0---1----1--10---
--101--00-0---00--00---0----
1-----0--0---0----1---0--0--
20--011-01--0---002-01------
--3-----0--0----1---3---1--0
1-31--10--10--0-1--10-------
--1----------01---1--00---0-
200-00---0--0-0---2-0-0-----
4-0-0---0------01--1---01--0
--00-0-0----0---0-0-1-0-0---

Generation = 7, Population = 199.
----0----------------------0
---0-0-------0------------0-
--0-0-0-----0-0----------0--
-0-0-0-0---0-0-00-----------
0-0-0-0-0-0-0--100-------0--
-000-0-0---0--1-000--0----0-
0010000------1-0-1000-1----0
0020-11----01-1-2-0--2-0----
-0--1--1--0--0-2-10---0-1---
-02--1--10----1-00-1---1-0--
2-00--1-01-----00---1---0-0-
-1-01-----0----0-----2--00-0
--4-00--1--1--00--0----0-00-
--420021-02-0-1-20-2--0-0-00
----0000-000-120002-01-0-0-0
--1--10---00-01-0030-01-0-00
50-010---------1-00-1-01-00-
20-10------0-0--1--0---010-0

Generation = 8, Population = 45.
-------------0--------------
----------------------------
----------------0-------0---
--------------0-------------
--1------------------0--0---
0----1----------------------
--------------------1-------
--3--------12--------------0
--1--0----------------------
------------------0---------
------------------------1---
------1-----------2---0-----
--5-1-----0--0-------1-----0
-1----3-0----0--------------
------------0-------1-------
2---02-------------1--------
--0-2-----0----------0-----0
----------0---0-----------0-

Generation = 9, Population = 135.
------------0-0-------------
-------------0--0-------0---
--------------00-0-----0-0--
--0----------0-00----0------
00-0-0--------0-----0-00-0--
-00-0-0-------------00--0---
0-1--0-----00------0-0-----0
-040-1----0231------0-----0-
-0201-0----00-----0--------0
--2--1-----------0-1----0---
------1---------------00-0--
--0-11-0--0--0---0-2---00--0
-----0--10-1010---0-3-----0-
1---00---02--11-----00-----0
00--000-0--0---------1------
-010-30---0-0-----3--0-----0
50--3----010--0----11-0-----
--0-0----010-0-0-----0---0--

Generation = 10, Population = 137.
-----------0-0-00-------0---
--------------0-------------
--0----------01---0--00-0-0-
0----0------0---1-----------
1---0-----------0--01-110-0-
0--0---0---00-1------------0
-----1------------0--11-0---
----02---01--21---0------0-0
0--12--1------------1---1---
--3---0----00---0-0-0-0----0
----00----0--0-------01---00
-1--2-1------1--0-2-----1---
1-5-1-0-2--2---0---14--010-0
2--2-1--0-30---0--12--0-----
----------0--12---2---0-----
21-1---00-1--01--0---1----0-
6-0-4-0-0----------22--1-0-0
2---10--0-2---0-1--0----1-0-

Generation = 11, Population = 238.
----------0---0110-----0-0--
--0--------0-01-0-0--00---0-
00-0-0-------1-000-0011----0
100---0----0--00200000-0----
-0-----0---0--0110012-2-1---
100--10-0-011--00-0000-0----
0--0-200-00001---110122-----
0-----1001223322-110020-0---
-0-2----0000000-0--02101----
00---------11--0----10110--1
-000-11--1---10------1-0101-
---0-1200-00020-----020-2-0-
20-0201-30-30101--0-51-121--
31--0--11---01-120---01-00-0
-0---0-0-0--0-----3---10--0-
-21----1--200--00--1---0----
-0-050-0-0---0--100-3-0-1---
3001-1-01--0-0---001-----0--

Generation = 12, Population = 122.
--0------0------21---0------
0----0----------------------
------------02------1-------
--1-------010-----1--------0
1-1--00------0---1--3----0--
-11-0----0--------1---------
------------------------0---
1------11-----332-2---10-0--
01--2-0--11--1----------1--0
11---10-1----01-------2-----
------------0-------1-------
2---22----111-1---22--1---10
----31--410---1------2-2---0
-24-11---0--1-1--11-------0-
--------0-------------------
232-0-0-003---11--3---11--0-
--------0----10--1-----1----
41--12--2-2--10---12--0---0-

Generation = 13, Population = 231.
00-0-0--0-0----1320-0-0-----
-00-0-0--0--00--00--00------
0-0--0----0--31---00-1-----0
1020-00--01--0-----0-----00-
-0-0-110-000--0-1-01-0--1-00
-2----0-0-0--0-----00---00--
001-0--000----000-----2-----
2---0--22-2---4-3--0-221--00
1-22-01-022002020-0-------0-
--3--2----0---20----10-10--1
-0--0-1-0-0-1-----1--1----10
-1-0--2-0-----20-033-----02-
2050421052---1-1-0-15-0-2-01
335---3-11-0--212222-0-0-0--
0----000100-0--0-0----10----
3-3-----1-40---20--1-12-00-0
--0--000----0-1-1-02--021---
520123003--00--0--2310---0-0

Generation = 14, Population = 217.
1-0-0--0-0-00002431-10-0----
0--0---0--001-----0--------0
1----10--010-4200-1-121--0--
-13--1--0-2-010-2-1-0----1-0
--11---10--100----123-212--1
---00-1-1-1-1-10----1-00-1-0
-12-12---10------1--1-3-0000
----1---3-3-3----1---33200-1
2--32-21-------3----2-0-1010
1-4--30------------12--21002
21---12-1-1--1----2--2101---
--012--0--1-1-3---4--21--130
--61------030---1--262-2---2
44--11--223---3-----0--10--0
----011--1---1---1---1-----0
4-41---120-10------2-23--1--
------1-0-101---2--3-0---0--
6-1--4114021-1---0-4-1-0----

Generation = 15, Population = 245.
2--0-001--0-1-------21--0--0
-0---0-100---0-----0--00-00-
2-000-1--1----3-------20010-
-2--02--103----03--0---0-2-1
-----1-21002--0111--4--2300-
-21--1-020212021001---1--20-
023023--0210--00021022-----1
204---1--14--3-3322-04---1--
31-4-0-2--2-0-0-01--311-2-21
-1----1-1-0--0-0---2--2--11-
-200---0--20-----03---21-0--
2--23----1-122-0005--3-0-2--
2---42-05-1--1-1-0-37-03-1--
55-----133--1--122--101-100-
-01--22-1--0----0-30-2-00001
--52-3023-4-----0033-3410200
---0--2--------1--0----2110-
---1252-5-3-0-0----5-2--10--

Generation = 16, Population = 51.
--0-----------------32------
0----1------------0---------
--1-----0-------0----2------
--------------0---1---------
--1------------------0------
----------------------------
-------------1------3-------
3--012----5--------015------
-22------------------2-----2
--------------2-------------
----------------------------
3-------------------------3-
-----3------02----04----2---
----1----4----3-3--2-1------
----0---------------1-------
----------------------------
-----0------1-----13--------
--1-------------------0-----

Generation = 17, Population = 145.
20-0-0------------10430-----
-0--0-0-0-------00-00-------
20-0-1-0-1----30-0--1-2-----
--------1----1-030-0--------
-0-1----------0---1-4-2-----
--1----------0------10------
0--023----1-0-0-----4-------
---1-31--1-2-3----212-3----1
-33-20----2---0----0-31---2-
-14----------0-0-----0-----2
2-------------0-----------1-
-1---2------22----53----22-0
2-----1--2-313--101-72-3-10-
---22---3-3-1----2-31-1-1---
---012---1----2-0-----------
----03------0-----330-------
--0-5-2----0-1---1243-0-----
-2-1-5------0-----25-2-0----

Generation = 18, Population = 163.
3---0---0-------4-215-10----
0-00---1------1-1-0-1-------
3---0-1---1---4---102--0----
1----2------0-----1-0-------
1-1-0---1----0--1--250-2----
1--001----2---2---1021------
-2---------0---0--1---3----1
30-2-4223---3-4--232-542----
3--43--------2-----13--1-0-2
---013----0-1---0--221----1-
-20--1------11----30-2--1--0
3-0-3----1------0--4-3--3---
---14--0--14--1121---30---1-
5-5---31---02-3-3324-1-1--0-
--1---2------1----3---1-0---
--5-1----0----1-0--4-34-----
---06--0--1---1-22---0------
6-1-2---------------1-0-1---

*** Life<FredkinCell> 5x17 ***

Generation = 0, Population = 22.
-0-------0--0----
--0----0-00---0--
-0--0-----0--00--
-0------0---0---0
---0---0--00--0--

Generation = 1, Population = 43.
0------001-0-00--
-0-00-0----00-10-
01-0-0-00-10-1-00
01000----0-----0-
-00-0-0--011-0-00

Generation = 2, Population = 40.
---00--1-2-101---
01--10-0-0-11----
-20---01102-0-011
--11--00-10---0-0
---01--00--2----1

Generation = 3, Population = 35.
0001--02-3--120--
1----10-0-0-2-100
----0------01----
-----0-1----0010-
----20--1---0-002

Generation = 4, Population = 37.
---20--30--1----0
2-00-2-0-0-1-0--1
0--0-0011--12---1
----01------1-2--
---03-0--0-210-13

Generation = 5, Population = 49.
0---1-0-1-0212-01
3-11130-----2-10-
12-101-22-2---012
0--1--0101-0-0---
--01-0-01--321024

Generation = 6, Population = 44.
100-201---1-230-2
-122-4------30-11
23021----0--2--23
1----11--201112--
001---0---1--2--5

Generation = 7, Population = 46.
21-23123-3---4103
32---5---0014-1-2
-413210-21---1---
-1-1-2-10-1-223--
--21--10--2--3-2-

Generation = 8, Population = 43.
---3-2-4-4-2-52--
-3--1-00-1--5-213
-5-4--12--21220-3
12--03---22-3-4--
--3-3-2--033-40-5

Generation = 9, Population = 42.
-10-3-25-5--26--3
3422-5-1-2-16-3--
----2---21----124
2----4110-3-4--0-
0---40-01-4425---

Generation = 10, Population = 45.
---3-23--61--7-0-
4533--020--2-04--
-51--112---1-2-35
32--0--212415--1-
10-15-2-----3602-

Generation = 11, Population = 44.
21-4-3---72-282-3
564-15131--3-1513
26---22321--231-6
-3--1-1----2-2---
---2----104-----5

Generation = 12, Population = 44.
--0-34-5-83239-04
6-532-24-2---2--4
-7--2--432213--37
-41--42-----53---
-03---202-5--6-2-

Generation = 13, Population = 41.
2114-536-------1-
-6--35351-0-6351-
-81-3-2--3---314-
35-1-5-2-2----4-0
1--2----3--4-7--5

Generation = 14, Population = 47.
32-53-4---3-39-24
--5--6-622--74624
-9244-34-4-------
--121-2-1342-3511
2-3350----5----26

Generation = 15, Population = 40.
431645--1-----2--
66633------3-5-3-
2+-5-2-----13----
3-2-25322453-4-2-
---461--3-6--7---

Generation = 16, Population = 44.
-4275646-8-2-----
7-7--6--2-047-6-4
3--6-3-434-243---
45------3-6-55--1
2--57---407-3802-

Generation = 17, Population = 37.
-53--7-71-33--2-4
8683---63-1--5---
-----4-5-5-------
562-25----7366---
3-3681-0-----9-3-

Generation = 18, Population = 35.
----5------43----
97943-37-22-7---4
---6-5-63-224----
---2-63---8---52-
40--9---4-74-+--6

Generation = 19, Population = 47.
453-6747-8-5-9--4
+--5-64-33---5-3-
3+--46--453--3147
56232-4--4-36-63-
513---20---5-----

Generation = 20, Population = 44.
--47785819---+2--
-7---7-7-4-47-644
4--6--36--4---2-8
6-3--65--58-76---
-2--91-14076--03-

Generation = 21, Population = 44.
--5--9-9--35-+--4
-----8--3525857--
5---46--455---349
76-----2--9387631
---6+-22-187--146

Generation = 22, Population = 41.
-5-77+------3+-2-
+-9---4--6-6-6---
6--65-3--662-345-
-733-6-3-5+4----2
5237+-3--29----5-

Generation = 23, Population = 42.
--58-+---9--4---4
+7-5--5737278----
7-2-664-4773---6-
7-44-----6--8763-
6348+1--4-----1--

Generation = 24, Population = 41.
4-6----9-+--5+-2-
-8-6-8--4-38-6-44
-+3-7--6--8-43-79
-75-2-5-37--9-7-2
--59-232----3-2--

Generation = 25, Population = 46.
-5---+5-1---6--3-
-9--3-57-7-9---5-
7+-68---4-93--4-+
7-64366-48-4-7833
---++343-2-74-356

Generation = 26, Population = 44.
466--+-9-----+244
--9-48-8--3+---6-
--3-9---5-+44-5-+
877--7-3--+-98-44
6---+45443--5+-6-

*** Life<FredkinCell> 20x18 ***

Generation = 0, Population = 15.
------------------
------------------
-0----------------
------------------
-----0------------
------------------
------------------
------------------
----0-------------
---0--------------
-------0----------
0-----------------
--------0---------
--0-------0-------
-------0----------
---------0-0------
---0--------------
------------------
---0--------------
------0-----------

Generation = 2, Population = 52.
-0----------------
------------------
---0-0------------
------------------
-0-0---0----------
------------------
----00------------
---0--------------
--0---00----------
00---0------------
----00--10--------
0--0------0-------
------0---1-------
----0---11-10-----
---0-0--11--------
--0----1-000-0----
-0-0-0-0----------
------0--0-0------
-0-0-0------------
----0-0-0---------

Generation = 4, Population = 46.
-0---0------------
------------------
-0---0------------
------------------
-0--1----0--------
---1--------------
-0-----0----------
0-----------------
1----0------------
--0----1--0-------
---0---1---0------
--1-0----0-1------
---1--------1-----
0--0----------0---
-------0---0------
0----013-----0-0--
-------21---------
--0---0---0-------
---0--------------
--0------100------

Generation = 6, Population = 107.
-------0----------
------------------
----10-0-0--------
---0--------------
--10-10----0------
00---0------------
00-11-------------
2--0---1--0-------
311----2---0------
--0--2--1--00-----
00-0-0------10----
---00-0--013-00---
-0-3-0----2---1---
-1--1-01-1-321-10-
---1-1-22---11----
----12150002-000-0
---0-112-110------
--0--100-10100-0--
-0---0-00---------
0---0-001---10----

Generation = 8, Population = 42.
----0-------------
---0--------------
-------0-0--------
0-----------------
--------0----0----
--0-------0-------
-------1----------
---------1-0------
--10--------0-----
---0-------0------
-2-2-----------0--
--------1---------
1----0----------1-
--1-1-2---1-------
---1-----------0--
-0-1--------------
----1------2------
---0-----1-3------
---0-------1------
--0-------0---1---

Generation = 10, Population = 124.
--0-0-00-0--------
00---0------------
----21-000-0-0----
0--1------0-------
------1--110---0--
----0---11-10-----
--11-1--11--00----
--12---3-10--0----
3--010-3--0---00--
-2---3--1--0-0----
220---------10--10
--121------4------
1214---0------2---
1312--2-1---3-----
01--0------0-2--10
-00-222--113------
--0---1--3-4-0-0--
--12-2-1-113-10---
-0--11---1-3-0----
0-000---1301--1-0-

Generation = 12, Population = 94.
1------2-0---0----
--00---0--0-------
---041-2---0-0----
--1-0----1-1------
--21-----1-------0
0----------1--0---
-1-----1-3-0---0--
3----0-51----2-1--
-----015-----1----
----0-1--------1--
-4-3-2-----2---1-2
-1-43----1-40-----
-4-6-----0-1----1-
--3-----121---1---
-3-----3-------1-2
-00--2-62-1---0---
-----3-33------01-
----142------320--
-----------3------
01-------501--1---

Generation = 14, Population = 150.
--110--4---0---0--
222-----1--00-----
00----0----2---0-0
---12-0--31--10---
1--3---0-3-0-0---0
----01-11--31--00-
--2---1--3-2-1----
--1312-7-10--40--0
----1---0--1---1-0
1410-432-0-10--3-1
---5--0----4-0-32-
-1-650-02--6-1-1--
-6-------0---03---
2-32-02--4--3-1-2-
-5-----53--1-2----
1-2----8-----1-21-
-1-0-33--424-210--
0--4364--2--15-000
-----2-102---2-10-
-32000113-0----10-

Generation = 16, Population = 48.
---1---4----------
--2-------1-------
---1----1----1---0
0-----2-----------
-------2-5-----1--
---1--1-----------
---12-------------
------------------
---1------1-----0-
---------0-------3
-----3-------2----
--2-------3---1-0-
-8----1-0---1-----
2---1-----3-3-----
-------------4----
-----4---2-4------
----2------6-----1
------------------
-1---------4-----0
--------3-----2---

Generation = 18, Population = 135.
-0-----410---0---0
----0-0-2---1-----
-0-1-22--213---0-0
0--23-2-1-2-------
----11-205-1------
00--131-2---------
-141-222-40----10-
---3--0--1-------1
-1-13---0---021---
--1----3--02--0303
-5----222-143--44-
--------433-2-1-01
---7111-0-----4---
2-4--24-36-45---2-
-5--2-0-4---1--1-2
1--22----21612----
-10---3--5-8---1--
-----6--02-4--2---
---11----2-4-3-2--
------1-3-0-2-2-0-

Generation = 20, Population = 120.
--------32-1-0-0-0
2-20--2---2---0---
---------4--01-0-0
----3-----4-------
---4-1-4--3--1--00
-------1-3-------0
1--1-2-4---------0
3-1---2---1---2-0-
-1------00----121-
2--0154---0-2--5--
-5-51--------3---3
0----2---3384-3-0-
-819-3--0--32----1
2-4-2-6--8----3-20
-5---3---3-2-4----
-12--5-9221--4-22-
03----34----04----
0---3---2-1-3-2---
-----2-1---6-----0
----12---7022-----

Generation = 22, Population = 188.
------2654110-----
-34-12----2-----0-
---3-3--24-5-3100-
0--2---1236-1-1--0
10---1--1--2-112-0
2-0-1321-3-4--0110
3-4--2--2-2--21---
5-132327-21-0-4321
41-2512---222-1-11
25203--5-002-10--5
-5----4--2--4-055-
0----4--5--+4232-3
2+-+--11---3-150--
236---6------1--40
0-12-51653-2---2-3
1-4-37-------4044-
031133-44-29-412-1
201-3--2---55722--
11-2-40-----1--2-0
1-21-22---0-42----

Generation = 24, Population = 98.
---12-----31---01-
--623-2--14------1
1--5---3-----5--0-
--3-----2-8-----0-
---5--16----1--2--
--223------63-2---
--4----6---304----
-----3---4-1------
--2-5--61---2----3
-52------022-----7
---6-3--2--6---7--
2-2-6-----4-6-----
----24-3------70--
---42-------6-3-6-
-7-445-----2---4-5
---3---------4----
--1-3----54-1---3-
-----7-----5-----1
---4-------7-----0
--4-2-2-----4-----

Generation = 26, Population = 199.
101-214654332012-0
35---2204-411--121
111-5-33-52-2-312-
2---3---24-3-----2
21372---2653331-10
21--5-3-3--6512---
3-61-33-3-45-62--1
-0--3-----23255--2
5--35--832--231--5
--21-6-62-2--2-7-9
-716--54233-5-27--
-227--0-65-+----03
-+3+461311--23--1-
35-4436------2--6-
-7----3---1-1-0-3-
-3-54-------2-2561
151--3446-6+1--4--
--2-4-53-4--6--3-3
-10-25----1-13-322
2---22--3-034-2--1

*** Life<FredkinCell> 20x14 ***

Generation = 0, Population = 21.
----0---------
----------0---
---0--0-------
----------0---
-------0------
--------------
--------------
0-0-----------
--------------
--------0-----
-0------------
----------0-0-
--0-------0---
0----0--------
------0-------
--0-----------
--------------
-----------0--
----0------0--
--------------

Generation = 3, Population = 135.
-01-10--0-0-0-
-00000--1----0
0-0-0--210----
-0-0--0-10---0
0----120--0-0-
-----000---0--
0---0-0---0---
-----0---0----
--0-0-0-0---0-
-01--0-0--00-0
-0-1000--020--
1-00----003-10
220--0-0-0-0-0
1---0---002-10
00-01-----1-0-
--0011--0--10-
--0010-0-00200
-0100---010101
-010-0-0010101
--0---0--00-00

Generation = 6, Population = 125.
-1-1-----1----
1-1-1-2-----0-
--3--2-3-1-10-
--2---1-------
---222-0-00--0
----1-1-0-0---
-01--1-11-10--
0---002-----0-
0--10---11--0-
0-212-010-1---
1-2-0---1-2---
-0--002--1-12-
5---101---11--
1-003--133-2-0
---04-1-102-00
-0---2-1010211
-11-1-11--3-11
---0-012-11-14
2-2-01--3--4--
--1-10-1-0-3--

Generation = 9, Population = 130.
-131----2-00-0
1-4---------1-
22--1-0---1---
0-50--10-020--
00-53--0-1-0--
-000--1--010-0
0-2022321-----
-0----5----0--
0-21300-1--01-
-0-2-11---4220
2--31-20--31--
-010--2----1--
--2-41--0----0
-----0-2-3-31-
2-10501-2--101
2---32---21-1-
0--01---0032--
----0-222-1-1-
-15-0--2-3-513
--201-------20

Generation = 12, Population = 128.
-46----02-3131
--5-30--1---1-
-3-2-23----321
1-8-0-2---5-1-
1---4--1-1110-
00--2-2-10-01-
-13-2342203---
--4-----------
0--43-111-1--1
014-42-2--5-5-
-33--13-2134--
4---2------23-
---27-1-1--3--
41-160--5-----
52---0-23--104
3----3-1--1-42
--2-2--2------
-0--1--32-4---
---10--55408-3
2121--0---052-

Generation = 15, Population = 146.
---2-0-321---2
--6---4120--2-
435-13351-4---
4-9----01-812-
20-8-6----2--1
--2--05-232---
1---2-7----1-1
-070146112-2--
314-3-2--44-22
12-2433---6451
---5--63----2-
5141--5-3-3362
7-----21----20
5-1-9022--2-1-
8---6-224---1-
4-21-401-41453
1-33304--14--2
2--010--3----6
--511--5----33
5-21----2-183-

*** Life<FredkinCell> 12x13 ***

Generation = 0, Population = 18.
----0-0------
-------------
--------0----
---------0---
-0-0---------
-0-----------
--0------0--0
--0---0-0----
----0--------
-------------
-----0-------
-0--0-------0

Generation = 4, Population = 45.
0101------0--
-1-----------
--0---0--0---
--0--11-0----
-2---000-----
-2---0-------
0-----1---1--
012---2--12--
10-0----1----
----3-------2
-01--1------1
121--00-0-0--

Generation = 8, Population = 46.
2---3----1--0
-3-----------
12-4-2----1--
----1-------0
---1-4--22-1-
-6--12---1--1
-1--20---03--
----2-------1
--1---3-----4
--2---3-1----
-22-----31--5
-42-121-----1

Generation = 12, Population = 70.
-41-52--01-1-
-4--3----1--1
344-4-30-11--
2---3-----1-0
362--84----10
171---3-011--
--24-23---5--
155--34---5--
3-51-55--1-0-
2---4----00-4
126--30------
----32--11--2

Generation = 16, Population = 48.
-----43-2-2--
-43-5-3-1---2
------5--2--0
-1--55------4
-+-4-+-3-2-3-
-------------
133-44------1
----5---1---2
--7-2----50-5
-3-----------
-2-6332--2---
8-5---3---3--

Generation = 20, Population = 71.
--4378-3-4310
-----2--5----
45--647---1-0
2---75--322-6
--343+6-5---2
--3-2-4-1---2
-577--7--16-2
-66--58------
-1-2---2-7409
355--47---2--
---8--446-2-8
+5------5-5--

*** Life<FredkinCell> 16x13 ***

Generation = 0, Population = 13.
---0---------
-----0-------
--------0----
-------------
-------------
---0--0------
-------------
-------------
-------------
----0-----0--
-------------
-------------
0--------00--
-------------
----0----0--0
-------------

Generation = 4, Population = 39.
-------00----
-1-1-10--0---
---01-------0
-------------
---1---------
--1-33-1-----
--------1----
-------------
0--------01--
1--1----0---0
----1----2--1
-------------
--0-211-----1
----1-----0--
0---01---00-2
-------------

Generation = 8, Population = 45.
---4-------1-
-3-31-2---1--
1---------0--
-------------
0-------110--
2--1-7-----01
---01----3--1
-------------
---1---------
-----0--0---2
----1---12--3
-------------
110---5---2--
---1--3------
-00-2-1--1--2
----3-----3--

Generation = 12, Population = 73.
--------42-3-
--2-3--10--1-
--2---3--3-3-
-------------
--0--10----2-
--35-91--3-13
----20-243--3
-------------
-00---0133---
51--102-1010-
3201212---4-7
----1-----3--
33-233----3-3
--2-21-00---0
--------5----
0--3----2---3

*** Life<FredkinCell> 8x22 ***

Generation = 0, Population = 16.
-------0-----------0--
-----0------------0---
-0--0--------------00-
----------------------
--0-----------0-------
0---------------------
---0------0---------0-
--------0------0------

Generation = 5, Population = 83.
----3----00-00-10--2-3
-2---201---0-02000-02-
-----1-1-0-0----11----
-0-0-00010----01--1--0
-20-0-1100-0-----0-10-
1--0-200-0-------0200-
--122012-0--00-0-0--10
----1000---2100-0-01--

Generation = 10, Population = 74.
-1------2---2-1-0114--
--11--0-0-0320-501--3-
--1--22-23---0--44----
-11--13---1--0-3------
343200-2-21-1-0-1----1
---2040-2-1-------5-20
1--57--------11-2--2--
--21-32-31----2---530-

Generation = 15, Population = 92.
122----2-31341-41--546
241-0-1------0-813313-
-02--------2-1--4--5-5
--3---5153------22----
5-67--5--463-1-0-3-3-3
31---73---223-3-0261--
-3-+81-71--2323--2--44
-154--54-4-35-51-18532
