*** Life<ConwayCell> 1x1 ***

Generation = 0, Population = 1.
*

Generation = 1, Population = 0.
.

*** Life<ConwayCell> 1x1 ***

Generation = 0, Population = 1.
*

Generation = 1, Population = 0.
.

*** Life<ConwayCell> 2x2 ***

Generation = 0, Population = 4.
**
**

Generation = 1, Population = 4.
**
**

Generation = 2, Population = 4.
**
**

*** Life<ConwayCell> 4x1 ***

Generation = 0, Population = 4.
*
*
*
*

Generation = 1, Population = 2.
.
*
*
.

Generation = 2, Population = 0.
.
.
.
.

Generation = 3, Population = 0.
.
.
.
.

Generation = 4, Population = 0.
.
.
.
.

*** Life<ConwayCell> 1x4 ***

Generation = 0, Population = 4.
****

Generation = 1, Population = 2.
.**.

Generation = 2, Population = 0.
....

Generation = 3, Population = 0.
....

Generation = 4, Population = 0.
....

*** Life<ConwayCell> 4x4 ***

Generation = 0, Population = 10.
**..
***.
.***
..**

Generation = 1, Population = 6.
*.*.
...*
*...
.*.*

*** Life<ConwayCell> 10x10 ***

Generation = 0, Population = 20.
..........
.....*....
.***......
....*.....
..*..*.*..
..*..*.*..
..**...*..
...**..*..
..*.*.....
...*......

Generation = 10, Population = 18.
.**.......
.*.*......
..***.....
..*..*....
.*........
*....*....
*.........
*...*.....
.*.*......
..*.......

Generation = 20, Population = 20.
..........
...*.*....
.**..**...
.**..***..
.....**...
..****....
...**.....
...*......
..........
..........

Generation = 30, Population = 18.
.......**.
.......**.
..........
..........
..........
.*....*...
.**.*.**..
...**.**..
...***....
..........

Generation = 40, Population = 14.
..........
..........
....**....
...**.*...
...*.***..
..*...**..
..**......
..........
..........
..........

Generation = 50, Population = 20.
..........
..........
..*.*.....
.*........
..*...*...
..**...*..
*.*..**...
...*.**...
....*.....
.****.....

Generation = 60, Population = 11.
..........
..........
..........
..........
..***.....
..**......
**..*.....
..........
....**....
...*......

*** Life<ConwayCell> 10x10 ***

Generation = 0, Population = 18.
*...*.....
....*.*..*
..*....*..
..*.......
..*..*..*.
..........
.......*..
.**.*...*.
........*.
.........*

Generation = 1, Population = 11.
.....*....
...*.*....
...*......
.***......
..........
..........
..........
.......**.
........**
..........

Generation = 2, Population = 11.
....*.....
..........
...*......
..**......
..*.......
..........
..........
.......***
.......***
..........

Generation = 3, Population = 12.
..........
..........
..**......
..**......
..**......
..........
........*.
.......*.*
.......*.*
........*.

Generation = 4, Population = 12.
..........
..........
..**......
.*..*.....
..**......
..........
........*.
.......*.*
.......*.*
........*.

Generation = 5, Population = 12.
..........
..........
..**......
.*..*.....
..**......
..........
........*.
.......*.*
.......*.*
........*.

*** Life<ConwayCell> 10x10 ***

Generation = 0, Population = 10.
..........
..........
..........
..........
**********
..........
..........
..........
..........
..........

Generation = 12, Population = 10.
..........
..........
..........
...*..*...
.***..***.
...*..*...
..........
..........
..........
..........

*** Life<ConwayCell> 3x3 ***

Generation = 0, Population = 1.
...
.*.
...

Generation = 2, Population = 0.
...
...
...
