*** Darwin 6x24 ***
Turn = 0.
  012345678901234567890123
0 r.......................
1 ...................t....
2 ........f..h............
3 ..................r..f..
4 ..h..........t..........
5 ..r......rf......f......

Turn = 2.
  012345678901234567890123
0 ........................
1 ...................t....
2 r.h.....fh..............
3 ..r.............r....f..
4 .............t..........
5 ........r.f......f......

Turn = 4.
  012345678901234567890123
0 ..h.....................
1 ..r................t....
2 ........fh..............
3 ..............r......f..
4 r............t..........
5 ......r...f......f......

Turn = 6.
  012345678901234567890123
0 ..r.....................
1 ..r................t....
2 ........fh..............
3 ............r........f..
4 .............t..........
5 r...r.....f......f......

Turn = 8.
  012345678901234567890123
0 r.......................
1 ....r..............t....
2 ........fh..............
3 ..........r..........f..
4 r............t..........
5 ..r.......f......f......

Turn = 10.
  012345678901234567890123
0 r.......................
1 ......r............t....
2 r.......fh..............
3 ........r............f..
4 .............t..........
5 r.........f......f......

Turn = 12.
  012345678901234567890123
0 r.......................
1 r.......r..........t....
2 ........fh..............
3 ......r..............f..
4 r............t..........
5 ..........f......f......

Turn = 14.
  012345678901234567890123
0 r.......................
1 ..........r........t....
2 r.......fh..............
3 r...r................f..
4 .............t..........
5 ..........f......f......

Turn = 16.
  012345678901234567890123
0 ..r.....................
1 ............r......t....
2 .r......fh..............
3 ..rr.................f..
4 .............t..........
5 ..........f......f......

Turn = 18.
  012345678901234567890123
0 ....r...................
1 ..............r....t....
2 ..rr....fh..............
3 .....................f..
4 .............t..........
5 ...r......f......f......

Turn = 20.
  012345678901234567890123
0 ..r...r.................
1 ................r..t....
2 .....r..fh..............
3 .....................f..
4 .............t..........
5 ....r.....f......f......

Turn = 22.
  012345678901234567890123
0 .r......r...............
1 ..................rt....
2 .......rfh..............
3 .....................f..
4 .............t..........
5 ......r...f......f......

*** Darwin 16x26 ***
Turn = 0.
  01234567890123456789012345
0 f.........................
1 ..........................
2 ...........r.........r....
3 ......t...................
4 ..........................
5 ..........................
6 ..........................
7 ......h...................
8 ..........................
9 ..........................
0 ......................r...
1 ..........................
2 ..........................
3 ..........................
4 ..........................
5 ..........................

Turn = 2.
  01234567890123456789012345
0 f.........................
1 ..........................
2 .......................r..
3 ......t...................
4 ...........r..............
5 ..........................
6 ..........................
7 ..........................
8 ......................r...
9 ......h...................
0 ..........................
1 ..........................
2 ..........................
3 ..........................
4 ..........................
5 ..........................

Turn = 4.
  01234567890123456789012345
0 f.........................
1 ..........................
2 .........................r
3 ......t...................
4 ..........................
5 ..........................
6 ...........r..........r...
7 ..........................
8 ..........................
9 ..........................
0 ..........................
1 ......h...................
2 ..........................
3 ..........................
4 ..........................
5 ..........................

Turn = 6.
  01234567890123456789012345
0 f.........................
1 ..........................
2 ..........................
3 ......t..................r
4 ......................r...
5 ..........................
6 ..........................
7 ..........................
8 ...........r..............
9 ..........................
0 ..........................
1 ..........................
2 ..........................
3 ......h...................
4 ..........................
5 ..........................

Turn = 8.
  01234567890123456789012345
0 f.........................
1 ..........................
2 ......................r...
3 ......t...................
4 ..........................
5 .........................r
6 ..........................
7 ..........................
8 ..........................
9 ..........................
0 ...........r..............
1 ..........................
2 ..........................
3 ..........................
4 ..........................
5 ......h...................

*** Darwin 31x19 ***
Turn = 0.
  0123456789012345678
0 t..................
1 ...................
2 ...................
3 ...................
4 ....t..............
5 ...................
6 ..........h........
7 ...................
8 ...................
9 ...................
0 ...................
1 ...................
2 ...................
3 ...................
4 ...................
5 ...................
6 ...................
7 .....r.............
8 ...................
9 ...................
0 ...................
1 ...................
2 ...................
3 ...................
4 .....f.............
5 ...................
6 ............t......
7 ...................
8 ...................
9 ...................
0 ..........r........

Turn = 5.
  0123456789012345678
0 t..................
1 ...................
2 ...................
3 ...................
4 ....t..............
5 ...................
6 ...............h...
7 ...................
8 ...................
9 ...................
0 ...................
1 ...................
2 ...................
3 ...................
4 ...................
5 ...................
6 ...................
7 ..........r........
8 ...................
9 ...................
0 ...................
1 ...................
2 ...................
3 ...................
4 .....f.............
5 ..........r........
6 ............t......
7 ...................
8 ...................
9 ...................
0 ...................

Turn = 10.
  0123456789012345678
0 t..................
1 ...................
2 ...................
3 ...................
4 ....t..............
5 ...................
6 ..................h
7 ...................
8 ...................
9 ...................
0 ...................
1 ...................
2 ...................
3 ...................
4 ...................
5 ...................
6 ...................
7 ...............r...
8 ...................
9 ...................
0 ..........r........
1 ...................
2 ...................
3 ...................
4 .....f.............
5 ...................
6 ............t......
7 ...................
8 ...................
9 ...................
0 ...................

*** Darwin 9x9 ***
Turn = 0.
  012345678
0 r...t....
1 ..t...r..
2 ........h
3 ......r..
4 .....h...
5 ..h.t....
6 .........
7 ....f.f..
8 .........

Turn = 4.
  012345678
0 r...t....
1 ..t......
2 ........r
3 .........
4 .......h.
5 h...t....
6 ......r.h
7 ....f..r.
8 .........

Turn = 8.
  012345678
0 ...tt....
1 ..t......
2 .........
3 ........r
4 .........
5 h...t..r.
6 ........r
7 ....f....
8 .....r.r.

Turn = 12.
  012345678
0 ...tt...r
1 ..t....r.
2 .........
3 .........
4 .........
5 h...t....
6 .........
7 ....f....
8 .r.r...r.

Turn = 16.
  012345678
0 ...trr..r
1 ..t......
2 .........
3 .........
4 .........
5 h...t....
6 r........
7 ....f....
8 r..r.....

Turn = 20.
  012345678
0 ..r..r...
1 ..tt.....
2 .........
3 .........
4 ....r....
5 r...t....
6 ..r......
7 ....f....
8 .r.r.....

Turn = 24.
  012345678
0 r..t.....
1 ..tt.....
2 .........
3 .........
4 ..r......
5 .......r.
6 ......r..
7 ....f....
8 r....r.r.

*** Darwin 18x30 ***
Turn = 0.
  012345678901234567890123456789
0 h.............................
1 ..............................
2 ..............................
3 ..............................
4 .....................f........
5 ..............................
6 .......t......................
7 .t............................
8 .t............................
9 ..............................
0 ..............................
1 .....................f........
2 ..............................
3 ..............................
4 ..............................
5 .....f........................
6 ..............................
7 ..............................

Turn = 3.
  012345678901234567890123456789
0 ...h..........................
1 ..............................
2 ..............................
3 ..............................
4 .....................f........
5 ..............................
6 .......t......................
7 .t............................
8 .t............................
9 ..............................
0 ..............................
1 .....................f........
2 ..............................
3 ..............................
4 ..............................
5 .....f........................
6 ..............................
7 ..............................

Turn = 6.
  012345678901234567890123456789
0 ......h.......................
1 ..............................
2 ..............................
3 ..............................
4 .....................f........
5 ..............................
6 .......t......................
7 .t............................
8 .t............................
9 ..............................
0 ..............................
1 .....................f........
2 ..............................
3 ..............................
4 ..............................
5 .....f........................
6 ..............................
7 ..............................

Turn = 9.
  012345678901234567890123456789
0 .........h....................
1 ..............................
2 ..............................
3 ..............................
4 .....................f........
5 ..............................
6 .......t......................
7 .t............................
8 .t............................
9 ..............................
0 ..............................
1 .....................f........
2 ..............................
3 ..............................
4 ..............................
5 .....f........................
6 ..............................
7 ..............................

Turn = 12.
  012345678901234567890123456789
0 ............h.................
1 ..............................
2 ..............................
3 ..............................
4 .....................f........
5 ..............................
6 .......t......................
7 .t............................
8 .t............................
9 ..............................
0 ..............................
1 .....................f........
2 ..............................
3 ..............................
4 ..............................
5 .....f........................
6 ..............................
7 ..............................

Turn = 15.
  012345678901234567890123456789
0 ...............h..............
1 ..............................
2 ..............................
3 ..............................
4 .....................f........
5 ..............................
6 .......t......................
7 .t............................
8 .t............................
9 ..............................
0 ..............................
1 .....................f........
2 ..............................
3 ..............................
4 ..............................
5 .....f........................
6 ..............................
7 ..............................

Turn = 18.
  012345678901234567890123456789
0 ..................h...........
1 ..............................
2 ..............................
3 ..............................
4 .....................f........
5 ..............................
6 .......t......................
7 .t............................
8 .t............................
9 ..............................
0 ..............................
1 .....................f........
2 ..............................
3 ..............................
4 ..............................
5 .....f........................
6 ..............................
7 ..............................

Turn = 21.
  012345678901234567890123456789
0 .....................h........
1 ..............................
2 ..............................
3 ..............................
4 .....................f........
5 ..............................
6 .......t......................
7 .t............................
8 .t............................
9 ..............................
0 ..............................
1 .....................f........
2 ..............................
3 ..............................
4 ..............................
5 .....f........................
6 ..............................
7 ..............................

*** Darwin 13x20 ***
Turn = 0.
  01234567890123456789
0 h.......f...........
1 ....................
2 ....................
3 ....................
4 ....................
5 ....f..........rr...
6 .....f........h..t..
7 ....................
8 ........f...........
9 ......r..h..........
0 ....................
1 ....................
2 ...r................

Turn = 2.
  01234567890123456789
0 h.......f...........
1 ....................
2 ....................
3 ....................
4 ..............h.....
5 ....f.........r.....
6 .....f...........t..
7 ......r........r....
8 ........f...........
9 ....................
0 ....................
1 .........h..........
2 .....r..............

Turn = 4.
  01234567890123456789
0 h.......f...........
1 ....................
2 ..............h.....
3 ....................
4 ....................
5 ....f.r.....r.......
6 .....f...........t..
7 ....................
8 ........f...........
9 ...............r....
0 ....................
1 ....................
2 .......r.h..........

Turn = 6.
  01234567890123456789
0 h.......f.....h.....
1 ....................
2 ....................
3 ......r.............
4 ....................
5 ....f.....r.........
6 .....f...........t..
7 ....................
8 ........f...........
9 ....................
0 ....................
1 ...............r....
2 ........rr..........

Turn = 8.
  01234567890123456789
0 h.......f.....h.....
1 ......r.............
2 ....................
3 ....................
4 ....................
5 ....f...r...........
6 .....f...........t..
7 ....................
8 ........f...........
9 ....................
0 ....................
1 ........rr..........
2 ...............r....

Turn = 10.
  01234567890123456789
0 h.....r.f.....h.....
1 ....................
2 ....................
3 ....................
4 ....................
5 ....f.r.............
6 .....f...........t..
7 ....................
8 ........f...........
9 ........rr..........
0 ....................
1 ....................
2 .............r......

Turn = 12.
  01234567890123456789
0 h......rr.....h.....
1 ....................
2 ....................
3 ....................
4 ....................
5 ....rr..............
6 .....f...........t..
7 .........r..........
8 .......rr...........
9 ....................
0 ....................
1 ....................
2 ...........r........

*** Darwin 20x10 ***
Turn = 0.
  0123456789
0 h.........
1 .hh.......
2 ..........
3 ..........
4 .r........
5 .r....f...
6 ..........
7 ..........
8 ..........
9 ..........
0 ..........
1 ..........
2 ..........
3 ...h...r..
4 ..........
5 ..........
6 ..........
7 ..........
8 ...h......
9 ..........

Turn = 2.
  0123456789
0 h.h.......
1 ..h.......
2 ..........
3 ..........
4 ...r......
5 ...r..f...
6 ..........
7 ..........
8 ..........
9 ..........
0 ..........
1 .......r..
2 ..........
3 .h........
4 ..........
5 ..........
6 ..........
7 ..........
8 .h........
9 ..........

Turn = 4.
  0123456789
0 h.h.......
1 ....h.....
2 ..........
3 ..........
4 .....r....
5 .....rf...
6 ..........
7 ..........
8 ..........
9 .......r..
0 ..........
1 ..........
2 ..........
3 h.........
4 ..........
5 ..........
6 ..........
7 ..........
8 h.........
9 ..........

Turn = 6.
  0123456789
0 h.h.......
1 ......h...
2 ..........
3 ..........
4 .......r..
5 ......r...
6 ..........
7 ......rr..
8 ..........
9 ..........
0 ..........
1 ..........
2 ..........
3 h.........
4 ..........
5 ..........
6 ..........
7 ..........
8 h.........
9 ..........

*** Darwin 5x9 ***
Turn = 0.
  012345678
0 r......h.
1 .ft..f..r
2 ....tf..r
3 ..r..r...
4 .....r...

Turn = 1.
  012345678
0 r.......h
1 .ft..f..r
2 ..r.tf..r
3 .....rr..
4 .........

Turn = 2.
  012345678
0 r.......h
1 .tr..f..r
2 ..r.tt..r
3 .....t.r.
4 .........

Turn = 3.
  012345678
0 .r......h
1 .tr..f..r
2 ..r.tt...
3 .....t.rr
4 .........

Turn = 4.
  012345678
0 ..r.....h
1 .tt..f..r
2 ..t.tt.r.
3 .....t...
4 ........r

Turn = 5.
  012345678
0 ...r....h
1 .tt..t.r.
2 ..t.tt..r
3 .....t...
4 ........r

*** Darwin 26x8 ***
Turn = 0.
  01234567
0 t.......
1 ........
2 ........
3 ........
4 ........
5 ...t....
6 ........
7 ........
8 ........
9 ........
0 ........
1 ........
2 ........
3 ........
4 ........
5 ..h.....
6 ........
7 ...f....
8 ...t....
9 tt......
0 .....r..
1 ........
2 ........
3 ........
4 ........
5 ........

Turn = 5.
  01234567
0 t.......
1 ........
2 ........
3 ........
4 ........
5 ...t....
6 ........
7 ........
8 ........
9 ........
0 ..h.....
1 ........
2 ........
3 ........
4 ........
5 ........
6 ........
7 ...t....
8 ...t....
9 tt......
0 .t......
1 ........
2 ........
3 ........
4 ........
5 ........

*** Darwin 6x24 ***
Turn = 0.
  012345678901234567890123
0 f.......................
1 .......h................
2 .....r.................h
3 ........................
4 ........................
5 ........................

Turn = 4.
  012345678901234567890123
0 f.......................
1 ...h....................
2 .........r.........h....
3 ........................
4 ........................
5 ........................

Turn = 8.
  012345678901234567890123
0 f.......................
1 h.......................
2 .............r.h........
3 ........................
4 ........................
5 ........................

Turn = 12.
  012345678901234567890123
0 f..............r........
1 h.............r.........
2 ........................
3 ........................
4 ........................
5 ........................

Turn = 16.
  012345678901234567890123
0 f...............r.r.....
1 h.......................
2 ........................
3 ........................
4 ........................
5 ........................

Turn = 20.
  012345678901234567890123
0 f...................r.r.
1 h.......................
2 ........................
3 ........................
4 ........................
5 ........................

Turn = 24.
  012345678901234567890123
0 f.......................
1 h.....................r.
2 .......................r
3 ........................
4 ........................
5 ........................

*** Darwin 7x31 ***
Turn = 0.
  0123456789012345678901234567890
0 h.....r........................
1 ...............................
2 .h.................t...........
3 ...................r...........
4 ...............................
5 ...............................
6 ..........................tt...

Turn = 4.
  0123456789012345678901234567890
0 ....h..........................
1 ...............................
2 h..................t...........
3 ...................t...........
4 ......r........................
5 ...............................
6 ..........................tt...

Turn = 8.
  0123456789012345678901234567890
0 ........h......................
1 ...............................
2 h..................t...........
3 ...................t...........
4 ...............................
5 ...............................
6 .....r....................tt...

*** Darwin 6x13 ***
Turn = 0.
  0123456789012
0 t............
1 .......t..h.f
2 ....h........
3 ......r......
4 ....t.....tr.
5 ............f

Turn = 1.
  0123456789012
0 t............
1 .......t.h..f
2 .............
3 ....t........
4 ....t.r...tt.
5 ............f

Turn = 2.
  0123456789012
0 t............
1 .......th...f
2 .............
3 ....t........
4 ....t.....tt.
5 ......r.....f

Turn = 3.
  0123456789012
0 t............
1 .......th...f
2 .............
3 ....t........
4 ....t.....tt.
5 ......r.....f

Turn = 4.
  0123456789012
0 t............
1 .......tt...f
2 .............
3 ....t........
4 ....t.....tt.
5 .....r......f

Turn = 5.
  0123456789012
0 t............
1 .......tt...f
2 .............
3 ....t........
4 ....t.....tt.
5 ....r.......f

Turn = 6.
  0123456789012
0 t............
1 .......tt...f
2 .............
3 ....t........
4 ....t.....tt.
5 ...r........f

Turn = 7.
  0123456789012
0 t............
1 .......tt...f
2 .............
3 ....t........
4 ....t.....tt.
5 ..r.........f

Turn = 8.
  0123456789012
0 t............
1 .......tt...f
2 .............
3 ....t........
4 ....t.....tt.
5 .r..........f

Turn = 9.
  0123456789012
0 t............
1 .......tt...f
2 .............
3 ....t........
4 ....t.....tt.
5 r...........f

Turn = 10.
  0123456789012
0 t............
1 .......tt...f
2 .............
3 ....t........
4 ....t.....tt.
5 r...........f

Turn = 11.
  0123456789012
0 t............
1 .......tt...f
2 .............
3 ....t........
4 ....t.....tt.
5 r...........f

Turn = 12.
  0123456789012
0 t............
1 .......tt...f
2 .............
3 ....t........
4 ....t.....tt.
5 r...........f

*** Darwin 15x14 ***
Turn = 0.
  01234567890123
0 f.............
1 ..............
2 ............r.
3 h.............
4 ..............
5 ....f.........
6 ............h.
7 ..............
8 h.............
9 .........hh..f
0 ..........t...
1 r.............
2 ............h.
3 ..............
4 .........r....

Turn = 5.
  01234567890123
0 f.............
1 h.............
2 ..............
3 ..............
4 .........h....
5 ....f........r
6 ..............
7 ..............
8 .....h........
9 .....h......hf
0 ..........t.h.
1 ..............
2 ..............
3 ..............
4 .r...........r

Turn = 10.
  01234567890123
0 f........h....
1 h.............
2 ..............
3 ..............
4 ..............
5 ....f.........
6 ..............
7 ..............
8 ..........h..r
9 h...........rr
0 ..........t.r.
1 ..............
2 ..............
3 ..............
4 ......r..r....

Turn = 15.
  01234567890123
0 f........h....
1 h.............
2 ..............
3 ..............
4 .............r
5 ....f.........
6 ...........rr.
7 .............r
8 ...........r..
9 h.............
0 ..............
1 ........r.....
2 ..........r...
3 ..............
4 .........r....

Turn = 20.
  01234567890123
0 f........h...r
1 h..........rr.
2 .............r
3 ...........r..
4 ..............
5 ....f.........
6 ........r.....
7 ..............
8 ..............
9 h.............
0 ..............
1 ..............
2 ..............
3 .............r
4 .............r

*** Darwin 27x14 ***
Turn = 0.
  01234567890123
0 f.............
1 ..............
2 ..............
3 ..............
4 ..............
5 ..............
6 ..............
7 ..............
8 ..............
9 ..............
0 ..............
1 ..............
2 ..............
3 ..............
4 ..............
5 ..............
6 ..............
7 ..............
8 ..............
9 ..............
0 ..............
1 ..............
2 ..............
3 ..............
4 ..............
5 ..............
6 ..............

Turn = 3.
  01234567890123
0 f.............
1 ..............
2 ..............
3 ..............
4 ..............
5 ..............
6 ..............
7 ..............
8 ..............
9 ..............
0 ..............
1 ..............
2 ..............
3 ..............
4 ..............
5 ..............
6 ..............
7 ..............
8 ..............
9 ..............
0 ..............
1 ..............
2 ..............
3 ..............
4 ..............
5 ..............
6 ..............

Turn = 6.
  01234567890123
0 f.............
1 ..............
2 ..............
3 ..............
4 ..............
5 ..............
6 ..............
7 ..............
8 ..............
9 ..............
0 ..............
1 ..............
2 ..............
3 ..............
4 ..............
5 ..............
6 ..............
7 ..............
8 ..............
9 ..............
0 ..............
1 ..............
2 ..............
3 ..............
4 ..............
5 ..............
6 ..............

Turn = 9.
  01234567890123
0 f.............
1 ..............
2 ..............
3 ..............
4 ..............
5 ..............
6 ..............
7 ..............
8 ..............
9 ..............
0 ..............
1 ..............
2 ..............
3 ..............
4 ..............
5 ..............
6 ..............
7 ..............
8 ..............
9 ..............
0 ..............
1 ..............
2 ..............
3 ..............
4 ..............
5 ..............
6 ..............

*** Darwin 24x26 ***
Turn = 0.
  01234567890123456789012345
0 f.........................
1 ..........t...............
2 ..........................
3 ..........................
4 ........h........t........
5 ..........................
6 ................f.........
7 ......................f...
8 ...............h..h..h....
9 ..........................
0 .........t................
1 ..........................
2 ..........................
3 ..........................
4 ..........................
5 ..........................
6 ..........................
7 ........................r.
8 ...................t......
9 ..........................
0 ..........................
1 ..........................
2 ..........................
3 .......t..................

Turn = 5.
  01234567890123456789012345
0 f.........................
1 ..........t...............
2 ..........................
3 ..................h..h....
4 .............h...t........
5 ..........................
6 ................f.........
7 ......................f...
8 ..........................
9 ..........................
0 .........t................
1 ..........................
2 ..........................
3 ...............h..........
4 ..........................
5 ..........................
6 ..........................
7 ...................r......
8 ...................t......
9 ..........................
0 ..........................
1 ..........................
2 ..........................
3 .......t..................

