*** Darwin 1x1 ***
Turn = 0.
  0
0 f

Turn = 1.
  0
0 f

*** Darwin 1x1 ***
Turn = 0.
  0
0 r

Turn = 1.
  0
0 r

*** Darwin 1x10 ***
Turn = 0.
  0123456789
0 f...r....f

Turn = 10.
  0123456789
0 .r..r....f

*** Darwin 1x10 ***
Turn = 0.
  0123456789
0 fffhhrhhhh

Turn = 15.
  0123456789
0 frrrrrrrrr

*** Darwin 2x2 ***
Turn = 0.
  01
0 rt
1 rt

Turn = 10.
  01
0 tt
1 tt

*** Darwin 3x3 ***
Turn = 0.
  012
0 rtr
1 thh
2 hth

Turn = 15.
  012
0 ttt
1 ttt
2 ttt

*** Darwin 4x4 ***
Turn = 0.
  0123
0 rtrt
1 thhh
2 thht
3 thhh

Turn = 21.
  0123
0 tttt
1 tttt
2 tttt
3 tttt

*** Darwin 3x3 ***
Turn = 0.
  012
0 rrr
1 rrr
2 rr.

Turn = 25.
  012
0 r.r
1 rrr
2 rrr

Turn = 50.
  012
0 rrr
1 rr.
2 rrr

Turn = 75.
  012
0 rrr
1 rrr
2 r.r

Turn = 100.
  012
0 rrr
1 rrr
2 rr.

*** Darwin 10x10 ***
Turn = 0.
  0123456789
0 r.........
1 ..........
2 ..........
3 ..........
4 ..........
5 ..........
6 ..........
7 ..........
8 ..........
9 .........t

Turn = 100.
  0123456789
0 ..........
1 ..........
2 ..........
3 ..........
4 .........r
5 ..........
6 ..........
7 ..........
8 ..........
9 .........r

*** Darwin 2x10 ***
Turn = 0.
  0123456789
0 hhhhh.....
1 ttttt.....

Turn = 5.
  0123456789
0 tttt.....h
1 ttttt.....
