-40 944
-40 -24 912
40 -24 912
72 -24 880
992
992
80 -80 -480 80 -80 -80 64
-168 -568 -80 -80 64
-48 -144 784
80 -80 168 -80 -80 -80 -80 -80 -80 112
-8 -8 -8 -8 -8 -8 -8 -8 -8 -8 -8 -8 -8 -8 -8 -8 -8 -8 -8 -8 -8 -8 -8 -8 -8 -8 -8 -8 -8 -8 -8 -8 -8 -8 -8 -8 -8 -8 -8 -8 -8 -8 -8 -8 -8 -8 -8 -8 -8 -8 -8 -8 -8 -8 -8 -8 -8 -8 -8 -8 -8 -16
-992
-960 -8 -8
