40 -8 -8 -8 -8 24 -8 -8 -8 -8 -80 -8 -8 -8 -8 632
-40 -24 912
-24 40 -16 80 -80 -72 -120 504
24 -16 -16 24 -32 -40 792
992
-160 48 -40 -48 -80 576
-64 -40 -40 -48 64 -360 -96 -208 8
-72 -72 -72 -72 -24 40 -72 -72 -72 352
56 -200 720
-792 192
-416 -384 176
