{
  "database": {
    "rules": "database.rules.json"
  },
  "hosting": {
    "public": "client/build",
    "ignore": [
      "firebase.json",
      "**/.*",
      "**/node_modules/**"
    ],
    "rewrites": [
      {
        "source": "**",
        "destination": "/index.html"
      }
    ],
    "headers": [{
      "source": "**/*.@(html)",
      "headers": [{
        "key": "Cache-Control",
        "value": "no-cache, no-store, must-revalidate"
      }]
    }, {
      "source": "**/*.@(jpg|jpeg|gif|png|js|css|map)",
      "headers" : [{
        "key": "Cache-Control",
        "value": "public, max-age=31536000"
      }]
    }, {
      "source": "**/",
      "headers" : [{
        "key": "Cache-Control",
        "value": "no-cache, no-store, must-revalidate"
      }]
    }]
  }
}
