Division,WeightClassKg,Place,Name,Team,BodyweightKg,Best3SquatKg,Best3BenchKg,Best3DeadliftKg,TotalKg,Equipment,Event,Sex
Boys,51.71,1,Angel Bermudez,Poteet,49.99,158.76,99.79,151.95,410.5,Single-ply,SBD,M
Boys,51.71,2,Nikalas Rosell,Laredo Alexander,49.9,140.61,92.99,151.95,385.55,Single-ply,SBD,M
Boys,51.71,3,Michael Mitchell,San Antonio Southside,51.07,140.61,68.04,154.22,362.87,Single-ply,SBD,M
Boys,55.79,4,Ocampo Raul,Natalia,51.89,124.74,61.23,145.15,331.12,Single-ply,SBD,M
Boys,51.71,5,Austin Schlemper,Universal City Randolph,50.44,111.13,56.7,127.01,294.84,Single-ply,SBD,M
Boys,51.71,6,Manuel Saldana,Natalia,50.89,102.06,52.16,136.08,290.3,Single-ply,SBD,M
Boys,51.71,7,Caleb Vera,Poteet,45.63,102.06,56.7,117.93,276.69,Single-ply,SBD,M
Boys,55.79,1,Jorge Saldana,Natalia,54.79,163.29,97.52,163.29,424.11,Single-ply,SBD,M
Boys,55.79,2,Raul Garcia,Cotulla,55.11,147.42,92.99,158.76,399.16,Single-ply,SBD,M
Boys,55.79,3,Orlando Gonzales,Natalia,55.16,131.54,74.84,185.97,392.36,Single-ply,SBD,M
Boys,55.79,4,Raul Guerra,Poteet,55.07,136.08,88.45,158.76,383.29,Single-ply,SBD,M
Boys,55.79,5,Oziel Padilla,Natalia,53.25,149.69,72.57,156.49,378.75,Single-ply,SBD,M
Boys,59.87,6,Joe Anthony Oliva,Poteet,55.97,92.99,49.9,133.81,276.69,Single-ply,SBD,M
Boys,55.79,DQ,Ocampo Carlos,Natalia,54.52,158.76,65.77,170.1,,Single-ply,SBD,M
Boys,59.87,1,Ricky Guerra,Poteet,58.6,199.58,127.01,208.65,535.24,Single-ply,SBD,M
Boys,59.87,2,Juan Chapa,San Antonio Southside,57.52,179.17,122.47,172.37,474,Single-ply,SBD,M
Boys,59.87,3,Mark Livesay,Floresville,59.69,176.9,108.86,170.1,455.86,Single-ply,SBD,M
Boys,59.87,4,Kade Lopez,San Antonio Southside,58.33,156.49,90.72,181.44,428.64,Single-ply,SBD,M
Boys,67.13,5,David Montealvo,Seguin,60.1,156.49,95.25,176.9,428.64,Single-ply,SBD,M
Boys,59.87,6,Phil Alvarado,Blanco,56.43,161.03,104.33,161.03,426.38,Single-ply,SBD,M
Boys,59.87,7,Eddie Torres #1,Blanco,57.15,142.88,95.25,172.37,410.5,Single-ply,SBD,M
Boys,59.87,8,Jacob Esquivel,Seguin,58.33,154.22,86.18,156.49,396.89,Single-ply,SBD,M
Boys,59.87,9,Luis Galaviz,San Antonio Kennedy,57.42,102.06,68.04,147.42,317.51,Single-ply,SBD,M
Boys,67.13,1,Jose Flores #3,San Antonio Kennedy,65.68,165.56,124.74,190.51,480.81,Single-ply,SBD,M
Boys,67.13,2,Juan Medina,Floresville,65.77,181.44,108.86,181.44,471.74,Single-ply,SBD,M
Boys,67.13,3,Albert Terrazas,San Antonio Southside,66.59,163.29,115.67,183.7,462.66,Single-ply,SBD,M
Boys,67.13,4,Justin Villegas,Seguin,66.86,170.1,117.93,172.37,460.4,Single-ply,SBD,M
Boys,67.13,5,Adrian Dominguez,Blanco,64.59,165.56,104.33,167.83,437.72,Single-ply,SBD,M
Boys,67.13,6,Jacob Ruiz,Blanco,61.14,124.74,79.38,133.81,337.93,Single-ply,SBD,M
Boys,67.13,7,Jacob Acosta,San Marcos,60.6,122.47,74.84,136.08,333.39,Single-ply,SBD,M
Boys,67.13,8,Arturo Rodriguez,San Antonio Kennedy,64.95,111.13,74.84,142.88,328.85,Single-ply,SBD,M
Boys,67.13,9,Alex Gill,Universal City Randolph,65.41,127.01,72.57,127.01,326.59,Single-ply,SBD,M
Boys,67.13,10,Isaiah Sandoval,Poteet,65.23,113.4,72.57,113.4,299.37,Single-ply,SBD,M
Boys,74.84,DQ,Thomas Larrea,Universal City Randolph,67.22,,,,,Single-ply,SBD,M
Boys,74.84,1,Josh Moreno,Comal Canyon,73.75,249.48,165.56,238.14,653.17,Single-ply,SBD,M
Boys,74.84,2,Alex Diaz #3,San Antonio Southside,73.48,233.6,120.2,215.46,569.26,Single-ply,SBD,M
Boys,74.84,3,Nicholson Steven,Natalia,71.94,215.46,99.79,190.51,505.76,Single-ply,SBD,M
Boys,74.84,4,Scott Gonzales,Floresville,70.4,188.24,122.47,190.51,501.22,Single-ply,SBD,M
Boys,74.84,5,Stefen Villanueva,Floresville,74.12,185.97,111.13,192.78,489.88,Single-ply,SBD,M
Boys,74.84,6,Aaron Davalos,San Antonio Kennedy,70.03,136.08,108.86,181.44,426.38,Single-ply,SBD,M
Boys,74.84,7,Alex Paredes,Natalia,72.12,192.78,68.04,158.76,419.57,Single-ply,SBD,M
Boys,74.84,8,Brock Gonzales,Universal City Randolph,73.66,136.08,88.45,172.37,396.89,Single-ply,SBD,M
Boys,74.84,9,Tim Mendoza,San Marcos,71.67,106.59,65.77,131.54,303.91,Single-ply,SBD,M
Boys,74.84,DQ,Joel Hinojosa,Seguin,73.26,,,,,Single-ply,SBD,M
Boys,82.1,1,Raynard Taylor,Comal Canyon,80.74,263.08,158.76,254.01,675.85,Single-ply,SBD,M
Boys,82.1,2,Sergio Zuniga,San Antonio Southside,81.28,251.74,142.88,208.65,603.28,Single-ply,SBD,M
Boys,82.1,3,Cj Felux,Floresville,79.11,204.12,120.2,247.21,571.53,Single-ply,SBD,M
Boys,82.1,4,Alex Juarez,Blanco,80.56,206.38,140.61,199.58,546.58,Single-ply,SBD,M
Boys,82.1,5,Bryce Turner,Laredo Alexander,76.66,219.99,149.69,172.37,542.04,Single-ply,SBD,M
Boys,82.1,6,Jourden Stanley,Marion,78.11,192.78,127.01,222.26,542.04,Single-ply,SBD,M
Boys,82.1,7,Mason Garcia #2,Comal Canyon,77.47,183.7,104.33,188.24,476.27,Single-ply,SBD,M
Boys,82.1,8,Hagan Brown,Floresville,79.83,174.63,106.59,170.1,451.32,Single-ply,SBD,M
Boys,82.1,9,Brandon Hand,Comal Canyon,76.2,149.69,102.06,179.17,430.91,Single-ply,SBD,M
Boys,82.1,10,Rene Velasquez,San Marcos,78.56,136.08,88.45,133.81,358.34,Single-ply,SBD,M
Boys,82.1,11,Mayan Holmes,Universal City Randolph,79.15,131.54,70.31,142.88,344.73,Single-ply,SBD,M
Boys,82.1,12,Gavin Hernandez,San Marcos,81.83,111.13,77.11,142.88,331.12,Single-ply,SBD,M
Boys,82.1,DQ,Dustin Del Toro,Cotulla,78.29,208.65,117.93,,,Single-ply,SBD,M
Boys,82.1,DQ,Francisco Martinez,Poteet,76.38,,,,,Single-ply,SBD,M
Boys,89.81,1,Ashton Rouska,Northside Brandeis,83.37,278.96,167.83,303.91,750.7,Single-ply,SBD,M
Boys,89.81,2,Rudy Pena,San Antonio Kennedy,83.64,204.12,106.59,229.06,539.77,Single-ply,SBD,M
Boys,89.81,3,Aikman Elrod,Blanco,89.27,204.12,133.81,195.04,532.97,Single-ply,SBD,M
Boys,99.79,4,Jesus Moron,San Antonio Southside,89.99,192.78,120.2,197.31,510.29,Single-ply,SBD,M
Boys,89.81,5,Cole Brust,Universal City Randolph,84.82,170.1,113.4,176.9,460.4,Single-ply,SBD,M
Boys,89.81,6,Gus Martinez,Blanco,83.91,154.22,92.99,183.7,430.91,Single-ply,SBD,M
Boys,89.81,7,Ramsey Tijerina,San Marcos,88.9,151.95,83.91,165.56,401.43,Single-ply,SBD,M
Boys,89.81,8,Jose Hernandez #5,San Marcos,87.63,154.22,90.72,154.22,399.16,Single-ply,SBD,M
Boys,89.81,9,Martinez David,Natalia,89.09,172.37,77.11,149.69,399.16,Single-ply,SBD,M
Boys,89.81,10,Caleb Ceaser,Universal City Randolph,84.37,142.88,90.72,154.22,387.82,Single-ply,SBD,M
Boys,89.81,11,Isaiah Jolivette,Universal City Randolph,85.32,136.08,72.57,138.35,347,Single-ply,SBD,M
Boys,89.81,DQ,Quentin Lazo,San Antonio Southside,84.28,,,,,Single-ply,SBD,M
Boys,89.81,DQ,Tyler Crisp,Poteet,88.45,226.8,,,,Single-ply,SBD,M
Boys,89.81,DQ,Casey Nagy,Comal Canyon,84.37,176.9,117.93,,,Single-ply,SBD,M
Boys,99.79,1,Khalid Schuler,Seguin,97.52,249.48,149.69,222.26,621.42,Single-ply,SBD,M
Boys,99.79,2,Mason LeBlanc,Blanco,96.52,247.21,140.61,229.06,616.89,Single-ply,SBD,M
Boys,99.79,3,Ryan Farrell,Universal City Randolph,90.99,235.87,140.61,213.19,589.67,Single-ply,SBD,M
Boys,99.79,4,Raphael Dehoyos,Marion,93.17,199.58,142.88,235.87,578.33,Single-ply,SBD,M
Boys,99.79,5,Bryce Sandoval,Poteet,97.52,204.12,124.74,197.31,526.17,Single-ply,SBD,M
Boys,99.79,6,Fred Rodriguez,Seguin,98.47,181.44,131.54,158.76,471.74,Single-ply,SBD,M
Boys,99.79,7,De'Angelo Sutton,Seguin,94.44,181.44,72.57,176.9,430.91,Single-ply,SBD,M
Boys,99.79,8,Jorge Riojas,San Marcos,92.08,117.93,86.18,145.15,349.27,Single-ply,SBD,M
Boys,99.79,DQ,Freddy Larry,Universal City Randolph,94.17,195.04,122.47,,,Single-ply,SBD,M
Boys,109.77,1,Max Flores,Laredo Alexander,109.77,272.16,174.63,251.74,698.53,Single-ply,SBD,M
Boys,109.77,2,Gilbert Garza,San Antonio Southside,107.86,240.4,170.1,217.72,628.23,Single-ply,SBD,M
Boys,109.77,3,Cory Opiela,Floresville,107.18,210.92,138.35,233.6,582.87,Single-ply,SBD,M
Boys,109.77,4,Rafael Herrijon,Comal Canyon,108.77,208.65,133.81,224.53,566.99,Single-ply,SBD,M
Boys,109.77,5,Martin Galvan,San Antonio Kennedy,108.5,195.04,145.15,185.97,526.17,Single-ply,SBD,M
Boys,109.77,6,James McFarlin,Blanco,108.59,183.7,117.93,190.51,492.15,Single-ply,SBD,M
Boys,109.77,7,Ermillo Escamilla,Natalia,103.33,122.47,79.38,122.47,324.32,Single-ply,SBD,M
Boys,109.77,DQ,EJ Ascona,Comal Canyon,105.69,208.65,142.88,,,Single-ply,SBD,M
Boys,124.74,1,Jesse Benevides Munoz,San Marcos,123.1,297.1,163.29,249.48,709.87,Single-ply,SBD,M
Boys,124.74,2,D'Antre Smith,Seguin,122.88,272.16,161.03,249.48,682.66,Single-ply,SBD,M
Boys,124.74,3,Gustavo Diaz,Laredo Alexander,116.12,265.35,174.63,233.6,673.58,Single-ply,SBD,M
Boys,124.74,4,Andre Hernandez,Natalia,111.58,244.94,122.47,238.14,605.55,Single-ply,SBD,M
Boys,124.74,5,Damien Cantu,San Antonio Kennedy,120.84,190.51,138.35,208.65,537.51,Single-ply,SBD,M
Boys,124.74,6,Pacheco Sonny,Natalia,111.49,167.83,120.2,226.8,514.83,Single-ply,SBD,M
Boys,124.74,7,Hector Garcia,Poteet,116.3,208.65,106.59,174.63,489.88,Single-ply,SBD,M
Boys,124.74,8,Dylan Sillero,San Marcos,113.76,204.12,88.45,181.44,474,Single-ply,SBD,M
Boys,124.74,9,AJ Bosquez,San Marcos,120.56,154.22,79.38,158.76,392.36,Single-ply,SBD,M
Boys,124.74,10,Tristen Bronson,Comal Canyon,112.22,147.42,74.84,156.49,378.75,Single-ply,SBD,M
Boys,124.74,DQ,Duke Aguirre,San Antonio Kennedy,116.57,240.4,,,,Single-ply,SBD,M
Boys,124.74,DQ,Hunter Goodman,Blanco,121.11,,,,,Single-ply,SBD,M
Boys,124.74+,1,Ben Hartmen,Del Rio,132.99,238.14,170.1,274.42,682.66,Single-ply,SBD,M
Boys,124.74+,2,Navarro Ray,Natalia,127.55,272.16,111.13,224.53,607.81,Single-ply,SBD,M
Boys,124.74+,3,Ronnie Lucio,Poteet,144.15,226.8,138.35,199.58,564.72,Single-ply,SBD,M
Boys,124.74+,4,Michael Balderas,Poteet,125.74,260.82,102.06,192.78,555.65,Single-ply,SBD,M
Boys,124.74+,5,Jesse Martinez,San Antonio Kennedy,154.86,167.83,97.52,167.83,433.18,Single-ply,SBD,M
Boys,124.74+,DQ,Jose Herrera,San Antonio Southside,130.09,,,,,Single-ply,SBD,M
Boys,124.74+,DQ,Sallee Kenneth,Natalia,133.54,222.26,111.13,,,Single-ply,SBD,M
