Division,WeightClassKg,Place,Name,Team,BodyweightKg,Best3SquatKg,Best3BenchKg,Best3DeadliftKg,TotalKg,Equipment,Event,Sex,BirthDate
Boys,51.71,1,Yancy Perkins,Comanche,51.26,106.59,54.43,131.54,292.57,Single-ply,SBD,M,
Boys,51.71,2,Aiden Baker,Hamilton,45.45,83.91,43.09,83.91,210.92,Single-ply,SBD,M,
Boys,51.71,3,Tyler Anglin,Bangs,51.26,74.84,36.29,86.18,197.31,Single-ply,SBD,M,
Boys,55.79,1,Jacob Foster,Rio Vista,55.61,122.47,79.38,136.08,337.93,Single-ply,SBD,M,
Boys,55.79,2,Jason Rainbolt,Hamilton,55.34,99.79,61.23,124.74,285.76,Single-ply,SBD,M,
Boys,55.79,3,Jaxzen Mask,San Saba,54.43,81.65,43.09,102.06,226.8,Single-ply,SBD,M,
Boys,55.79,DQ,Sam See,Brownwood,55.61,115.67,,,,Single-ply,SBD,M,
Boys,59.87,1,Damien Santillanes,Bangs,59.15,167.83,95.25,181.44,444.52,Single-ply,SBD,M,
Boys,59.87,2,Alex Vargas,Rogers,57.97,149.69,92.99,136.08,378.75,Single-ply,SBD,M,
Boys,59.87,3,Arnoldo Moreno,Dublin,57.15,145.15,74.84,154.22,374.21,Single-ply,SBD,M,
Boys,59.87,4,Adan Huron,San Saba,59.87,136.08,79.38,154.22,369.68,Single-ply,SBD,M,
Boys,59.87,5,Zach Ainsworth,Junction,57.52,124.74,77.11,136.08,337.93,Single-ply,SBD,M,
Boys,59.87,6,Seth Clemmons,Comanche,59.42,120.2,65.77,140.61,326.59,Single-ply,SBD,M,
Boys,59.87,7,Tyler Johnson,San Saba,59.87,102.06,68.04,111.13,281.23,Single-ply,SBD,M,
Boys,59.87,8,Javier Vanegas,Goldthwaite,56.97,95.25,56.7,113.4,265.35,Single-ply,SBD,M,
Boys,59.87,DQ,Franco Franco,San Saba,58.69,,,,,Single-ply,SBD,M,
Boys,59.87,DQ,Richard Yanez,Thrall,58.24,113.4,65.77,,,Single-ply,SBD,M,
Boys,59.87,DQ,Daunte Crawford,Meridian,58.97,111.13,,,,Single-ply,SBD,M,
Boys,59.87,DQ,Alonso Caso,Lometa,59.87,,,,,Single-ply,SBD,M,
Boys,67.13,1,Anthony Seider,Lometa,66.5,183.7,95.25,204.12,483.08,Single-ply,SBD,M,
Boys,67.13,2,Aaron Suniga,Comanche,63.59,176.9,102.06,181.44,460.4,Single-ply,SBD,M,
Boys,67.13,3,Dylan Mickler,Coleman,66.32,156.49,102.06,183.7,442.25,Single-ply,SBD,M,
Boys,67.13,4,Uriah King,Brownwood,67.13,156.49,102.06,156.49,415.04,Single-ply,SBD,M,
Boys,67.13,5,Hayden Jones,Thrall,65.41,140.61,97.52,163.29,401.43,Single-ply,SBD,M,
Boys,67.13,6,Bryan Thuy,Rogers,65.32,151.95,77.11,154.22,383.29,Single-ply,SBD,M,
Boys,67.13,7,Davin Crouch,Hamilton,66.41,142.88,88.45,149.69,381.02,Single-ply,SBD,M,
Boys,67.13,8,Alex Thiele,Hamilton,67.13,136.08,77.11,163.29,376.48,Single-ply,SBD,M,
Boys,67.13,9,Brandon Sisson,Bangs,62.32,129.27,81.65,156.49,367.41,Single-ply,SBD,M,
Boys,67.13,10,Max Finn,Thrall,67.13,131.54,77.11,154.22,362.87,Single-ply,SBD,M,
Boys,67.13,11,Angel Gonzales #1,Hico,61.87,142.88,61.23,151.95,356.07,Single-ply,SBD,M,
Boys,67.13,12,Ben Bruce,Hamilton,63.68,129.27,72.57,149.69,351.53,Single-ply,SBD,M,
Boys,67.13,13,Joshua Rucker,Sidney,63.14,113.4,79.38,142.88,335.66,Single-ply,SBD,M,
Boys,67.13,14,Brayden Harlan,Goldthwaite,65.23,88.45,61.23,122.47,272.16,Single-ply,SBD,M,
Boys,67.13,15,Justin Huddleston,Coleman,60.87,77.11,56.7,106.59,240.4,Single-ply,SBD,M,
Boys,67.13,DQ,Kaden Bessent,Brownwood,67.04,156.49,95.25,,,Single-ply,SBD,M,
Boys,67.13,DQ,Victor Orozco,Meridian,64.41,161.03,,,,Single-ply,SBD,M,
Boys,67.13,DQ,Zach Chapman,Jonesboro,66.22,88.45,,,,Single-ply,SBD,M,
Boys,74.84,1,Gilberto Baez,San Saba,74.84,201.85,113.4,231.33,546.58,Single-ply,SBD,M,
Boys,74.84,2,Luis Ramírez,San Saba,74.84,174.63,102.06,185.97,462.66,Single-ply,SBD,M,
Boys,74.84,3,Cory Scantling,Sidney,72.39,165.56,102.06,188.24,455.86,Single-ply,SBD,M,
Boys,74.84,4,Trevor Lorah,Bangs,69.58,172.37,102.06,167.83,442.25,Single-ply,SBD,M,
Boys,74.84,5,Kody Arsenault,Rio Vista,73.94,149.69,113.4,165.56,428.64,Single-ply,SBD,M,
Boys,74.84,6,Alan Garza,Comanche,71.85,165.56,90.72,161.03,417.3,Single-ply,SBD,M,
Boys,74.84,7,Brady Taylor,Meridian,72.57,165.56,88.45,156.49,410.5,Single-ply,SBD,M,
Boys,74.84,8,Larry Telles,Junction,69.13,142.88,97.52,165.56,405.97,Single-ply,SBD,M,
Boys,74.84,9,Cade Bauman,Comanche,69.49,149.69,95.25,149.69,394.63,Single-ply,SBD,M,
Boys,74.84,10,Justin Yarbrough,San Saba,73.21,149.69,74.84,170.1,394.63,Single-ply,SBD,M,
Boys,74.84,11,Jack Huff,Brownwood,68.67,133.81,95.25,161.03,390.09,Single-ply,SBD,M,
Boys,74.84,12,Cj Seal,Florence,73.57,138.35,95.25,147.42,381.02,Single-ply,SBD,M,
Boys,74.84,13,Jessy Anzua,Goldthwaite,73.94,149.69,83.91,145.15,378.75,Single-ply,SBD,M,
Boys,74.84,14,Ryland Carlile,Florence,74.3,133.81,83.91,145.15,362.87,Single-ply,SBD,M,
Boys,74.84,15,CJ DeLeon,Hamilton,74.43,124.74,77.11,147.42,349.27,Single-ply,SBD,M,
Boys,74.84,16,Jacob Young #3,Hamilton,72.57,122.47,56.7,136.08,315.25,Single-ply,SBD,M,
Boys,74.84,17,Baylen Gutierrez,Comanche,69.4,111.13,68.04,124.74,303.91,Single-ply,SBD,M,
Boys,74.84,18,Dalton Richter,Thrall,72.39,99.79,70.31,90.72,260.82,Single-ply,SBD,M,
Boys,74.84,DQ,Mario Mendez,Thrall,74.84,,,,,Single-ply,SBD,M,
Boys,74.84,DQ,Josh Kinnard,Sidney,74.84,,,,,Single-ply,SBD,M,
Boys,74.84,DQ,Matt Rosas,Meridian,74.57,165.56,88.45,,,Single-ply,SBD,M,
Boys,74.84,DQ,Dustan Bowers,Meridian,73.03,138.35,,,,Single-ply,SBD,M,
Boys,74.84,DQ,Andrew Wheeless,Jonesboro,74.84,,,,,Single-ply,SBD,M,
Boys,74.84,DQ,Eric Zendjas,Hico,69.85,,,,,Single-ply,SBD,M,
Boys,74.84,DQ,Dylan Diaz,Coleman,73.94,170.1,,,,Single-ply,SBD,M,
Boys,82.1,1,Ruben Reyes,Stephenville,78.93,204.12,124.74,224.53,553.38,Single-ply,SBD,M,
Boys,82.1,2,Colby Henry #2,Lometa,78.29,204.12,140.61,185.97,530.7,Single-ply,SBD,M,
Boys,82.1,3,Stuart Cortez,Dublin,81.65,199.58,140.61,190.51,530.7,Single-ply,SBD,M,
Boys,82.1,4,Gage Sikes,Coleman,79.65,195.04,122.47,204.12,521.63,Single-ply,SBD,M,
Boys,82.1,5,Aaron Anzua,Goldthwaite,81.1,147.42,106.59,170.1,424.11,Single-ply,SBD,M,
Boys,82.1,6,Jose Valdez,Goldthwaite,76.2,158.76,90.72,158.76,408.23,Single-ply,SBD,M,
Boys,82.1,7,Colby Marinik,Rogers,82.1,174.63,68.04,156.49,399.16,Single-ply,SBD,M,
Boys,82.1,8,Jeriah Grey,Rio Vista,77.11,156.49,90.72,147.42,394.63,Single-ply,SBD,M,
Boys,82.1,9,Kaleb Sanders,Jonesboro,76.2,124.74,97.52,161.03,383.29,Single-ply,SBD,M,
Boys,82.1,10,Lilley Rowdy,Florence,75.57,120.2,72.57,133.81,326.59,Single-ply,SBD,M,
Boys,82.1,DQ,Bladen Calley,San Saba,78.47,195.04,,,,Single-ply,SBD,M,
Boys,89.81,1,Eli Salinas,San Saba,88.99,226.8,136.08,219.99,582.87,Single-ply,SBD,M,
Boys,89.81,2,Stone Sears,San Saba,83.91,188.24,138.35,208.65,535.24,Single-ply,SBD,M,
Boys,89.81,3,Colton Accamazo,Stephenville,89.54,201.85,124.74,206.38,532.97,Single-ply,SBD,M,
Boys,89.81,4,Diego Crader,Early,83.01,204.12,142.88,181.44,528.44,Single-ply,SBD,M,
Boys,89.81,5,Corring Hill,Comanche,89.81,192.78,111.13,210.92,514.83,Single-ply,SBD,M,
Boys,89.81,6,Aries Vanderlaan,Goldthwaite,89.81,181.44,124.74,181.44,487.61,Single-ply,SBD,M,
Boys,89.81,7,Caden McCarley,Florence,82.74,149.69,90.72,181.44,421.84,Single-ply,SBD,M,
Boys,89.81,8,Saul Vaquera,Goldthwaite,88.45,163.29,97.52,158.76,419.57,Single-ply,SBD,M,
Boys,89.81,9,Cade Tindol,Thrall,83.1,158.76,104.33,145.15,408.23,Single-ply,SBD,M,
Boys,89.81,10,Tomas Gutierez,Sidney,86,145.15,79.38,167.83,392.36,Single-ply,SBD,M,
Boys,89.81,11,Jaime Reyna,Rogers,83.46,136.08,79.38,145.15,360.61,Single-ply,SBD,M,
Boys,89.81,DQ,Mason Davis,Rogers,89.36,226.8,133.81,,,Single-ply,SBD,M,
Boys,89.81,DQ,Aiden Hill,Florence,83.73,158.76,,,,Single-ply,SBD,M,
Boys,99.79,1,Landin Short,San Saba,99.61,238.14,158.76,238.14,635.03,Single-ply,SBD,M,
Boys,99.79,2,Gabe Juarez,Stephenville,98.25,215.46,127.01,217.72,560.19,Single-ply,SBD,M,
Boys,99.79,3,Xavier Herrera,Comanche,91.53,217.72,131.54,195.04,544.31,Single-ply,SBD,M,
Boys,99.79,4,Ethan Pesina,Brownwood,99.25,206.38,124.74,204.12,535.24,Single-ply,SBD,M,
Boys,99.79,5,Anthony Gonzalez,Meridian,93.44,204.12,108.86,206.38,519.36,Single-ply,SBD,M,
Boys,99.79,6,Alex DeLeon,Stephenville,91.53,183.7,117.93,185.97,487.61,Single-ply,SBD,M,
Boys,99.79,7,Zach Chavarria,Stephenville,94.8,179.17,108.86,199.58,487.61,Single-ply,SBD,M,
Boys,99.79,8,Miguel Leos,Comanche,90.72,170.1,102.06,181.44,453.59,Single-ply,SBD,M,
Boys,99.79,9,Ron Ramirez,Hamilton,98.61,167.83,74.84,149.69,392.36,Single-ply,SBD,M,
Boys,99.79,10,Dylan Rogers,Coleman,97.98,111.13,77.11,117.93,306.17,Single-ply,SBD,M,
Boys,99.79,DQ,Steven Childress,Junction,99.79,,,,,Single-ply,SBD,M,
Boys,99.79,DQ,Carl Willliams,Meridian,99.79,,,,,Single-ply,SBD,M,
Boys,109.77,1,Brent Batch,Rio Vista,108.05,208.65,149.69,249.48,607.81,Single-ply,SBD,M,
Boys,109.77,2,Michael Stanley #1,Dublin,105.69,208.65,151.95,201.85,562.45,Single-ply,SBD,M,
Boys,109.77,3,Jose Najera,Hamilton,108.14,226.8,131.54,195.04,553.38,Single-ply,SBD,M,
Boys,109.77,4,Daniel Herrera,San Saba,107.77,226.8,129.27,192.78,548.85,Single-ply,SBD,M,
Boys,109.77,5,Alex Reyna,Brownwood,107.86,201.85,120.2,192.78,514.83,Single-ply,SBD,M,
Boys,109.77,6,Mason Butchee,Stephenville,104.33,172.37,136.08,172.37,480.81,Single-ply,SBD,M,
Boys,109.77,7,Kevin Garcia,Junction,100.24,188.24,115.67,163.29,467.2,Single-ply,SBD,M,
Boys,109.77,DQ,Wyatt Faulkner,Jonesboro,109.77,,,,,Single-ply,SBD,M,
Boys,124.74,1,Brad Robinson,Brownwood,111.13,256.28,142.88,219.99,619.15,Single-ply,SBD,M,
Boys,124.74,2,Ethan Cumins,Rio Vista,122.47,235.87,145.15,226.8,607.81,Single-ply,SBD,M,
Boys,124.74,3,Cristian Ramirez,San Saba,120.84,249.48,127.01,192.78,569.26,Single-ply,SBD,M,
Boys,124.74,4,Damon McClary,Hico,110.68,233.6,131.54,197.31,562.45,Single-ply,SBD,M,
Boys,124.74,5,Jimi Brown,Brownwood,114.76,195.04,124.74,188.24,508.02,Single-ply,SBD,M,
Boys,124.74,6,Adrian Montano,Stephenville,115.85,204.12,113.4,185.97,503.49,Single-ply,SBD,M,
Boys,124.74,7,Oscar Gaona,Valley Mills,121.11,208.65,102.06,192.78,503.49,Single-ply,SBD,M,
Boys,124.74,8,Tyler Shelton,Rogers,112.49,163.29,83.91,154.22,401.43,Single-ply,SBD,M,
Boys,124.74,9,AJ McCoy,Goldthwaite,112.49,145.15,90.72,156.49,392.36,Single-ply,SBD,M,
Boys,124.74,10,Andy Cumins,Rio Vista,111.49,136.08,102.06,151.95,390.09,Single-ply,SBD,M,
Boys,124.74,11,Charlie Bigham,Coleman,112.4,136.08,104.33,149.69,390.09,Single-ply,SBD,M,
Boys,124.74,DQ,Cesar Avila,Junction,124.74,,,,,Single-ply,SBD,M,
Boys,124.74,DQ,Tyler Morgan,Rogers,124.74,,,,,Single-ply,SBD,M,
Boys,124.74+,1,Jeron Conine,Comanche,126.92,272.16,165.56,226.8,664.51,Single-ply,SBD,M,
Boys,124.74+,2,Logan Davis,Stephenville,134.26,226.8,151.95,235.87,614.62,Single-ply,SBD,M,
Boys,124.74+,3,Jeryd Fain,Coleman,133.72,251.74,154.22,204.12,610.08,Single-ply,SBD,M,
Boys,124.74+,4,Rafael Benavides,Junction,134.72,238.14,124.74,219.99,582.87,Single-ply,SBD,M,
Boys,124.74+,5,Gavin Sharp,Stephenville,138.35,208.65,131.54,204.12,544.31,Single-ply,SBD,M,
Boys,124.74+,6,Wyatt Adams,Rogers,142.34,183.7,115.67,147.42,446.79,Single-ply,SBD,M,
Boys,124.74+,7,Jacob Valdez,Goldthwaite,126.1,158.76,86.18,163.29,408.23,Single-ply,SBD,M,
