Division,WeightClassKg,Place,Name,Team,BodyweightKg,Best3SquatKg,Best3BenchKg,Best3DeadliftKg,TotalKg,Equipment,Event,Sex,BirthDate
Boys,51.71,1,Jacob Guerrero,Yorktown,50.98,158.76,88.45,154.22,401.43,Single-ply,SBD,M,
Boys,51.71,2,Michael Benavides,Agua Dulce,51.07,142.88,72.57,151.95,367.41,Single-ply,SBD,M,
Boys,51.71,3,Noah Estrada,Agua Dulce,50.89,136.08,72.57,154.22,362.87,Single-ply,SBD,M,
Boys,55.79,1,Lane Smith,Ozona,53.98,163.29,97.52,172.37,433.18,Single-ply,SBD,M,
Boys,55.79,2,David Perez,Ben Bolt-Palito Blanco,54.7,156.49,102.06,165.56,424.11,Single-ply,SBD,M,
Boys,55.79,3,Bryan Peralta,Yorktown,55.34,156.49,70.31,163.29,390.09,Single-ply,SBD,M,
Boys,55.79,4,Ethan Cavazos,Agua Dulce,55.43,129.27,81.65,136.08,347,Single-ply,SBD,M,
Boys,55.79,5,Misael Hernandez,Rocksprings,54.07,140.61,65.77,124.74,331.12,Single-ply,SBD,M,
Boys,55.79,6,Jayden Moya,Refugio,53.34,102.06,70.31,127.01,299.37,Single-ply,SBD,M,
Boys,55.79,7,Braeden Martin,Rocksprings,54.7,104.33,74.84,111.13,290.3,Single-ply,SBD,M,
Boys,55.79,DQ,Marcos Morin,Eldorado,55.34,,,,,Single-ply,SBD,M,
Boys,59.87,1,Gavin Gutierrez,Runge,57.7,145.15,86.18,161.03,392.36,Single-ply,SBD,M,
Boys,59.87,2,Javier Ontiveros,Refugio,59.51,120.2,90.72,174.63,385.55,Single-ply,SBD,M,
Boys,59.87,3,Jason Covarrubiaz,Eldorado,58.69,142.88,77.11,163.29,383.29,Single-ply,SBD,M,
Boys,59.87,4,Morris Brown,Kenedy,58.06,145.15,79.38,151.95,376.48,Single-ply,SBD,M,
Boys,59.87,5,Xzander Espinosa,Freer,59.87,117.93,65.77,136.08,319.78,Single-ply,SBD,M,
Boys,59.87,6,Jose Contreras,Eldorado,59.87,99.79,63.5,136.08,299.37,Single-ply,SBD,M,
Boys,67.13,1,Sammy Bustamante,Center Point,65.77,213.19,117.93,204.12,535.24,Single-ply,SBD,M,
Boys,67.13,2,Alex Sanchez,Kenedy,64.95,188.24,104.33,204.12,496.68,Single-ply,SBD,M,
Boys,67.13,3,Joe Fraga,Runge,64.23,172.37,97.52,199.58,469.47,Single-ply,SBD,M,
Boys,67.13,4,Ramiro Torres,Runge,66.32,165.56,120.2,161.03,446.79,Single-ply,SBD,M,
Boys,67.13,5,Luis Uballe,La Pryor,66.22,151.95,104.33,172.37,428.64,Single-ply,SBD,M,
Boys,67.13,6,Trent Jones,Runge,66.5,163.29,99.79,165.56,428.64,Single-ply,SBD,M,
Boys,67.13,7,Roel Garcia,Freer,65.77,154.22,99.79,167.83,421.84,Single-ply,SBD,M,
Boys,67.13,8,Bryan Leal,Kenedy,62.32,156.49,74.84,156.49,387.82,Single-ply,SBD,M,
Boys,67.13,9,Jude Hueber,Center Point,65.14,142.88,92.99,149.69,385.55,Single-ply,SBD,M,
Boys,67.13,10,Jacob Perez #10,Freer,62.51,142.88,81.65,158.76,383.29,Single-ply,SBD,M,
Boys,67.13,11,Gavin Gonzales,Junction,64.23,115.67,72.57,136.08,324.32,Single-ply,SBD,M,
Boys,67.13,12,Nico Uballe,La Pryor,61.51,92.99,79.38,115.67,288.03,Single-ply,SBD,M,
Boys,74.84,1,Valentin Garza,La Pryor,71.4,215.46,129.27,233.6,578.33,Single-ply,SBD,M,
Boys,74.84,2,Adrian Mata,Rocksprings,71.4,226.8,99.79,231.33,557.92,Single-ply,SBD,M,
Boys,74.84,3,Jaydin Chapa,Kenedy,74.75,176.9,106.59,197.31,480.81,Single-ply,SBD,M,
Boys,74.84,4,Marques Salinas,Freer,73.57,183.7,113.4,172.37,469.47,Single-ply,SBD,M,
Boys,74.84,5,Nemo Jacobo,Agua Dulce,74.66,183.7,102.06,172.37,458.13,Single-ply,SBD,M,
Boys,74.84,6,Korbin Covarrubiaz,Eldorado,72.03,156.49,104.33,195.04,455.86,Single-ply,SBD,M,
Boys,74.84,7,Alvaro Bustamante,Center Point,72.57,174.63,88.45,183.7,446.79,Single-ply,SBD,M,
Boys,74.84,8,Matthew Delagarza,Ozona,72.94,174.63,106.59,163.29,444.52,Single-ply,SBD,M,
Boys,74.84,9,Tap Shanklin,Rocksprings,74.3,183.7,90.72,170.1,444.52,Single-ply,SBD,M,
Boys,74.84,10,Eddie Rios,Ozona,71.76,149.69,88.45,138.35,376.48,Single-ply,SBD,M,
Boys,74.84,11,Ricky Romo,Eldorado,70.4,136.08,70.31,145.15,351.53,Single-ply,SBD,M,
Boys,74.84,DQ,Carlos Cantu,Ozona,71.76,,,,,Single-ply,SBD,M,
Boys,82.1,1,Julian Flores,La Pryor,79.29,208.65,156.49,226.8,591.94,Single-ply,SBD,M,
Boys,82.1,2,Arlie Hernandez,Ozona,75.66,217.72,127.01,183.7,528.44,Single-ply,SBD,M,
Boys,82.1,3,Arnold Navarro,Ben Bolt-Palito Blanco,79.11,192.78,124.74,197.31,514.83,Single-ply,SBD,M,
Boys,82.1,4,Larry Telles,Junction,75.39,161.03,117.93,183.7,462.66,Single-ply,SBD,M,
Boys,82.1,5,Donald Mann,Agua Dulce,80.38,181.44,111.13,170.1,462.66,Single-ply,SBD,M,
Boys,82.1,6,Stephen Arreola,Center Point,79.11,188.24,92.99,172.37,453.59,Single-ply,SBD,M,
Boys,82.1,7,Calvin Lopez,Kenedy,78.74,179.17,111.13,149.69,439.98,Single-ply,SBD,M,
Boys,82.1,8,Brody Levine,Runge,78.11,149.69,113.4,172.37,435.45,Single-ply,SBD,M,
Boys,82.1,9,Garrett Porter,Eldorado,81.92,151.95,99.79,170.1,421.84,Single-ply,SBD,M,
Boys,82.1,DQ,Patrick Segura,Kenedy,78.38,,,,,Single-ply,SBD,M,
Boys,89.81,1,Robert Cardenas,Ben Bolt-Palito Blanco,88.36,217.72,174.63,226.8,619.15,Single-ply,SBD,M,
Boys,89.81,2,Daniel Sambrano,La Pryor,87.63,226.8,142.88,226.8,596.47,Single-ply,SBD,M,
Boys,89.81,3,Alvin Amador,Kenedy,85.82,238.14,131.54,224.53,594.21,Single-ply,SBD,M,
Boys,89.81,4,Jerry Reyes,La Villa,88.36,254.01,151.95,183.7,589.67,Single-ply,SBD,M,
Boys,89.81,5,Carlos Vinton,Agua Dulce,87.72,206.38,120.2,201.85,528.44,Single-ply,SBD,M,
Boys,89.81,6,Adrian Flores,Kenedy,87,206.38,102.06,201.85,510.29,Single-ply,SBD,M,
Boys,89.81,7,Eduardo Hernandez,Agua Dulce,85.73,183.7,106.59,208.65,498.95,Single-ply,SBD,M,
Boys,89.81,DQ,Emmanuel Venegas,Ozona,88.81,213.19,,,,Single-ply,SBD,M,
Boys,89.81,DQ,Saul Ramos,La Pryor,85.09,,,,,Single-ply,SBD,M,
Boys,89.81,DQ,James Vasquez,La Pryor,87.82,,,,,Single-ply,SBD,M,
Boys,99.79,1,Austin Barrera,Rocksprings,91.72,254.01,124.74,226.8,605.55,Single-ply,SBD,M,
Boys,99.79,2,Nando Vargas,Kenedy,94.26,231.33,115.67,240.4,587.4,Single-ply,SBD,M,
Boys,99.79,3,Jake Laque,Center Point,97.34,240.4,129.27,217.72,587.4,Single-ply,SBD,M,
Boys,99.79,4,Roberto Rivas,Rocksprings,92.08,231.33,102.06,233.6,566.99,Single-ply,SBD,M,
Boys,99.79,5,Troy Reynolds,Runge,95.62,244.94,131.54,181.44,557.92,Single-ply,SBD,M,
Boys,99.79,6,Santos Castillo,Agua Dulce,98.16,226.8,120.2,208.65,555.65,Single-ply,SBD,M,
Boys,99.79,7,Michael Rocha,Refugio,96.89,174.63,124.74,204.12,503.49,Single-ply,SBD,M,
Boys,99.79,8,Ethan Hyde,Rocksprings,90.17,195.04,113.4,192.78,501.22,Single-ply,SBD,M,
Boys,99.79,9,Kaleb Garza,Freer,91.17,188.24,104.33,190.51,483.08,Single-ply,SBD,M,
Boys,99.79,10,Kyle Sanders,Rocksprings,91.53,206.38,111.13,165.56,483.08,Single-ply,SBD,M,
Boys,99.79,11,Peter Castro,Agua Dulce,96.16,163.29,90.72,195.04,449.06,Single-ply,SBD,M,
Boys,99.79,12,Jake Torres,Agua Dulce,96.07,170.1,77.11,161.03,408.23,Single-ply,SBD,M,
Boys,109.77,1,Marcos Gonzalez,Ben Bolt-Palito Blanco,107.23,312.98,217.72,308.44,839.15,Single-ply,SBD,M,
Boys,109.77,2,Ej Tarango,Freer,106.68,269.89,127.01,206.38,603.28,Single-ply,SBD,M,
Boys,109.77,3,Jesse Perez,Agua Dulce,107.23,235.87,156.49,210.92,603.28,Single-ply,SBD,M,
Boys,109.77,4,Kevin Ceniceros,Center Point,104.42,249.48,131.54,206.38,587.4,Single-ply,SBD,M,
Boys,109.77,5,Jacob Palacio,Rocksprings,107.59,226.8,129.27,226.8,582.87,Single-ply,SBD,M,
Boys,109.77,6,AJ Obregon,Freer,104.6,226.8,147.42,190.51,564.72,Single-ply,SBD,M,
Boys,109.77,7,Alex Gonzalez #8,Kenedy,102.97,238.14,120.2,199.58,557.92,Single-ply,SBD,M,
Boys,109.77,8,Shawn Garza,Freer,109.77,208.65,127.01,185.97,521.63,Single-ply,SBD,M,
Boys,109.77,9,Kevin Garcia,Junction,103.06,190.51,127.01,172.37,489.88,Single-ply,SBD,M,
Boys,109.77,10,Seth Parker,Eldorado,106.14,156.49,99.79,163.29,419.57,Single-ply,SBD,M,
Boys,109.77,11,Connor Ruppert,Yorktown,105.87,140.61,92.99,106.59,340.19,Single-ply,SBD,M,
Boys,124.74,1,Jon-Mychael Kirkland,Rocksprings,120.93,233.6,145.15,238.14,616.89,Single-ply,SBD,M,
Boys,124.74,2,Joseph Luna,Kenedy,120.47,226.8,145.15,226.8,598.74,Single-ply,SBD,M,
Boys,124.74,3,Ryland Reyna,Kenedy,110.77,206.38,142.88,224.53,573.79,Single-ply,SBD,M,
Boys,124.74,4,Ethan Pompa,Yorktown,110.77,204.12,113.4,197.31,514.83,Single-ply,SBD,M,
Boys,124.74,5,Alberto Ibarra,Freer,111.49,226.8,113.4,154.22,494.42,Single-ply,SBD,M,
Boys,124.74,6,Roland Guerra,Agua Dulce,111.4,197.31,102.06,183.7,483.08,Single-ply,SBD,M,
Boys,124.74,7,Donnie Mireles,Freer,110.31,188.24,106.59,185.97,480.81,Single-ply,SBD,M,
Boys,124.74,8,Vinny Pina,Eldorado,110.04,176.9,111.13,181.44,469.47,Single-ply,SBD,M,
Boys,124.74,9,Javier Perez,Freer,113.67,190.51,83.91,149.69,424.11,Single-ply,SBD,M,
Boys,124.74,DQ,Cesar Avila,Junction,113.94,,,,,Single-ply,SBD,M,
Boys,124.74,DQ,Robert De Leon,Kenedy,114.31,,,,,Single-ply,SBD,M,
Boys,124.74,DQ,Isaac Carillo,La Pryor,118.75,192.78,81.65,,,Single-ply,SBD,M,
Boys,139.71,1,Keano Perez,Ozona,137.08,290.3,145.15,244.94,680.39,Single-ply,SBD,M,
Boys,139.71,2,Ernesto Nava,Eldorado,125.19,244.94,138.35,183.7,566.99,Single-ply,SBD,M,
Boys,139.71,3,Hunter Hall,Yorktown,134.9,174.63,106.59,170.1,451.32,Single-ply,SBD,M,
Boys,139.71,DQ,Fabian Castilleja,Agua Dulce,128,258.55,136.08,,,Single-ply,SBD,M,
Boys,139.71+,1,Dorien Enriquez,Rocksprings,151.14,272.16,154.22,231.33,657.71,Single-ply,SBD,M,
Boys,139.71+,DQ,Rafael Benavides,Junction,149.32,,,,,Single-ply,SBD,M,
Boys,,NS,Eddie Flemma,Center Point,,,,,,Single-ply,SBD,M,
Boys,,NS,Benji DeNava,Refugio,,,,,,Single-ply,SBD,M,
Boys,,NS,Daniel Mendoza,Runge,,,,,,Single-ply,SBD,M,
