Division,WeightClassKg,Place,Name,Team,BodyweightKg,Best3SquatKg,Best3BenchKg,Best3DeadliftKg,TotalKg,Equipment,Event,Sex
Boys,51.71,1,Demetrius Parker,Waco La Vega,47.63,104.33,65.77,113.4,283.5,Single-ply,SBD,M
Boys,51.71,2,Oscar Salazar,Waco La Vega,51.44,102.06,49.9,124.74,276.69,Single-ply,SBD,M
Boys,51.71,3,Robert Llewellyn,Chilton,46.99,97.52,63.5,111.13,272.16,Single-ply,SBD,M
Boys,51.71,4,Isaiah Boyd,Waco Connally,49.44,99.79,61.23,106.59,267.62,Single-ply,SBD,M
Boys,51.71,5,Dillion Hopson,Dawson,48.08,83.91,54.43,86.18,224.53,Single-ply,SBD,M
Boys,51.71,DQ,Elijah Lewis,Bosqueville,51.17,,,,,Single-ply,SBD,M
Boys,55.79,1,Tony Sanchez,Waco Reicher Catholic,54.88,133.81,65.77,156.49,356.07,Single-ply,SBD,M
Boys,55.79,2,Dylan Charles,Gatesville,55.07,142.88,70.31,129.27,342.46,Single-ply,SBD,M
Boys,55.79,3,Jay King,Bosqueville,52.62,127.01,77.11,115.67,319.78,Single-ply,SBD,M
Boys,55.79,4,Alex Vargas,Rogers,52.89,120.2,61.23,113.4,294.84,Single-ply,SBD,M
Boys,59.87,1,Dion Miclat,Waco Reicher Catholic,59.33,156.49,83.91,197.31,437.72,Single-ply,SBD,M
Boys,59.87,2,Gilberto Olguin,Waco Connally,58.06,145.15,86.18,149.69,381.02,Single-ply,SBD,M
Boys,59.87,3,Stetson Thompson,Riesel,59.51,136.08,79.38,163.29,378.75,Single-ply,SBD,M
Boys,59.87,4,Brandon Renteria,Buffalo,58.33,117.93,86.18,136.08,340.19,Single-ply,SBD,M
Boys,59.87,5,Jon Harris,Waco La Vega,56.52,131.54,74.84,127.01,333.39,Single-ply,SBD,M
Boys,59.87,6,Noah Pena,Bosqueville,59.87,113.4,72.57,142.88,328.85,Single-ply,SBD,M
Boys,59.87,7,Joseph Vargas,Rogers,57.42,129.27,58.97,136.08,324.32,Single-ply,SBD,M
Boys,59.87,8,Josiah Olvera,Riesel,58.06,115.67,56.7,136.08,308.44,Single-ply,SBD,M
Boys,59.87,9,Jakob Jankowski,Dawson,59.6,111.13,61.23,115.67,288.03,Single-ply,SBD,M
Boys,59.87,DQ,Emiliano Olivares,Waco Connally,58.06,,,,,Single-ply,SBD,M
Boys,67.13,1,Harris Sherrod,Jewett Leon,66.13,217.72,108.86,219.99,546.58,Single-ply,SBD,M
Boys,67.13,2,Sergio Watkins,China Spring,65.32,226.8,122.47,188.24,537.51,Single-ply,SBD,M
Boys,67.13,3,Dakota Schramm,Gatesville,65.32,181.44,86.18,181.44,449.06,Single-ply,SBD,M
Boys,67.13,4,Riley Kinsey,Riesel,67.13,172.37,97.52,170.1,439.98,Single-ply,SBD,M
Boys,67.13,5,Christian Watkins,Rogers,65.41,163.29,90.72,165.56,419.57,Single-ply,SBD,M
Boys,67.13,6,Jon McMullough,Gatesville,65.59,158.76,86.18,167.83,412.77,Single-ply,SBD,M
Boys,67.13,7,Tyler Evans,Franklin,67.13,154.22,95.25,158.76,408.23,Single-ply,SBD,M
Boys,67.13,8,Lane Francis,Bosqueville,65.86,149.69,83.91,158.76,392.36,Single-ply,SBD,M
Boys,67.13,9,Christian Ramos,Gatesville,65.68,124.74,99.79,149.69,374.21,Single-ply,SBD,M
Boys,67.13,10,Shawn Gustavus,Franklin,67.13,145.15,83.91,142.88,371.95,Single-ply,SBD,M
Boys,67.13,11,Matt Rosas,Meridian,65.23,142.88,83.91,136.08,362.87,Single-ply,SBD,M
Boys,67.13,12,Jorden Busby,Riesel,64.77,136.08,63.5,140.61,340.19,Single-ply,SBD,M
Boys,67.13,13,Hayden Stanford,Bosqueville,60.51,113.4,56.7,136.08,306.17,Single-ply,SBD,M
Boys,74.84,1,Kj Peoples,China Spring,73.48,208.65,136.08,208.65,553.38,Single-ply,SBD,M
Boys,74.84,2,Larson Hoffmeyer,Bosqueville,71.03,197.31,111.13,204.12,512.56,Single-ply,SBD,M
Boys,74.84,3,Da'Mariyea Hamilton,Dawson,70.76,163.29,97.52,190.51,451.32,Single-ply,SBD,M
Boys,74.84,4,Ian Hankhouse,Bosqueville,73.94,149.69,113.4,185.97,449.06,Single-ply,SBD,M
Boys,74.84,5,Jeremy Flake,Jewett Leon,72.94,161.03,106.59,174.63,442.25,Single-ply,SBD,M
Boys,74.84,6,Levi Elkins,Dawson,73.39,181.44,92.99,165.56,439.98,Single-ply,SBD,M
Boys,74.84,7,Luis Guillen,Jewett Leon,73.3,149.69,86.18,195.04,430.91,Single-ply,SBD,M
Boys,74.84,8,Brayden McAfee,Riesel,72.3,140.61,102.06,158.76,401.43,Single-ply,SBD,M
Boys,74.84,9,Dillon Henderson,China Spring,74.84,113.4,79.38,124.74,317.51,Single-ply,SBD,M
Boys,74.84,DQ,Trey Watson,Rosebud-Lott,69.31,,,,,Single-ply,SBD,M
Boys,74.84,DQ,Brent Steele,Buffalo,69.04,147.42,,,,Single-ply,SBD,M
Boys,82.1,1,Hector Dominguez,Buffalo,80.47,256.28,127.01,238.14,621.42,Single-ply,SBD,M
Boys,82.1,2,Emmanual Abdallah,China Spring,79.02,229.06,138.35,226.8,594.21,Single-ply,SBD,M
Boys,82.1,3,Justin Bahajak,Riesel,81.83,219.99,117.93,208.65,546.58,Single-ply,SBD,M
Boys,82.1,4,Dalton Boeche,Riesel,76.02,181.44,108.86,208.65,498.95,Single-ply,SBD,M
Boys,82.1,5,Jordan Degellado,Meridian,80.38,188.24,102.06,208.65,498.95,Single-ply,SBD,M
Boys,82.1,6,Mason Davis,Rogers,77.47,181.44,108.86,190.51,480.81,Single-ply,SBD,M
Boys,82.1,7,Pablo Vargas,Riesel,81.37,172.37,95.25,181.44,449.06,Single-ply,SBD,M
Boys,82.1,8,Davion Carr,Waco La Vega,77.47,149.69,99.79,181.44,430.91,Single-ply,SBD,M
Boys,82.1,9,Hunter Heath,Bosqueville,77.2,163.29,97.52,154.22,415.04,Single-ply,SBD,M
Boys,82.1,10,Eddie Guerra,Dawson,78.11,158.76,86.18,158.76,403.7,Single-ply,SBD,M
Boys,82.1,11,Russel Stegall,Franklin,76.2,149.69,95.25,147.42,392.36,Single-ply,SBD,M
Boys,82.1,12,Samual Taggert,Rosebud-Lott,78.47,142.88,83.91,158.76,385.55,Single-ply,SBD,M
Boys,82.1,13,Justin Clark #2,Gatesville,80.38,154.22,83.91,131.54,369.68,Single-ply,SBD,M
Boys,82.1,14,Caleb Sampson,Waco La Vega,75.66,120.2,70.31,158.76,349.27,Single-ply,SBD,M
Boys,82.1,15,Jose Bretado,Waco Reicher Catholic,78.93,115.67,65.77,129.27,310.71,Single-ply,SBD,M
Boys,82.1,DQ,Adrian Gongora,Buffalo,77.38,124.74,,,,Single-ply,SBD,M
Boys,89.81,1,Walter Beltran,Jewett Leon,83.73,226.8,115.67,215.46,557.92,Single-ply,SBD,M
Boys,89.81,2,Dawson Exline,China Spring,89.63,199.58,124.74,192.78,517.1,Single-ply,SBD,M
Boys,89.81,3,Joe Squiers,Franklin,82.83,172.37,111.13,170.1,453.59,Single-ply,SBD,M
Boys,89.81,4,Curtis Stanford,Jewett Leon,87.54,158.76,117.93,176.9,453.59,Single-ply,SBD,M
Boys,89.81,5,Logan Portillo,Rosebud-Lott,89.81,172.37,117.93,163.29,453.59,Single-ply,SBD,M
Boys,89.81,6,Willie Burns,Bosqueville,85.73,149.69,104.33,138.35,392.36,Single-ply,SBD,M
Boys,89.81,7,Mason McHugh,Waco Reicher Catholic,87.09,138.35,88.45,138.35,365.14,Single-ply,SBD,M
Boys,89.81,8,Christian Edwards,Rosebud-Lott,87,124.74,83.91,136.08,344.73,Single-ply,SBD,M
Boys,89.81,DQ,Jay'Veon Sunday,Waco Connally,86.73,204.12,,210.92,,Single-ply,SBD,M
Boys,99.79,1,Ethan Duckworth,China Spring,92.99,222.26,156.49,208.65,587.4,Single-ply,SBD,M
Boys,99.79,2,Jesus Garcia #12,Waco La Vega,98.07,197.31,124.74,185.97,508.02,Single-ply,SBD,M
Boys,99.79,3,Brian Williams,Waco Connally,97.7,195.04,124.74,185.97,505.76,Single-ply,SBD,M
Boys,99.79,4,Scotty Warren,Waco Connally,95.07,183.7,124.74,183.7,492.15,Single-ply,SBD,M
Boys,99.79,5,Blake Barrett,China Spring,93.17,217.72,95.25,170.1,483.08,Single-ply,SBD,M
Boys,99.79,6,Kobe LeBreche,Franklin,91.08,176.9,106.59,181.44,464.93,Single-ply,SBD,M
Boys,99.79,7,Joseph Vega,Franklin,91.17,158.76,106.59,172.37,437.72,Single-ply,SBD,M
Boys,99.79,8,Juno Chhoy,Jewett Leon,97.98,151.95,95.25,170.1,417.3,Single-ply,SBD,M
Boys,99.79,9,Jaiden Taylor,China Spring,99.34,165.56,99.79,151.95,417.3,Single-ply,SBD,M
Boys,99.79,10,Abel Salazar,Buffalo,96.8,147.42,95.25,154.22,396.89,Single-ply,SBD,M
Boys,99.79,11,Jostace Starkey,Dawson,91.44,138.35,79.38,154.22,371.95,Single-ply,SBD,M
Boys,99.79,12,Ethan Glenn,Rogers,97.89,113.4,63.5,102.06,278.96,Single-ply,SBD,M
Boys,109.77,1,Jacob Snoddy,Gatesville,106.78,226.8,170.1,231.33,628.23,Single-ply,SBD,M
Boys,109.77,2,Vernon Walker,Waco La Vega,106.41,226.8,129.27,197.31,553.38,Single-ply,SBD,M
Boys,109.77,3,Ivan Martinez,Waco La Vega,106.87,219.99,102.06,181.44,503.49,Single-ply,SBD,M
Boys,109.77,4,Paul Clinton,China Spring,106.23,149.69,95.25,133.81,378.75,Single-ply,SBD,M
Boys,124.74,1,Jim Hitchcock,Gatesville,121.93,288.03,154.22,254.01,696.26,Single-ply,SBD,M
Boys,124.74,2,James Baggett,Waco La Vega,119.29,249.48,170.1,226.8,646.37,Single-ply,SBD,M
Boys,124.74,3,Jose Gonzalez #11,Chilton,124.56,226.8,133.81,222.26,582.87,Single-ply,SBD,M
Boys,124.74,4,Gabriel Gongora,Waco La Vega,117.03,235.87,122.47,192.78,551.11,Single-ply,SBD,M
Boys,124.74,5,Cobie Gray,Waco Connally,120.47,226.8,127.01,181.44,535.24,Single-ply,SBD,M
Boys,124.74,6,Hayden Hopkins,China Spring,121.02,176.9,124.74,185.97,487.61,Single-ply,SBD,M
Boys,124.74,7,Oscar Gaona,Valley Mills,115.76,197.31,92.99,188.24,478.54,Single-ply,SBD,M
Boys,124.74,8,Michael Hare,Bosqueville,112.85,170.1,115.67,163.29,449.06,Single-ply,SBD,M
Boys,124.74,DQ,Demontavion Carprew,Waco Connally,118.12,217.72,,172.37,,Single-ply,SBD,M
Boys,124.74+,1,Kyle Strimiska,Gatesville,131.54,272.16,161.03,219.99,653.17,Single-ply,SBD,M
Boys,124.74+,2,Chase Sharp,China Spring,127.19,281.23,158.76,210.92,650.91,Single-ply,SBD,M
Boys,124.74+,3,Devin Smith,Waco La Vega,125.74,238.14,129.27,195.04,562.45,Single-ply,SBD,M
Boys,124.74+,4,Zach Mellinger,Waco Reicher Catholic,140.89,219.99,133.81,201.85,555.65,Single-ply,SBD,M
Boys,124.74+,5,Michael Martinez,Riesel,148.42,226.8,129.27,192.78,548.85,Single-ply,SBD,M
Boys,124.74+,6,Josh Encinia,Dawson,142.16,233.6,127.01,172.37,532.97,Single-ply,SBD,M
Boys,124.74+,7,Ethan Patterson,Buffalo,135.62,158.76,151.95,185.97,496.68,Single-ply,SBD,M
Boys,124.74+,8,Chris Vasquez,Chilton,127.91,183.7,92.99,195.04,471.74,Single-ply,SBD,M
Boys,124.74+,9,Wyatt Adams,Rogers,124.92,161.03,102.06,131.54,394.63,Single-ply,SBD,M
Boys,124.74+,10,Colton Ward,Rosebud-Lott,136.26,147.42,86.18,142.88,376.48,Single-ply,SBD,M
