Division,WeightClassKg,Place,Name,Team,BodyweightKg,Best3SquatKg,Best3BenchKg,Best3DeadliftKg,TotalKg,Equipment,Event,Sex
Boys,51.71,1,Jacob Cadieux,Waller,51.71,133.81,58.97,142.88,335.66,Single-ply,SBD,M
Boys,51.71,2,Eric Eckert,Magnolia,50.35,104.33,70.31,122.47,297.1,Single-ply,SBD,M
Boys,55.79,1,Darius Mallard,Navasota,55.79,156.49,92.99,183.7,433.18,Single-ply,SBD,M
Boys,55.79,2,Jeremy Charles,Willis,55.7,151.95,104.33,158.76,415.04,Single-ply,SBD,M
Boys,55.79,3,Chance Hardcastle,Waller,55.75,133.81,58.97,147.42,340.19,Single-ply,SBD,M
Boys,55.79,4,Dominique Mallard,Navasota,52.62,120.2,65.77,142.88,328.85,Single-ply,SBD,M
Boys,55.79,5,Daquwan Mark,Huntsville,55.61,124.74,52.16,149.69,326.59,Single-ply,SBD,M
Boys,55.79,6,Daniel Segura,Magnolia,53.8,108.86,65.77,127.01,301.64,Single-ply,SBD,M
Boys,55.79,DQ,Oscar Lee,Waller,54.88,,,,,Single-ply,SBD,M
Boys,59.87,1,Eric Garza,Magnolia West,59.51,181.44,102.06,183.7,467.2,Single-ply,SBD,M
Boys,67.13,2,Jacob Thompson,Waller,60.1,158.76,70.31,181.44,410.5,Single-ply,SBD,M
Boys,59.87,3,Erick Navaro,Navasota,59.87,149.69,92.99,154.22,396.89,Single-ply,SBD,M
Boys,59.87,4,Rory Jefferson,Huntsville,59.87,151.95,81.65,151.95,385.55,Single-ply,SBD,M
Boys,59.87,5,Matt Hebert,Magnolia,58.97,147.42,74.84,129.27,351.53,Single-ply,SBD,M
Boys,67.13,6,Gabriel Santilla,Bryan,60.06,138.35,74.84,117.93,331.12,Single-ply,SBD,M
Boys,59.87,DQ,Byron Williams,Bryan,59.87,86.18,,,,Single-ply,SBD,M
Boys,74.84,1,Brandon Jackson,College Station A&M Cons,67.31,201.85,111.13,183.7,496.68,Single-ply,SBD,M
Boys,67.13,2,Franteric Powell,Navasota,64.86,181.44,104.33,172.37,458.13,Single-ply,SBD,M
Boys,67.13,3,Josh Goolsby,Huntsville,64.41,154.22,104.33,181.44,439.98,Single-ply,SBD,M
Boys,67.13,4,Carlos Lucio,Bryan,66.77,174.63,104.33,149.69,428.64,Single-ply,SBD,M
Boys,67.13,5,Aaron Valadez,Huntsville,66.68,136.08,99.79,167.83,403.7,Single-ply,SBD,M
Boys,67.13,6,Omar Borjas,Waller,67.13,140.61,83.91,174.63,399.16,Single-ply,SBD,M
Boys,74.84,1,Kendrick Armstead,Navasota,74.84,276.69,151.95,231.33,659.98,Single-ply,SBD,M
Boys,74.84,2,Marcus Orzabal,College Station A&M Cons,73.94,206.38,129.27,222.26,557.92,Single-ply,SBD,M
Boys,74.84,3,Josh McKerley,Waller,74.75,222.26,102.06,190.51,514.83,Single-ply,SBD,M
Boys,74.84,4,Colton Frisby,Waller,73.03,181.44,97.52,208.65,487.61,Single-ply,SBD,M
Boys,74.84,5,Brayson Boyde,Magnolia,70.31,161.03,106.59,161.03,428.64,Single-ply,SBD,M
Boys,74.84,6,Antuan Wallace,Bryan,70.22,172.37,86.18,158.76,417.3,Single-ply,SBD,M
Boys,74.84,7,Isaiah Vazquez,Bryan,74.39,147.42,86.18,136.08,369.68,Single-ply,SBD,M
Boys,74.84,8,John Lovelady,Willis,70.67,108.86,70.31,181.44,360.61,Single-ply,SBD,M
Boys,74.84,DQ,Luis Gallaga,Willis,73.26,,,,,Single-ply,SBD,M
Boys,82.1,1,Joe Waithaka,College Station A&M Cons,80.74,254.01,149.69,235.87,639.57,Single-ply,SBD,M
Boys,82.1,2,Desmond Calhoun,Navasota,82.1,190.51,99.79,244.94,535.24,Single-ply,SBD,M
Boys,82.1,3,Jake Bauer,Navasota,78.47,188.24,108.86,195.04,492.15,Single-ply,SBD,M
Boys,82.1,4,Trevor Austin,Magnolia West,76.02,161.03,115.67,195.04,471.74,Single-ply,SBD,M
Boys,82.1,5,Luke Knowles,Magnolia West,80.74,156.49,124.74,179.17,460.4,Single-ply,SBD,M
Boys,82.1,6,Chris York,Waller,81.83,142.88,74.84,158.76,376.48,Single-ply,SBD,M
Boys,82.1,7,Travis Hyatt,Waller,79.83,127.01,83.91,163.29,374.21,Single-ply,SBD,M
Boys,89.81,1,Shyerome Harris,Magnolia,82.55,238.14,127.01,233.6,598.74,Single-ply,SBD,M
Boys,89.81,2,Howard Horn,Navasota,85.28,208.65,127.01,215.46,551.11,Single-ply,SBD,M
Boys,89.81,3,Xavier Jones,Magnolia West,89.36,165.56,111.13,183.7,460.4,Single-ply,SBD,M
Boys,89.81,4,Justin Robertson,Waller,89.81,158.76,77.11,176.9,412.77,Single-ply,SBD,M
Boys,89.81,5,Dalton Williams,Waller,85.73,149.69,68.04,156.49,374.21,Single-ply,SBD,M
Boys,99.79,1,Josh Gutierrez,Magnolia West,99.7,231.33,151.95,215.46,598.74,Single-ply,SBD,M
Boys,99.79,2,Mitchell Knight,Willis,98.7,204.12,122.47,204.12,530.7,Single-ply,SBD,M
Boys,99.79,3,Darius Ross,Bryan,90.81,185.97,97.52,185.97,469.47,Single-ply,SBD,M
Boys,99.79,4,Matt Miller,Bryan,92.62,167.83,92.99,161.03,421.84,Single-ply,SBD,M
Boys,109.77,1,Tyler Glasscock,Magnolia West,108.59,233.6,145.15,249.48,628.23,Single-ply,SBD,M
Boys,109.77,2,Taylor McKenzie #1,Magnolia,103.42,226.8,115.67,192.78,535.24,Single-ply,SBD,M
Boys,109.77,3,Cody Skrivanek,Magnolia West,103.6,197.31,133.81,192.78,523.9,Single-ply,SBD,M
Boys,109.77,4,Darwin Castellanos,Magnolia West,109.77,172.37,142.88,204.12,519.36,Single-ply,SBD,M
Boys,109.77,5,Markho Babasoro,College Station A&M Cons,104.78,195.04,102.06,176.9,474,Single-ply,SBD,M
Boys,109.77,6,Conner DeAngelo,Waller,108.86,190.51,92.99,190.51,474,Single-ply,SBD,M
Boys,109.77,7,Chris Delaney,Bryan,104.33,158.76,120.2,181.44,460.4,Single-ply,SBD,M
Boys,109.77,8,Billy Freeman,College Station A&M Cons,105.23,165.56,102.06,165.56,433.18,Single-ply,SBD,M
Boys,109.77,DQ,Cody Nichols,Navasota,107.05,185.97,,,,Single-ply,SBD,M
Boys,124.74,1,Autra Maxey,Navasota,115.21,274.42,154.22,256.28,684.92,Single-ply,SBD,M
Boys,124.74,2,Jordan Wells,Navasota,118.84,226.8,158.76,235.87,621.42,Single-ply,SBD,M
Boys,124.74,3,Parker Blount,Huntsville,113.13,242.67,133.81,197.31,573.79,Single-ply,SBD,M
Boys,124.74,4,Andrew Rush,Waller,124.74,240.4,,204.12,444.52,Single-ply,SD,M
Boys,124.74+,1,Larry Reed #2,Magnolia,137.35,301.64,165.56,204.12,671.32,Single-ply,SBD,M
Boys,124.74+,2,Cory Kelley,Magnolia West,138.8,256.28,149.69,229.06,635.03,Single-ply,SBD,M
Boys,124.74+,3,Kyle Frey,Magnolia West,130.54,199.58,136.08,197.31,532.97,Single-ply,SBD,M
Boys,124.74+,4,Tevin Batiste,Bryan,145.6,165.56,90.72,113.4,369.68,Single-ply,SBD,M
Boys,124.74+,DQ,Tyler White #4,Navasota,145.15,190.51,,,,Single-ply,SBD,M
