Using domain server:
Name: 192.168.247.149
Address: 192.168.247.149#53
Aliases: 

Host 1.50.168.192.in-addr.arpa not found: 2(SERVFAIL)
1
Using domain server:
Name: 192.168.247.149
Address: 192.168.247.149#53
Aliases: 

Host 2.50.168.192.in-addr.arpa not found: 2(SERVFAIL)
1
Using domain server:
Name: 192.168.247.149
Address: 192.168.247.149#53
Aliases: 

Host 3.50.168.192.in-addr.arpa not found: 2(SERVFAIL)
1
Using domain server:
Name: 192.168.247.149
Address: 192.168.247.149#53
Aliases: 

Host 4.50.168.192.in-addr.arpa not found: 2(SERVFAIL)
1
Using domain server:
Name: 192.168.247.149
Address: 192.168.247.149#53
Aliases: 

Host 5.50.168.192.in-addr.arpa not found: 2(SERVFAIL)
1
Using domain server:
Name: 192.168.247.149
Address: 192.168.247.149#53
Aliases: 

Host 6.50.168.192.in-addr.arpa not found: 2(SERVFAIL)
1
Using domain server:
Name: 192.168.247.149
Address: 192.168.247.149#53
Aliases: 

Host 7.50.168.192.in-addr.arpa not found: 2(SERVFAIL)
1
Using domain server:
Name: 192.168.247.149
Address: 192.168.247.149#53
Aliases: 

Host 8.50.168.192.in-addr.arpa not found: 2(SERVFAIL)
1
Using domain server:
Name: 192.168.247.149
Address: 192.168.247.149#53
Aliases: 

Host 9.50.168.192.in-addr.arpa not found: 2(SERVFAIL)
1
Using domain server:
Name: 192.168.247.149
Address: 192.168.247.149#53
Aliases: 

Host 10.50.168.192.in-addr.arpa not found: 2(SERVFAIL)
1
Using domain server:
Name: 192.168.247.149
Address: 192.168.247.149#53
Aliases: 

Host 11.50.168.192.in-addr.arpa not found: 2(SERVFAIL)
1
Using domain server:
Name: 192.168.247.149
Address: 192.168.247.149#53
Aliases: 

Host 12.50.168.192.in-addr.arpa not found: 2(SERVFAIL)
1
Using domain server:
Name: 192.168.247.149
Address: 192.168.247.149#53
Aliases: 

Host 13.50.168.192.in-addr.arpa not found: 2(SERVFAIL)
1
Using domain server:
Name: 192.168.247.149
Address: 192.168.247.149#53
Aliases: 

Host 14.50.168.192.in-addr.arpa not found: 2(SERVFAIL)
1
Using domain server:
Name: 192.168.247.149
Address: 192.168.247.149#53
Aliases: 

Host 15.50.168.192.in-addr.arpa not found: 2(SERVFAIL)
1
Using domain server:
Name: 192.168.247.149
Address: 192.168.247.149#53
Aliases: 

Host 16.50.168.192.in-addr.arpa not found: 2(SERVFAIL)
1
Using domain server:
Name: 192.168.247.149
Address: 192.168.247.149#53
Aliases: 

Host 17.50.168.192.in-addr.arpa not found: 2(SERVFAIL)
1
Using domain server:
Name: 192.168.247.149
Address: 192.168.247.149#53
Aliases: 

Host 18.50.168.192.in-addr.arpa not found: 2(SERVFAIL)
1
Using domain server:
Name: 192.168.247.149
Address: 192.168.247.149#53
Aliases: 

Host 19.50.168.192.in-addr.arpa not found: 2(SERVFAIL)
1
Using domain server:
Name: 192.168.247.149
Address: 192.168.247.149#53
Aliases: 

Host 20.50.168.192.in-addr.arpa not found: 2(SERVFAIL)
1
Using domain server:
Name: 192.168.247.149
Address: 192.168.247.149#53
Aliases: 

Host 21.50.168.192.in-addr.arpa not found: 2(SERVFAIL)
1
Using domain server:
Name: 192.168.247.149
Address: 192.168.247.149#53
Aliases: 

Host 22.50.168.192.in-addr.arpa not found: 2(SERVFAIL)
1
Using domain server:
Name: 192.168.247.149
Address: 192.168.247.149#53
Aliases: 

Host 23.50.168.192.in-addr.arpa not found: 2(SERVFAIL)
1
Using domain server:
Name: 192.168.247.149
Address: 192.168.247.149#53
Aliases: 

Host 24.50.168.192.in-addr.arpa not found: 2(SERVFAIL)
1
Using domain server:
Name: 192.168.247.149
Address: 192.168.247.149#53
Aliases: 

Host 25.50.168.192.in-addr.arpa not found: 2(SERVFAIL)
1
Using domain server:
Name: 192.168.247.149
Address: 192.168.247.149#53
Aliases: 

Host 26.50.168.192.in-addr.arpa not found: 2(SERVFAIL)
1
Using domain server:
Name: 192.168.247.149
Address: 192.168.247.149#53
Aliases: 

Host 27.50.168.192.in-addr.arpa not found: 2(SERVFAIL)
1
Using domain server:
Name: 192.168.247.149
Address: 192.168.247.149#53
Aliases: 

Host 28.50.168.192.in-addr.arpa not found: 2(SERVFAIL)
1
Using domain server:
Name: 192.168.247.149
Address: 192.168.247.149#53
Aliases: 

Host 29.50.168.192.in-addr.arpa not found: 2(SERVFAIL)
1
Using domain server:
Name: 192.168.247.149
Address: 192.168.247.149#53
Aliases: 

Host 30.50.168.192.in-addr.arpa not found: 2(SERVFAIL)
1
Using domain server:
Name: 192.168.247.149
Address: 192.168.247.149#53
Aliases: 

Host 31.50.168.192.in-addr.arpa not found: 2(SERVFAIL)
1
Using domain server:
Name: 192.168.247.149
Address: 192.168.247.149#53
Aliases: 

Host 32.50.168.192.in-addr.arpa not found: 2(SERVFAIL)
1
Using domain server:
Name: 192.168.247.149
Address: 192.168.247.149#53
Aliases: 

Host 33.50.168.192.in-addr.arpa not found: 2(SERVFAIL)
1
Using domain server:
Name: 192.168.247.149
Address: 192.168.247.149#53
Aliases: 

Host 34.50.168.192.in-addr.arpa not found: 2(SERVFAIL)
1
Using domain server:
Name: 192.168.247.149
Address: 192.168.247.149#53
Aliases: 

Host 35.50.168.192.in-addr.arpa not found: 2(SERVFAIL)
1
Using domain server:
Name: 192.168.247.149
Address: 192.168.247.149#53
Aliases: 

Host 36.50.168.192.in-addr.arpa not found: 2(SERVFAIL)
1
Using domain server:
Name: 192.168.247.149
Address: 192.168.247.149#53
Aliases: 

Host 37.50.168.192.in-addr.arpa not found: 2(SERVFAIL)
1
Using domain server:
Name: 192.168.247.149
Address: 192.168.247.149#53
Aliases: 

Host 38.50.168.192.in-addr.arpa not found: 2(SERVFAIL)
1
Using domain server:
Name: 192.168.247.149
Address: 192.168.247.149#53
Aliases: 

Host 39.50.168.192.in-addr.arpa not found: 2(SERVFAIL)
1
Using domain server:
Name: 192.168.247.149
Address: 192.168.247.149#53
Aliases: 

Host 40.50.168.192.in-addr.arpa not found: 2(SERVFAIL)
1
Using domain server:
Name: 192.168.247.149
Address: 192.168.247.149#53
Aliases: 

Host 41.50.168.192.in-addr.arpa not found: 2(SERVFAIL)
1
Using domain server:
Name: 192.168.247.149
Address: 192.168.247.149#53
Aliases: 

Host 42.50.168.192.in-addr.arpa not found: 2(SERVFAIL)
1
Using domain server:
Name: 192.168.247.149
Address: 192.168.247.149#53
Aliases: 

Host 43.50.168.192.in-addr.arpa not found: 2(SERVFAIL)
1
Using domain server:
Name: 192.168.247.149
Address: 192.168.247.149#53
Aliases: 

Host 44.50.168.192.in-addr.arpa not found: 2(SERVFAIL)
1
Using domain server:
Name: 192.168.247.149
Address: 192.168.247.149#53
Aliases: 

Host 45.50.168.192.in-addr.arpa not found: 2(SERVFAIL)
1
Using domain server:
Name: 192.168.247.149
Address: 192.168.247.149#53
Aliases: 

Host 46.50.168.192.in-addr.arpa not found: 2(SERVFAIL)
1
Using domain server:
Name: 192.168.247.149
Address: 192.168.247.149#53
Aliases: 

Host 47.50.168.192.in-addr.arpa not found: 2(SERVFAIL)
1
Using domain server:
Name: 192.168.247.149
Address: 192.168.247.149#53
Aliases: 

Host 48.50.168.192.in-addr.arpa not found: 2(SERVFAIL)
1
Using domain server:
Name: 192.168.247.149
Address: 192.168.247.149#53
Aliases: 

Host 49.50.168.192.in-addr.arpa not found: 2(SERVFAIL)
1
Using domain server:
Name: 192.168.247.149
Address: 192.168.247.149#53
Aliases: 

Host 50.50.168.192.in-addr.arpa not found: 2(SERVFAIL)
1
Using domain server:
Name: 192.168.247.149
Address: 192.168.247.149#53
Aliases: 

Host 51.50.168.192.in-addr.arpa not found: 2(SERVFAIL)
1
Using domain server:
Name: 192.168.247.149
Address: 192.168.247.149#53
Aliases: 

Host 52.50.168.192.in-addr.arpa not found: 2(SERVFAIL)
1
Using domain server:
Name: 192.168.247.149
Address: 192.168.247.149#53
Aliases: 

Host 53.50.168.192.in-addr.arpa not found: 2(SERVFAIL)
1
Using domain server:
Name: 192.168.247.149
Address: 192.168.247.149#53
Aliases: 

Host 54.50.168.192.in-addr.arpa not found: 2(SERVFAIL)
1
Using domain server:
Name: 192.168.247.149
Address: 192.168.247.149#53
Aliases: 

Host 55.50.168.192.in-addr.arpa not found: 2(SERVFAIL)
1
Using domain server:
Name: 192.168.247.149
Address: 192.168.247.149#53
Aliases: 

Host 56.50.168.192.in-addr.arpa not found: 2(SERVFAIL)
1
Using domain server:
Name: 192.168.247.149
Address: 192.168.247.149#53
Aliases: 

Host 57.50.168.192.in-addr.arpa not found: 2(SERVFAIL)
1
Using domain server:
Name: 192.168.247.149
Address: 192.168.247.149#53
Aliases: 

Host 58.50.168.192.in-addr.arpa not found: 2(SERVFAIL)
1
Using domain server:
Name: 192.168.247.149
Address: 192.168.247.149#53
Aliases: 

Host 59.50.168.192.in-addr.arpa not found: 2(SERVFAIL)
1
Using domain server:
Name: 192.168.247.149
Address: 192.168.247.149#53
Aliases: 

Host 60.50.168.192.in-addr.arpa not found: 2(SERVFAIL)
1
Using domain server:
Name: 192.168.247.149
Address: 192.168.247.149#53
Aliases: 

Host 61.50.168.192.in-addr.arpa not found: 2(SERVFAIL)
1
Using domain server:
Name: 192.168.247.149
Address: 192.168.247.149#53
Aliases: 

Host 62.50.168.192.in-addr.arpa not found: 2(SERVFAIL)
1
Using domain server:
Name: 192.168.247.149
Address: 192.168.247.149#53
Aliases: 

Host 63.50.168.192.in-addr.arpa not found: 2(SERVFAIL)
1
Using domain server:
Name: 192.168.247.149
Address: 192.168.247.149#53
Aliases: 

Host 64.50.168.192.in-addr.arpa not found: 2(SERVFAIL)
1
Using domain server:
Name: 192.168.247.149
Address: 192.168.247.149#53
Aliases: 

Host 65.50.168.192.in-addr.arpa not found: 2(SERVFAIL)
1
Using domain server:
Name: 192.168.247.149
Address: 192.168.247.149#53
Aliases: 

Host 66.50.168.192.in-addr.arpa not found: 2(SERVFAIL)
1
Using domain server:
Name: 192.168.247.149
Address: 192.168.247.149#53
Aliases: 

Host 67.50.168.192.in-addr.arpa not found: 2(SERVFAIL)
1
Using domain server:
Name: 192.168.247.149
Address: 192.168.247.149#53
Aliases: 

Host 68.50.168.192.in-addr.arpa not found: 2(SERVFAIL)
1
Using domain server:
Name: 192.168.247.149
Address: 192.168.247.149#53
Aliases: 

Host 69.50.168.192.in-addr.arpa not found: 2(SERVFAIL)
1
Using domain server:
Name: 192.168.247.149
Address: 192.168.247.149#53
Aliases: 

Host 70.50.168.192.in-addr.arpa not found: 2(SERVFAIL)
1
Using domain server:
Name: 192.168.247.149
Address: 192.168.247.149#53
Aliases: 

Host 71.50.168.192.in-addr.arpa not found: 2(SERVFAIL)
1
Using domain server:
Name: 192.168.247.149
Address: 192.168.247.149#53
Aliases: 

Host 72.50.168.192.in-addr.arpa not found: 2(SERVFAIL)
1
Using domain server:
Name: 192.168.247.149
Address: 192.168.247.149#53
Aliases: 

Host 73.50.168.192.in-addr.arpa not found: 2(SERVFAIL)
1
Using domain server:
Name: 192.168.247.149
Address: 192.168.247.149#53
Aliases: 

Host 74.50.168.192.in-addr.arpa not found: 2(SERVFAIL)
1
Using domain server:
Name: 192.168.247.149
Address: 192.168.247.149#53
Aliases: 

Host 75.50.168.192.in-addr.arpa not found: 2(SERVFAIL)
1
Using domain server:
Name: 192.168.247.149
Address: 192.168.247.149#53
Aliases: 

Host 76.50.168.192.in-addr.arpa not found: 2(SERVFAIL)
1
Using domain server:
Name: 192.168.247.149
Address: 192.168.247.149#53
Aliases: 

Host 77.50.168.192.in-addr.arpa not found: 2(SERVFAIL)
1
Using domain server:
Name: 192.168.247.149
Address: 192.168.247.149#53
Aliases: 

Host 78.50.168.192.in-addr.arpa not found: 2(SERVFAIL)
1
Using domain server:
Name: 192.168.247.149
Address: 192.168.247.149#53
Aliases: 

Host 79.50.168.192.in-addr.arpa not found: 2(SERVFAIL)
1
Using domain server:
Name: 192.168.247.149
Address: 192.168.247.149#53
Aliases: 

Host 80.50.168.192.in-addr.arpa not found: 2(SERVFAIL)
1
Using domain server:
Name: 192.168.247.149
Address: 192.168.247.149#53
Aliases: 

Host 81.50.168.192.in-addr.arpa not found: 2(SERVFAIL)
1
Using domain server:
Name: 192.168.247.149
Address: 192.168.247.149#53
Aliases: 

Host 82.50.168.192.in-addr.arpa not found: 2(SERVFAIL)
1
Using domain server:
Name: 192.168.247.149
Address: 192.168.247.149#53
Aliases: 

Host 83.50.168.192.in-addr.arpa not found: 2(SERVFAIL)
1
Using domain server:
Name: 192.168.247.149
Address: 192.168.247.149#53
Aliases: 

Host 84.50.168.192.in-addr.arpa not found: 2(SERVFAIL)
1
Using domain server:
Name: 192.168.247.149
Address: 192.168.247.149#53
Aliases: 

Host 85.50.168.192.in-addr.arpa not found: 2(SERVFAIL)
1
Using domain server:
Name: 192.168.247.149
Address: 192.168.247.149#53
Aliases: 

Host 86.50.168.192.in-addr.arpa not found: 2(SERVFAIL)
1
Using domain server:
Name: 192.168.247.149
Address: 192.168.247.149#53
Aliases: 

Host 87.50.168.192.in-addr.arpa not found: 2(SERVFAIL)
1
Using domain server:
Name: 192.168.247.149
Address: 192.168.247.149#53
Aliases: 

Host 88.50.168.192.in-addr.arpa not found: 2(SERVFAIL)
1
Using domain server:
Name: 192.168.247.149
Address: 192.168.247.149#53
Aliases: 

Host 89.50.168.192.in-addr.arpa not found: 2(SERVFAIL)
1
Using domain server:
Name: 192.168.247.149
Address: 192.168.247.149#53
Aliases: 

Host 90.50.168.192.in-addr.arpa not found: 2(SERVFAIL)
1
Using domain server:
Name: 192.168.247.149
Address: 192.168.247.149#53
Aliases: 

Host 91.50.168.192.in-addr.arpa not found: 2(SERVFAIL)
1
Using domain server:
Name: 192.168.247.149
Address: 192.168.247.149#53
Aliases: 

Host 92.50.168.192.in-addr.arpa not found: 2(SERVFAIL)
1
Using domain server:
Name: 192.168.247.149
Address: 192.168.247.149#53
Aliases: 

Host 93.50.168.192.in-addr.arpa not found: 2(SERVFAIL)
1
Using domain server:
Name: 192.168.247.149
Address: 192.168.247.149#53
Aliases: 

Host 94.50.168.192.in-addr.arpa not found: 2(SERVFAIL)
1
Using domain server:
Name: 192.168.247.149
Address: 192.168.247.149#53
Aliases: 

Host 95.50.168.192.in-addr.arpa not found: 2(SERVFAIL)
1
Using domain server:
Name: 192.168.247.149
Address: 192.168.247.149#53
Aliases: 

Host 96.50.168.192.in-addr.arpa not found: 2(SERVFAIL)
1
Using domain server:
Name: 192.168.247.149
Address: 192.168.247.149#53
Aliases: 

Host 97.50.168.192.in-addr.arpa not found: 2(SERVFAIL)
1
Using domain server:
Name: 192.168.247.149
Address: 192.168.247.149#53
Aliases: 

Host 98.50.168.192.in-addr.arpa not found: 2(SERVFAIL)
1
Using domain server:
Name: 192.168.247.149
Address: 192.168.247.149#53
Aliases: 

Host 99.50.168.192.in-addr.arpa not found: 2(SERVFAIL)
1
Using domain server:
Name: 192.168.247.149
Address: 192.168.247.149#53
Aliases: 

Host 100.50.168.192.in-addr.arpa not found: 2(SERVFAIL)
1
Using domain server:
Name: 192.168.247.149
Address: 192.168.247.149#53
Aliases: 

Host 101.50.168.192.in-addr.arpa not found: 2(SERVFAIL)
1
Using domain server:
Name: 192.168.247.149
Address: 192.168.247.149#53
Aliases: 

Host 102.50.168.192.in-addr.arpa not found: 2(SERVFAIL)
1
Using domain server:
Name: 192.168.247.149
Address: 192.168.247.149#53
Aliases: 

Host 103.50.168.192.in-addr.arpa not found: 2(SERVFAIL)
1
Using domain server:
Name: 192.168.247.149
Address: 192.168.247.149#53
Aliases: 

Host 104.50.168.192.in-addr.arpa not found: 2(SERVFAIL)
1
Using domain server:
Name: 192.168.247.149
Address: 192.168.247.149#53
Aliases: 

Host 105.50.168.192.in-addr.arpa not found: 2(SERVFAIL)
1
Using domain server:
Name: 192.168.247.149
Address: 192.168.247.149#53
Aliases: 

Host 106.50.168.192.in-addr.arpa not found: 2(SERVFAIL)
1
Using domain server:
Name: 192.168.247.149
Address: 192.168.247.149#53
Aliases: 

Host 107.50.168.192.in-addr.arpa not found: 2(SERVFAIL)
1
Using domain server:
Name: 192.168.247.149
Address: 192.168.247.149#53
Aliases: 

Host 108.50.168.192.in-addr.arpa not found: 2(SERVFAIL)
1
Using domain server:
Name: 192.168.247.149
Address: 192.168.247.149#53
Aliases: 

Host 109.50.168.192.in-addr.arpa not found: 2(SERVFAIL)
1
Using domain server:
Name: 192.168.247.149
Address: 192.168.247.149#53
Aliases: 

Host 110.50.168.192.in-addr.arpa not found: 2(SERVFAIL)
1
Using domain server:
Name: 192.168.247.149
Address: 192.168.247.149#53
Aliases: 

Host 111.50.168.192.in-addr.arpa not found: 2(SERVFAIL)
1
Using domain server:
Name: 192.168.247.149
Address: 192.168.247.149#53
Aliases: 

Host 112.50.168.192.in-addr.arpa not found: 2(SERVFAIL)
1
Using domain server:
Name: 192.168.247.149
Address: 192.168.247.149#53
Aliases: 

Host 113.50.168.192.in-addr.arpa not found: 2(SERVFAIL)
1
Using domain server:
Name: 192.168.247.149
Address: 192.168.247.149#53
Aliases: 

Host 114.50.168.192.in-addr.arpa not found: 2(SERVFAIL)
1
Using domain server:
Name: 192.168.247.149
Address: 192.168.247.149#53
Aliases: 

Host 115.50.168.192.in-addr.arpa not found: 2(SERVFAIL)
1
Using domain server:
Name: 192.168.247.149
Address: 192.168.247.149#53
Aliases: 

Host 116.50.168.192.in-addr.arpa not found: 2(SERVFAIL)
1
Using domain server:
Name: 192.168.247.149
Address: 192.168.247.149#53
Aliases: 

Host 117.50.168.192.in-addr.arpa not found: 2(SERVFAIL)
1
Using domain server:
Name: 192.168.247.149
Address: 192.168.247.149#53
Aliases: 

Host 118.50.168.192.in-addr.arpa not found: 2(SERVFAIL)
1
Using domain server:
Name: 192.168.247.149
Address: 192.168.247.149#53
Aliases: 

Host 119.50.168.192.in-addr.arpa not found: 2(SERVFAIL)
1
Using domain server:
Name: 192.168.247.149
Address: 192.168.247.149#53
Aliases: 

Host 120.50.168.192.in-addr.arpa not found: 2(SERVFAIL)
1
Using domain server:
Name: 192.168.247.149
Address: 192.168.247.149#53
Aliases: 

Host 121.50.168.192.in-addr.arpa not found: 2(SERVFAIL)
1
Using domain server:
Name: 192.168.247.149
Address: 192.168.247.149#53
Aliases: 

Host 122.50.168.192.in-addr.arpa not found: 2(SERVFAIL)
1
Using domain server:
Name: 192.168.247.149
Address: 192.168.247.149#53
Aliases: 

Host 123.50.168.192.in-addr.arpa not found: 2(SERVFAIL)
1
Using domain server:
Name: 192.168.247.149
Address: 192.168.247.149#53
Aliases: 

Host 124.50.168.192.in-addr.arpa not found: 2(SERVFAIL)
1
Using domain server:
Name: 192.168.247.149
Address: 192.168.247.149#53
Aliases: 

Host 125.50.168.192.in-addr.arpa not found: 2(SERVFAIL)
1
Using domain server:
Name: 192.168.247.149
Address: 192.168.247.149#53
Aliases: 

Host 126.50.168.192.in-addr.arpa not found: 2(SERVFAIL)
1
Using domain server:
Name: 192.168.247.149
Address: 192.168.247.149#53
Aliases: 

Host 127.50.168.192.in-addr.arpa not found: 2(SERVFAIL)
1
Using domain server:
Name: 192.168.247.149
Address: 192.168.247.149#53
Aliases: 

Host 128.50.168.192.in-addr.arpa not found: 2(SERVFAIL)
1
Using domain server:
Name: 192.168.247.149
Address: 192.168.247.149#53
Aliases: 

Host 129.50.168.192.in-addr.arpa not found: 2(SERVFAIL)
1
Using domain server:
Name: 192.168.247.149
Address: 192.168.247.149#53
Aliases: 

Host 130.50.168.192.in-addr.arpa not found: 2(SERVFAIL)
1
Using domain server:
Name: 192.168.247.149
Address: 192.168.247.149#53
Aliases: 

Host 131.50.168.192.in-addr.arpa not found: 2(SERVFAIL)
1
Using domain server:
Name: 192.168.247.149
Address: 192.168.247.149#53
Aliases: 

Host 132.50.168.192.in-addr.arpa not found: 2(SERVFAIL)
1
Using domain server:
Name: 192.168.247.149
Address: 192.168.247.149#53
Aliases: 

Host 133.50.168.192.in-addr.arpa not found: 2(SERVFAIL)
1
Using domain server:
Name: 192.168.247.149
Address: 192.168.247.149#53
Aliases: 

Host 134.50.168.192.in-addr.arpa not found: 2(SERVFAIL)
1
Using domain server:
Name: 192.168.247.149
Address: 192.168.247.149#53
Aliases: 

Host 135.50.168.192.in-addr.arpa not found: 2(SERVFAIL)
1
Using domain server:
Name: 192.168.247.149
Address: 192.168.247.149#53
Aliases: 

Host 136.50.168.192.in-addr.arpa not found: 2(SERVFAIL)
1
Using domain server:
Name: 192.168.247.149
Address: 192.168.247.149#53
Aliases: 

Host 137.50.168.192.in-addr.arpa not found: 2(SERVFAIL)
1
Using domain server:
Name: 192.168.247.149
Address: 192.168.247.149#53
Aliases: 

Host 138.50.168.192.in-addr.arpa not found: 2(SERVFAIL)
1
Using domain server:
Name: 192.168.247.149
Address: 192.168.247.149#53
Aliases: 

Host 139.50.168.192.in-addr.arpa not found: 2(SERVFAIL)
1
Using domain server:
Name: 192.168.247.149
Address: 192.168.247.149#53
Aliases: 

Host 140.50.168.192.in-addr.arpa not found: 2(SERVFAIL)
1
Using domain server:
Name: 192.168.247.149
Address: 192.168.247.149#53
Aliases: 

Host 141.50.168.192.in-addr.arpa not found: 2(SERVFAIL)
1
Using domain server:
Name: 192.168.247.149
Address: 192.168.247.149#53
Aliases: 

Host 142.50.168.192.in-addr.arpa not found: 2(SERVFAIL)
1
Using domain server:
Name: 192.168.247.149
Address: 192.168.247.149#53
Aliases: 

Host 143.50.168.192.in-addr.arpa not found: 2(SERVFAIL)
1
Using domain server:
Name: 192.168.247.149
Address: 192.168.247.149#53
Aliases: 

Host 144.50.168.192.in-addr.arpa not found: 2(SERVFAIL)
1
Using domain server:
Name: 192.168.247.149
Address: 192.168.247.149#53
Aliases: 

Host 145.50.168.192.in-addr.arpa not found: 2(SERVFAIL)
1
Using domain server:
Name: 192.168.247.149
Address: 192.168.247.149#53
Aliases: 

Host 146.50.168.192.in-addr.arpa not found: 2(SERVFAIL)
1
Using domain server:
Name: 192.168.247.149
Address: 192.168.247.149#53
Aliases: 

Host 147.50.168.192.in-addr.arpa not found: 2(SERVFAIL)
1
Using domain server:
Name: 192.168.247.149
Address: 192.168.247.149#53
Aliases: 

Host 148.50.168.192.in-addr.arpa not found: 2(SERVFAIL)
1
Using domain server:
Name: 192.168.247.149
Address: 192.168.247.149#53
Aliases: 

Host 149.50.168.192.in-addr.arpa not found: 2(SERVFAIL)
1
Using domain server:
Name: 192.168.247.149
Address: 192.168.247.149#53
Aliases: 

Host 150.50.168.192.in-addr.arpa not found: 2(SERVFAIL)
1
Using domain server:
Name: 192.168.247.149
Address: 192.168.247.149#53
Aliases: 

Host 151.50.168.192.in-addr.arpa not found: 2(SERVFAIL)
1
Using domain server:
Name: 192.168.247.149
Address: 192.168.247.149#53
Aliases: 

Host 152.50.168.192.in-addr.arpa not found: 2(SERVFAIL)
1
Using domain server:
Name: 192.168.247.149
Address: 192.168.247.149#53
Aliases: 

Host 153.50.168.192.in-addr.arpa not found: 2(SERVFAIL)
1
Using domain server:
Name: 192.168.247.149
Address: 192.168.247.149#53
Aliases: 

Host 154.50.168.192.in-addr.arpa not found: 2(SERVFAIL)
1
Using domain server:
Name: 192.168.247.149
Address: 192.168.247.149#53
Aliases: 

Host 155.50.168.192.in-addr.arpa not found: 2(SERVFAIL)
1
Using domain server:
Name: 192.168.247.149
Address: 192.168.247.149#53
Aliases: 

Host 156.50.168.192.in-addr.arpa not found: 2(SERVFAIL)
1
Using domain server:
Name: 192.168.247.149
Address: 192.168.247.149#53
Aliases: 

Host 157.50.168.192.in-addr.arpa not found: 2(SERVFAIL)
1
Using domain server:
Name: 192.168.247.149
Address: 192.168.247.149#53
Aliases: 

Host 158.50.168.192.in-addr.arpa not found: 2(SERVFAIL)
1
Using domain server:
Name: 192.168.247.149
Address: 192.168.247.149#53
Aliases: 

Host 159.50.168.192.in-addr.arpa not found: 2(SERVFAIL)
1
Using domain server:
Name: 192.168.247.149
Address: 192.168.247.149#53
Aliases: 

Host 160.50.168.192.in-addr.arpa not found: 2(SERVFAIL)
1
Using domain server:
Name: 192.168.247.149
Address: 192.168.247.149#53
Aliases: 

Host 161.50.168.192.in-addr.arpa not found: 2(SERVFAIL)
1
Using domain server:
Name: 192.168.247.149
Address: 192.168.247.149#53
Aliases: 

Host 162.50.168.192.in-addr.arpa not found: 2(SERVFAIL)
1
Using domain server:
Name: 192.168.247.149
Address: 192.168.247.149#53
Aliases: 

Host 163.50.168.192.in-addr.arpa not found: 2(SERVFAIL)
1
Using domain server:
Name: 192.168.247.149
Address: 192.168.247.149#53
Aliases: 

Host 164.50.168.192.in-addr.arpa not found: 2(SERVFAIL)
1
Using domain server:
Name: 192.168.247.149
Address: 192.168.247.149#53
Aliases: 

Host 165.50.168.192.in-addr.arpa not found: 2(SERVFAIL)
1
Using domain server:
Name: 192.168.247.149
Address: 192.168.247.149#53
Aliases: 

Host 166.50.168.192.in-addr.arpa not found: 2(SERVFAIL)
1
Using domain server:
Name: 192.168.247.149
Address: 192.168.247.149#53
Aliases: 

Host 167.50.168.192.in-addr.arpa not found: 2(SERVFAIL)
1
Using domain server:
Name: 192.168.247.149
Address: 192.168.247.149#53
Aliases: 

Host 168.50.168.192.in-addr.arpa not found: 2(SERVFAIL)
1
Using domain server:
Name: 192.168.247.149
Address: 192.168.247.149#53
Aliases: 

Host 169.50.168.192.in-addr.arpa not found: 2(SERVFAIL)
1
Using domain server:
Name: 192.168.247.149
Address: 192.168.247.149#53
Aliases: 

Host 170.50.168.192.in-addr.arpa not found: 2(SERVFAIL)
1
Using domain server:
Name: 192.168.247.149
Address: 192.168.247.149#53
Aliases: 

Host 171.50.168.192.in-addr.arpa not found: 2(SERVFAIL)
1
Using domain server:
Name: 192.168.247.149
Address: 192.168.247.149#53
Aliases: 

Host 172.50.168.192.in-addr.arpa not found: 2(SERVFAIL)
1
Using domain server:
Name: 192.168.247.149
Address: 192.168.247.149#53
Aliases: 

Host 173.50.168.192.in-addr.arpa not found: 2(SERVFAIL)
1
Using domain server:
Name: 192.168.247.149
Address: 192.168.247.149#53
Aliases: 

Host 174.50.168.192.in-addr.arpa not found: 2(SERVFAIL)
1
Using domain server:
Name: 192.168.247.149
Address: 192.168.247.149#53
Aliases: 

Host 175.50.168.192.in-addr.arpa not found: 2(SERVFAIL)
1
Using domain server:
Name: 192.168.247.149
Address: 192.168.247.149#53
Aliases: 

Host 176.50.168.192.in-addr.arpa not found: 2(SERVFAIL)
1
Using domain server:
Name: 192.168.247.149
Address: 192.168.247.149#53
Aliases: 

Host 177.50.168.192.in-addr.arpa not found: 2(SERVFAIL)
1
Using domain server:
Name: 192.168.247.149
Address: 192.168.247.149#53
Aliases: 

Host 178.50.168.192.in-addr.arpa not found: 2(SERVFAIL)
1
Using domain server:
Name: 192.168.247.149
Address: 192.168.247.149#53
Aliases: 

Host 179.50.168.192.in-addr.arpa not found: 2(SERVFAIL)
1
Using domain server:
Name: 192.168.247.149
Address: 192.168.247.149#53
Aliases: 

Host 180.50.168.192.in-addr.arpa not found: 2(SERVFAIL)
1
Using domain server:
Name: 192.168.247.149
Address: 192.168.247.149#53
Aliases: 

Host 181.50.168.192.in-addr.arpa not found: 2(SERVFAIL)
1
Using domain server:
Name: 192.168.247.149
Address: 192.168.247.149#53
Aliases: 

Host 182.50.168.192.in-addr.arpa not found: 2(SERVFAIL)
1
Using domain server:
Name: 192.168.247.149
Address: 192.168.247.149#53
Aliases: 

Host 183.50.168.192.in-addr.arpa not found: 2(SERVFAIL)
1
Using domain server:
Name: 192.168.247.149
Address: 192.168.247.149#53
Aliases: 

Host 184.50.168.192.in-addr.arpa not found: 2(SERVFAIL)
1
Using domain server:
Name: 192.168.247.149
Address: 192.168.247.149#53
Aliases: 

Host 185.50.168.192.in-addr.arpa not found: 2(SERVFAIL)
1
Using domain server:
Name: 192.168.247.149
Address: 192.168.247.149#53
Aliases: 

Host 186.50.168.192.in-addr.arpa not found: 2(SERVFAIL)
1
Using domain server:
Name: 192.168.247.149
Address: 192.168.247.149#53
Aliases: 

Host 187.50.168.192.in-addr.arpa not found: 2(SERVFAIL)
1
Using domain server:
Name: 192.168.247.149
Address: 192.168.247.149#53
Aliases: 

Host 188.50.168.192.in-addr.arpa not found: 2(SERVFAIL)
1
Using domain server:
Name: 192.168.247.149
Address: 192.168.247.149#53
Aliases: 

Host 189.50.168.192.in-addr.arpa not found: 2(SERVFAIL)
1
Using domain server:
Name: 192.168.247.149
Address: 192.168.247.149#53
Aliases: 

Host 190.50.168.192.in-addr.arpa not found: 2(SERVFAIL)
1
Using domain server:
Name: 192.168.247.149
Address: 192.168.247.149#53
Aliases: 

Host 191.50.168.192.in-addr.arpa not found: 2(SERVFAIL)
1
Using domain server:
Name: 192.168.247.149
Address: 192.168.247.149#53
Aliases: 

Host 192.50.168.192.in-addr.arpa not found: 2(SERVFAIL)
1
Using domain server:
Name: 192.168.247.149
Address: 192.168.247.149#53
Aliases: 

Host 193.50.168.192.in-addr.arpa not found: 2(SERVFAIL)
1
Using domain server:
Name: 192.168.247.149
Address: 192.168.247.149#53
Aliases: 

Host 194.50.168.192.in-addr.arpa not found: 2(SERVFAIL)
1
Using domain server:
Name: 192.168.247.149
Address: 192.168.247.149#53
Aliases: 

Host 195.50.168.192.in-addr.arpa not found: 2(SERVFAIL)
1
Using domain server:
Name: 192.168.247.149
Address: 192.168.247.149#53
Aliases: 

Host 196.50.168.192.in-addr.arpa not found: 2(SERVFAIL)
1
Using domain server:
Name: 192.168.247.149
Address: 192.168.247.149#53
Aliases: 

Host 197.50.168.192.in-addr.arpa not found: 2(SERVFAIL)
1
Using domain server:
Name: 192.168.247.149
Address: 192.168.247.149#53
Aliases: 

Host 198.50.168.192.in-addr.arpa not found: 2(SERVFAIL)
1
Using domain server:
Name: 192.168.247.149
Address: 192.168.247.149#53
Aliases: 

Host 199.50.168.192.in-addr.arpa not found: 2(SERVFAIL)
1
Using domain server:
Name: 192.168.247.149
Address: 192.168.247.149#53
Aliases: 

Host 200.50.168.192.in-addr.arpa not found: 2(SERVFAIL)
1
Using domain server:
Name: 192.168.247.149
Address: 192.168.247.149#53
Aliases: 

Host 201.50.168.192.in-addr.arpa not found: 2(SERVFAIL)
1
Using domain server:
Name: 192.168.247.149
Address: 192.168.247.149#53
Aliases: 

Host 202.50.168.192.in-addr.arpa not found: 2(SERVFAIL)
1
Using domain server:
Name: 192.168.247.149
Address: 192.168.247.149#53
Aliases: 

Host 203.50.168.192.in-addr.arpa not found: 2(SERVFAIL)
1
Using domain server:
Name: 192.168.247.149
Address: 192.168.247.149#53
Aliases: 

Host 204.50.168.192.in-addr.arpa not found: 2(SERVFAIL)
1
Using domain server:
Name: 192.168.247.149
Address: 192.168.247.149#53
Aliases: 

Host 205.50.168.192.in-addr.arpa not found: 2(SERVFAIL)
1
Using domain server:
Name: 192.168.247.149
Address: 192.168.247.149#53
Aliases: 

Host 206.50.168.192.in-addr.arpa not found: 2(SERVFAIL)
1
Using domain server:
Name: 192.168.247.149
Address: 192.168.247.149#53
Aliases: 

Host 207.50.168.192.in-addr.arpa not found: 2(SERVFAIL)
1
Using domain server:
Name: 192.168.247.149
Address: 192.168.247.149#53
Aliases: 

Host 208.50.168.192.in-addr.arpa not found: 2(SERVFAIL)
1
Using domain server:
Name: 192.168.247.149
Address: 192.168.247.149#53
Aliases: 

Host 209.50.168.192.in-addr.arpa not found: 2(SERVFAIL)
1
Using domain server:
Name: 192.168.247.149
Address: 192.168.247.149#53
Aliases: 

Host 210.50.168.192.in-addr.arpa not found: 2(SERVFAIL)
1
Using domain server:
Name: 192.168.247.149
Address: 192.168.247.149#53
Aliases: 

Host 211.50.168.192.in-addr.arpa not found: 2(SERVFAIL)
1
Using domain server:
Name: 192.168.247.149
Address: 192.168.247.149#53
Aliases: 

Host 212.50.168.192.in-addr.arpa not found: 2(SERVFAIL)
1
Using domain server:
Name: 192.168.247.149
Address: 192.168.247.149#53
Aliases: 

Host 213.50.168.192.in-addr.arpa not found: 2(SERVFAIL)
1
Using domain server:
Name: 192.168.247.149
Address: 192.168.247.149#53
Aliases: 

Host 214.50.168.192.in-addr.arpa not found: 2(SERVFAIL)
1
Using domain server:
Name: 192.168.247.149
Address: 192.168.247.149#53
Aliases: 

Host 215.50.168.192.in-addr.arpa not found: 2(SERVFAIL)
1
Using domain server:
Name: 192.168.247.149
Address: 192.168.247.149#53
Aliases: 

Host 216.50.168.192.in-addr.arpa not found: 2(SERVFAIL)
1
Using domain server:
Name: 192.168.247.149
Address: 192.168.247.149#53
Aliases: 

Host 217.50.168.192.in-addr.arpa not found: 2(SERVFAIL)
1
Using domain server:
Name: 192.168.247.149
Address: 192.168.247.149#53
Aliases: 

Host 218.50.168.192.in-addr.arpa not found: 2(SERVFAIL)
1
Using domain server:
Name: 192.168.247.149
Address: 192.168.247.149#53
Aliases: 

Host 219.50.168.192.in-addr.arpa not found: 2(SERVFAIL)
1
Using domain server:
Name: 192.168.247.149
Address: 192.168.247.149#53
Aliases: 

Host 220.50.168.192.in-addr.arpa not found: 2(SERVFAIL)
1
Using domain server:
Name: 192.168.247.149
Address: 192.168.247.149#53
Aliases: 

Host 221.50.168.192.in-addr.arpa not found: 2(SERVFAIL)
1
Using domain server:
Name: 192.168.247.149
Address: 192.168.247.149#53
Aliases: 

Host 222.50.168.192.in-addr.arpa not found: 2(SERVFAIL)
1
Using domain server:
Name: 192.168.247.149
Address: 192.168.247.149#53
Aliases: 

Host 223.50.168.192.in-addr.arpa not found: 2(SERVFAIL)
1
Using domain server:
Name: 192.168.247.149
Address: 192.168.247.149#53
Aliases: 

Host 224.50.168.192.in-addr.arpa not found: 2(SERVFAIL)
1
Using domain server:
Name: 192.168.247.149
Address: 192.168.247.149#53
Aliases: 

Host 225.50.168.192.in-addr.arpa not found: 2(SERVFAIL)
1
Using domain server:
Name: 192.168.247.149
Address: 192.168.247.149#53
Aliases: 

Host 226.50.168.192.in-addr.arpa not found: 2(SERVFAIL)
1
Using domain server:
Name: 192.168.247.149
Address: 192.168.247.149#53
Aliases: 

Host 227.50.168.192.in-addr.arpa not found: 2(SERVFAIL)
1
Using domain server:
Name: 192.168.247.149
Address: 192.168.247.149#53
Aliases: 

Host 228.50.168.192.in-addr.arpa not found: 2(SERVFAIL)
1
Using domain server:
Name: 192.168.247.149
Address: 192.168.247.149#53
Aliases: 

Host 229.50.168.192.in-addr.arpa not found: 2(SERVFAIL)
1
Using domain server:
Name: 192.168.247.149
Address: 192.168.247.149#53
Aliases: 

Host 230.50.168.192.in-addr.arpa not found: 2(SERVFAIL)
1
Using domain server:
Name: 192.168.247.149
Address: 192.168.247.149#53
Aliases: 

Host 231.50.168.192.in-addr.arpa not found: 2(SERVFAIL)
1
Using domain server:
Name: 192.168.247.149
Address: 192.168.247.149#53
Aliases: 

Host 232.50.168.192.in-addr.arpa not found: 2(SERVFAIL)
1
Using domain server:
Name: 192.168.247.149
Address: 192.168.247.149#53
Aliases: 

Host 233.50.168.192.in-addr.arpa not found: 2(SERVFAIL)
1
Using domain server:
Name: 192.168.247.149
Address: 192.168.247.149#53
Aliases: 

Host 234.50.168.192.in-addr.arpa not found: 2(SERVFAIL)
1
Using domain server:
Name: 192.168.247.149
Address: 192.168.247.149#53
Aliases: 

Host 235.50.168.192.in-addr.arpa not found: 2(SERVFAIL)
1
Using domain server:
Name: 192.168.247.149
Address: 192.168.247.149#53
Aliases: 

Host 236.50.168.192.in-addr.arpa not found: 2(SERVFAIL)
1
Using domain server:
Name: 192.168.247.149
Address: 192.168.247.149#53
Aliases: 

Host 237.50.168.192.in-addr.arpa not found: 2(SERVFAIL)
1
Using domain server:
Name: 192.168.247.149
Address: 192.168.247.149#53
Aliases: 

Host 238.50.168.192.in-addr.arpa not found: 2(SERVFAIL)
1
Using domain server:
Name: 192.168.247.149
Address: 192.168.247.149#53
Aliases: 

Host 239.50.168.192.in-addr.arpa not found: 2(SERVFAIL)
1
Using domain server:
Name: 192.168.247.149
Address: 192.168.247.149#53
Aliases: 

Host 240.50.168.192.in-addr.arpa not found: 2(SERVFAIL)
1
Using domain server:
Name: 192.168.247.149
Address: 192.168.247.149#53
Aliases: 

Host 241.50.168.192.in-addr.arpa not found: 2(SERVFAIL)
1
Using domain server:
Name: 192.168.247.149
Address: 192.168.247.149#53
Aliases: 

Host 242.50.168.192.in-addr.arpa not found: 2(SERVFAIL)
1
Using domain server:
Name: 192.168.247.149
Address: 192.168.247.149#53
Aliases: 

Host 243.50.168.192.in-addr.arpa not found: 2(SERVFAIL)
1
Using domain server:
Name: 192.168.247.149
Address: 192.168.247.149#53
Aliases: 

Host 244.50.168.192.in-addr.arpa not found: 2(SERVFAIL)
1
Using domain server:
Name: 192.168.247.149
Address: 192.168.247.149#53
Aliases: 

Host 245.50.168.192.in-addr.arpa not found: 2(SERVFAIL)
1
Using domain server:
Name: 192.168.247.149
Address: 192.168.247.149#53
Aliases: 

Host 246.50.168.192.in-addr.arpa not found: 2(SERVFAIL)
1
Using domain server:
Name: 192.168.247.149
Address: 192.168.247.149#53
Aliases: 

Host 247.50.168.192.in-addr.arpa not found: 2(SERVFAIL)
1
Using domain server:
Name: 192.168.247.149
Address: 192.168.247.149#53
Aliases: 

Host 248.50.168.192.in-addr.arpa not found: 2(SERVFAIL)
1
Using domain server:
Name: 192.168.247.149
Address: 192.168.247.149#53
Aliases: 

Host 249.50.168.192.in-addr.arpa not found: 2(SERVFAIL)
1
Using domain server:
Name: 192.168.247.149
Address: 192.168.247.149#53
Aliases: 

Host 250.50.168.192.in-addr.arpa not found: 2(SERVFAIL)
1
Using domain server:
Name: 192.168.247.149
Address: 192.168.247.149#53
Aliases: 

Host 251.50.168.192.in-addr.arpa not found: 2(SERVFAIL)
1
Using domain server:
Name: 192.168.247.149
Address: 192.168.247.149#53
Aliases: 

Host 252.50.168.192.in-addr.arpa not found: 2(SERVFAIL)
1
Using domain server:
Name: 192.168.247.149
Address: 192.168.247.149#53
Aliases: 

Host 253.50.168.192.in-addr.arpa not found: 2(SERVFAIL)
1
Using domain server:
Name: 192.168.247.149
Address: 192.168.247.149#53
Aliases: 

Host 254.50.168.192.in-addr.arpa not found: 2(SERVFAIL)
1
Using domain server:
Name: 192.168.247.149
Address: 192.168.247.149#53
Aliases: 

Host 255.50.168.192.in-addr.arpa not found: 2(SERVFAIL)
1
