nombre,departamento,salario
krish,data science,10000
krish,IOT,5000
mahesh,big data,4000
krish,big data,4000
mahesh,data science,3000
sudhanshu,data science,20000
sudhanshu,IOT,10000
sudhanshu,big data,5000
sunny,data science,10000
sunny,big data,2000
