{
  "$schema": "https://go.kicad.org/pcm/schemas/v1",
  "name": "kimotor",
  "description": "PCB motor parametric design and layout",
  "description_full": "PCB motor parametric design and layout",
  "identifier": "com.github.cooked.kimotor",
  "type": "plugin",
  "author": {
    "name": "Stefano Cottafavi",
    "contact": {
      "web": "https://github.com/cooked/kimotor"
    }
  },
  "maintainer": {
    "name": "Stefano Cottafavi",
    "contact": {
      "web": "https://github.com/cooked/kimotor"
    }
  },
  "license": "GPL-2.0",
  "versions": [
    {
      "version": "0.1.1",
      "status": "development",
      "kicad_version": "6.0",
      "download_url": "https://github.com/cooked/kimotor/releases/download/v0.1.1/kimotor-pcm.zip",
      "download_sha256": "7b1ddf0238d22172784c41a28b089239984e2915da1cd72372cb509436ca2fac",
      "download_size": 28495,
      "install_size": 91726
    }
  ],
  "resources": {
    "homepage": "https://github.com/cooked/kimotor"
  }
}
