{
    "uid": "homepage",
    "uuid": "eyJpdGVtSWQiOiJob21lcGFnZSIsImNhdGFsb2dJZCI6Im9zYW5lZENvbnRlbnRDYXRhbG9nIiwiY2F0YWxvZ1ZlcnNpb24iOiJPbmxpbmUifQ==",
    "template": "OsanedHomePageTemplate",
    "typeCode": "ContentPage",
    "name": "Homepage",
    "contentSlots": {
      "contentSlot": [
        {
          "slotId": "HeaderInfoSlot",
          "slotUuid": "eyJpdGVtSWQiOiJIZWFkZXJJbmZvU2xvdCIsImNhdGFsb2dJZCI6Im9zYW5lZENvbnRlbnRDYXRhbG9nIiwiY2F0YWxvZ1ZlcnNpb24iOiJPbmxpbmUifQ==",
          "position": "HeaderInfo",
          "name": "Header Info Slot",
          "slotShared": true,
          "components": {
            "component": [
              {
                "uid": "headerInfoParagraphComponent1",
                "uuid": "eyJpdGVtSWQiOiJoZWFkZXJJbmZvUGFyYWdyYXBoQ29tcG9uZW50MSIsImNhdGFsb2dJZCI6Im9zYW5lZENvbnRlbnRDYXRhbG9nIiwiY2F0YWxvZ1ZlcnNpb24iOiJPbmxpbmUifQ==",
                "typeCode": "CMSParagraphComponent",
                "modifiedTime": "2020-02-11T18:21:18.935+05:30",
                "name": "header Info Paragraph Component1",
                "container": "false",
                "content": "+972-77-9322636"
              },
              {
                "uid": "headerInfoParagraphComponent2",
                "uuid": "eyJpdGVtSWQiOiJoZWFkZXJJbmZvUGFyYWdyYXBoQ29tcG9uZW50MiIsImNhdGFsb2dJZCI6Im9zYW5lZENvbnRlbnRDYXRhbG9nIiwiY2F0YWxvZ1ZlcnNpb24iOiJPbmxpbmUifQ==",
                "typeCode": "CMSParagraphComponent",
                "modifiedTime": "2020-02-11T18:21:18.955+05:30",
                "name": "header Info Paragraph Component2",
                "container": "false",
                "content": "info@saned.com"
              }
            ]
          }
        },
        {
          "slotId": "SiteLogoSlot",
          "slotUuid": "eyJpdGVtSWQiOiJTaXRlTG9nb1Nsb3QiLCJjYXRhbG9nSWQiOiJvc2FuZWRDb250ZW50Q2F0YWxvZyIsImNhdGFsb2dWZXJzaW9uIjoiT25saW5lIn0=",
          "position": "SiteLogo",
          "name": "Default Site Logo Slot",
          "slotShared": true,
          "components": {
            "component": [
              {
                "uid": "OsanedSiteLogoComponent",
                "uuid": "eyJpdGVtSWQiOiJPc2FuZWRTaXRlTG9nb0NvbXBvbmVudCIsImNhdGFsb2dJZCI6Im9zYW5lZENvbnRlbnRDYXRhbG9nIiwiY2F0YWxvZ1ZlcnNpb24iOiJPbmxpbmUifQ==",
                "typeCode": "SimpleBannerComponent",
                "modifiedTime": "2020-02-11T18:14:58.57+05:30",
                "name": "Osaned Site Logo Component",
                "container": "false",
                "external": "false",
                "media": {
                  "code": "sitelogo",
                  "mime": "image/png",
                  "url": "/medias/site-logo.png?context=bWFzdGVyfGltYWdlc3wxMTEyOXxpbWFnZS9wbmd8aGEwL2g5Mi84Nzk3MTQ1OTU2MzgyL3NpdGUtbG9nby5wbmd8NTFlMzgzZmIzZTZmMjkzODQ4OWYyMzQyNTIzY2EzOGRkMmM4M2ViOTFhYjcxMTdhNzFmMGUyMGZlNTA4NmZhYQ"
                },
                "urlLink": "/"
              }
            ]
          }
        },
        {
          "slotId": "NavigationBarSlot",
          "slotUuid": "eyJpdGVtSWQiOiJOYXZpZ2F0aW9uQmFyU2xvdCIsImNhdGFsb2dJZCI6Im9zYW5lZENvbnRlbnRDYXRhbG9nIiwiY2F0YWxvZ1ZlcnNpb24iOiJPbmxpbmUifQ==",
          "position": "NavigationBar",
          "name": "Navigation Bar Slot",
          "slotShared": true,
          "components": {
            "component": [
              {
                "uid": "HomeLinkComponent",
                "uuid": "eyJpdGVtSWQiOiJIb21lTGlua0NvbXBvbmVudCIsImNhdGFsb2dJZCI6Im9zYW5lZENvbnRlbnRDYXRhbG9nIiwiY2F0YWxvZ1ZlcnNpb24iOiJPbmxpbmUifQ==",
                "typeCode": "CMSLinkComponent",
                "modifiedTime": "2020-02-11T18:14:58.615+05:30",
                "name": "Home Link",
                "container": "false",
                "external": "false",
                "linkName": "Home",
                "url": "#",
                "target": "false"
              },
              {
                "uid": "AboutSanedLinkComponent",
                "uuid": "eyJpdGVtSWQiOiJBYm91dFNhbmVkTGlua0NvbXBvbmVudCIsImNhdGFsb2dJZCI6Im9zYW5lZENvbnRlbnRDYXRhbG9nIiwiY2F0YWxvZ1ZlcnNpb24iOiJPbmxpbmUifQ==",
                "typeCode": "CMSLinkComponent",
                "modifiedTime": "2020-02-11T18:14:58.629+05:30",
                "name": "About Saned Link",
                "container": "false",
                "external": "false",
                "linkName": "About Saned",
                "url": "#",
                "target": "false"
              },
              {
                "uid": "ProductsLinkComponent",
                "uuid": "eyJpdGVtSWQiOiJQcm9kdWN0c0xpbmtDb21wb25lbnQiLCJjYXRhbG9nSWQiOiJvc2FuZWRDb250ZW50Q2F0YWxvZyIsImNhdGFsb2dWZXJzaW9uIjoiT25saW5lIn0=",
                "typeCode": "CMSLinkComponent",
                "modifiedTime": "2020-02-11T18:14:58.644+05:30",
                "name": "Products Link",
                "container": "false",
                "external": "false",
                "linkName": "Products",
                "url": "#",
                "target": "false"
              },
              {
                "uid": "ResourcesLinkComponent",
                "uuid": "eyJpdGVtSWQiOiJSZXNvdXJjZXNMaW5rQ29tcG9uZW50IiwiY2F0YWxvZ0lkIjoib3NhbmVkQ29udGVudENhdGFsb2ciLCJjYXRhbG9nVmVyc2lvbiI6Ik9ubGluZSJ9",
                "typeCode": "CMSLinkComponent",
                "modifiedTime": "2020-02-11T18:14:58.663+05:30",
                "name": "Resources Link",
                "container": "false",
                "external": "false",
                "linkName": "Resources",
                "url": "#",
                "target": "false"
              },
              {
                "uid": "TestimonialsLinkComponent",
                "uuid": "eyJpdGVtSWQiOiJUZXN0aW1vbmlhbHNMaW5rQ29tcG9uZW50IiwiY2F0YWxvZ0lkIjoib3NhbmVkQ29udGVudENhdGFsb2ciLCJjYXRhbG9nVmVyc2lvbiI6Ik9ubGluZSJ9",
                "typeCode": "CMSLinkComponent",
                "modifiedTime": "2020-02-11T18:14:58.679+05:30",
                "name": "Testimonials Link",
                "container": "false",
                "external": "false",
                "linkName": "Testimonials",
                "url": "#",
                "target": "false"
              },
              {
                "uid": "ContactUsLinkComponent",
                "uuid": "eyJpdGVtSWQiOiJDb250YWN0VXNMaW5rQ29tcG9uZW50IiwiY2F0YWxvZ0lkIjoib3NhbmVkQ29udGVudENhdGFsb2ciLCJjYXRhbG9nVmVyc2lvbiI6Ik9ubGluZSJ9",
                "typeCode": "CMSLinkComponent",
                "modifiedTime": "2020-02-11T18:14:58.694+05:30",
                "name": "Contact Us Link",
                "container": "false",
                "external": "false",
                "linkName": "Contact Us",
                "url": "#",
                "target": "false"
              }
            ]
          }
        },
        {
          "slotId": "HomePageCarouselSlot",
          "slotUuid": "eyJpdGVtSWQiOiJIb21lUGFnZUNhcm91c2VsU2xvdCIsImNhdGFsb2dJZCI6Im9zYW5lZENvbnRlbnRDYXRhbG9nIiwiY2F0YWxvZ1ZlcnNpb24iOiJPbmxpbmUifQ==",
          "position": "HomePageCarousel",
          "name": "HomePage Carousel Slot",
          "slotShared": true,
          "components": {
            "component": [
              {
                "uid": "HomePageBanner1",
                "uuid": "eyJpdGVtSWQiOiJIb21lUGFnZUJhbm5lcjEiLCJjYXRhbG9nSWQiOiJvc2FuZWRDb250ZW50Q2F0YWxvZyIsImNhdGFsb2dWZXJzaW9uIjoiT25saW5lIn0=",
                "typeCode": "BannerComponent",
                "modifiedTime": "2020-02-11T18:14:58.731+05:30",
                "name": "Home Page Banner 1",
                "container": "false",
                "external": "false",
                "media": {
                  "code": "carouselImage1",
                  "mime": "image/jpeg",
                  "url": "/medias/slideimage.jpg?context=bWFzdGVyfGltYWdlc3w0NzU0Njg4fGltYWdlL2pwZWd8aW1hZ2VzL2hlZi9oZDAvODc5NjE0MzI4ODM1MC5qcGd8NDBiNTM1ZGU2OGM4MjkyN2JhYzk0NmMwOGI1ODE0ODQ2OTAwOWY2NWY1YzlkM2YzNWM1NDdiYTVjYzE5ZjQxZA"
                },
                "urlLink": "#"
              },
              {
                "uid": "HomePageBanner2",
                "uuid": "eyJpdGVtSWQiOiJIb21lUGFnZUJhbm5lcjIiLCJjYXRhbG9nSWQiOiJvc2FuZWRDb250ZW50Q2F0YWxvZyIsImNhdGFsb2dWZXJzaW9uIjoiT25saW5lIn0=",
                "typeCode": "BannerComponent",
                "modifiedTime": "2020-02-11T18:14:58.764+05:30",
                "name": "Home Page Banner 2",
                "container": "false",
                "external": "false",
                "media": {
                  "code": "carouselImage2",
                  "mime": "image/jpeg",
                  "url": "/medias/slideimage.jpg?context=bWFzdGVyfGltYWdlc3w5MjI3MDgyfGltYWdlL2pwZWd8aW1hZ2VzL2g2MS9oYzgvODc5NjE0MzMyMTExOC5qcGd8MTE5NjkyZmEzNzBjYTY3NDhiNWVmNjg4OGU2OWE2NTI1MzU2NzMwMmM4ZjcwNmFhYjgxOTEzMzIxN2NmODBmNw"
                },
                "urlLink": "#"
              },
              {
                "uid": "HomePageBanner3",
                "uuid": "eyJpdGVtSWQiOiJIb21lUGFnZUJhbm5lcjMiLCJjYXRhbG9nSWQiOiJvc2FuZWRDb250ZW50Q2F0YWxvZyIsImNhdGFsb2dWZXJzaW9uIjoiT25saW5lIn0=",
                "typeCode": "BannerComponent",
                "modifiedTime": "2020-02-11T18:14:58.791+05:30",
                "name": "Home Page Banner 3",
                "container": "false",
                "external": "false",
                "media": {
                  "code": "carouselImage3",
                  "mime": "image/jpeg",
                  "url": "/medias/slideimage.jpg?context=bWFzdGVyfGltYWdlc3w2MzUyNjQ1fGltYWdlL2pwZWd8aW1hZ2VzL2hmZi9oYjIvODc5NjE0MzM1Mzg4Ni5qcGd8M2U4ZmEwZmUwNjY0ZDRkYWNlNGZiNTExZTBhYmEyY2E2ZGU4YmRlMTZhYTA0MTcwMjI0YjU3MzI4MzAzNzJmYQ"
                },
                "urlLink": "#"
              },
              {
                "uid": "HomePageBanner4",
                "uuid": "eyJpdGVtSWQiOiJIb21lUGFnZUJhbm5lcjQiLCJjYXRhbG9nSWQiOiJvc2FuZWRDb250ZW50Q2F0YWxvZyIsImNhdGFsb2dWZXJzaW9uIjoiT25saW5lIn0=",
                "typeCode": "BannerComponent",
                "modifiedTime": "2020-02-11T18:14:58.822+05:30",
                "name": "Home Page Banner 4",
                "container": "false",
                "external": "false",
                "media": {
                  "code": "carouselImage4",
                  "mime": "image/jpeg",
                  "url": "/medias/slideimage.jpg?context=bWFzdGVyfGltYWdlc3w2Mjk2NTYzfGltYWdlL2pwZWd8aW1hZ2VzL2hkMy9oNTcvODc5NjE0MzM4NjY1NC5qcGd8NzRkNjU2ZDdjMGFhZWY5MzBhYjRkMzRiYTg0YmZlZGZmNGQ4NzY0ODcyYjg3NTViZjkzN2EzNGI1NzM1NzY5NA"
                },
                "urlLink": "#"
              },
              {
                "uid": "HomePageBanner5",
                "uuid": "eyJpdGVtSWQiOiJIb21lUGFnZUJhbm5lcjUiLCJjYXRhbG9nSWQiOiJvc2FuZWRDb250ZW50Q2F0YWxvZyIsImNhdGFsb2dWZXJzaW9uIjoiT25saW5lIn0=",
                "typeCode": "BannerComponent",
                "modifiedTime": "2020-02-11T18:14:58.852+05:30",
                "name": "Home Page Banner 5",
                "container": "false",
                "external": "false",
                "media": {
                  "code": "carouselImage5",
                  "mime": "image/jpeg",
                  "url": "/medias/slideimage.jpg?context=bWFzdGVyfGltYWdlc3w4MTk5MDE4fGltYWdlL2pwZWd8aW1hZ2VzL2gxZS9oNGEvODc5NjE0MzQxOTQyMi5qcGd8NjU1NjhjYzdmNWU0MDM3MTE2NmMxZDZhNWVkYjljOWZiZTI5Y2UyZDJjMDc4MjJiYTRmMmNlOTc4OGEzY2E3Zg"
                },
                "urlLink": "#"
              },
              {
                "uid": "HomePageBanner6",
                "uuid": "eyJpdGVtSWQiOiJIb21lUGFnZUJhbm5lcjYiLCJjYXRhbG9nSWQiOiJvc2FuZWRDb250ZW50Q2F0YWxvZyIsImNhdGFsb2dWZXJzaW9uIjoiT25saW5lIn0=",
                "typeCode": "BannerComponent",
                "modifiedTime": "2020-02-11T18:14:58.881+05:30",
                "name": "Home Page Banner 6",
                "container": "false",
                "external": "false",
                "media": {
                  "code": "carouselImage6",
                  "mime": "image/jpeg",
                  "url": "/medias/slideimage.jpg?context=bWFzdGVyfGltYWdlc3wyMjM0MzU1M3xpbWFnZS9qcGVnfGltYWdlcy9oMDUvaDdjLzg3OTYxNDM0NTIxOTAuanBnfGYxODQ0NTZhZGI1OWZjY2Q0YjIyZTdlOWRjNWQwNjMwNDViNWMyZTNmMjhjYzIxZjZjOTE0NTQxZjQ0NGU5ZGE"
                },
                "urlLink": "#"
              }
            ]
          }
        },
        {
          "slotId": "ValuableClientSlot",
          "slotUuid": "eyJpdGVtSWQiOiJWYWx1YWJsZUNsaWVudFNsb3QiLCJjYXRhbG9nSWQiOiJvc2FuZWRDb250ZW50Q2F0YWxvZyIsImNhdGFsb2dWZXJzaW9uIjoiT25saW5lIn0=",
          "position": "ValuableClient",
          "name": "Valuable Client Slot",
          "slotShared": true,
          "components": {
            "component": [
              {
                "uid": "osanedhomepagevaluableclients1",
                "uuid": "eyJpdGVtSWQiOiJvc2FuZWRob21lcGFnZXZhbHVhYmxlY2xpZW50czEiLCJjYXRhbG9nSWQiOiJvc2FuZWRDb250ZW50Q2F0YWxvZyIsImNhdGFsb2dWZXJzaW9uIjoiT25saW5lIn0=",
                "typeCode": "BannerComponent",
                "modifiedTime": "2020-02-11T18:14:59.016+05:30",
                "name": "osaned homepage valuable clients1",
                "container": "false",
                "external": "false",
                "media": {
                  "code": "moduleoLogo",
                  "mime": "image/png",
                  "url": "/medias/Moduleo-logo.png?context=bWFzdGVyfGltYWdlc3w5MjQyfGltYWdlL3BuZ3xpbWFnZXMvaDY5L2g2My84Nzk2MTQzNjgxNTY2LnBuZ3xmY2VlMDFjNWNiNmFjYmM5NGYxZDYzOTM0NTQzM2YzMGYxYzY5M2Q3ZWQ3N2EwN2FiNTdmZTRlYmMzMjRhOTg2"
                },
                "urlLink": "#"
              },
              {
                "uid": "osanedhomepagevaluableclients2",
                "uuid": "eyJpdGVtSWQiOiJvc2FuZWRob21lcGFnZXZhbHVhYmxlY2xpZW50czIiLCJjYXRhbG9nSWQiOiJvc2FuZWRDb250ZW50Q2F0YWxvZyIsImNhdGFsb2dWZXJzaW9uIjoiT25saW5lIn0=",
                "typeCode": "BannerComponent",
                "modifiedTime": "2020-02-11T18:14:59.037+05:30",
                "name": "osaned homepage valuable clients2",
                "container": "false",
                "external": "false",
                "media": {
                  "code": "frankeLogo",
                  "mime": "image/png",
                  "url": "/medias/franke.png?context=bWFzdGVyfGltYWdlc3w0MTc0fGltYWdlL3BuZ3xpbWFnZXMvaGEzL2hmYS84Nzk2MTQzNzE0MzM0LnBuZ3wxZjI3ZTRhYjg0ZTZmMjVkODE0ODc1MzJlYWZhMjk1NTg1MTViMWEwYzMyNDY5NDkxOTM0NzA0ZmE1YmQ1YjIx"
                },
                "urlLink": "#"
              },
              {
                "uid": "osanedhomepagevaluableclients3",
                "uuid": "eyJpdGVtSWQiOiJvc2FuZWRob21lcGFnZXZhbHVhYmxlY2xpZW50czMiLCJjYXRhbG9nSWQiOiJvc2FuZWRDb250ZW50Q2F0YWxvZyIsImNhdGFsb2dWZXJzaW9uIjoiT25saW5lIn0=",
                "typeCode": "BannerComponent",
                "modifiedTime": "2020-02-11T18:14:59.066+05:30",
                "name": "osaned homepage valuable clients3",
                "container": "false",
                "external": "false",
                "media": {
                  "code": "alstomLogo",
                  "mime": "image/png",
                  "url": "/medias/alstom.png?context=bWFzdGVyfGltYWdlc3wzMzIxfGltYWdlL3BuZ3xpbWFnZXMvaDc3L2gwNS84Nzk2MTQzNzQ3MTAyLnBuZ3xiZTdiMTI2YWJkN2NhZGNjZWVmNTY5MzdmMWQzOGJmZWRhNWNlMDcyNzA0MWJkZTAzZTdmZWI1YTBhNDJhNzc0"
                },
                "urlLink": "#"
              },
              {
                "uid": "osanedhomepagevaluableclients4",
                "uuid": "eyJpdGVtSWQiOiJvc2FuZWRob21lcGFnZXZhbHVhYmxlY2xpZW50czQiLCJjYXRhbG9nSWQiOiJvc2FuZWRDb250ZW50Q2F0YWxvZyIsImNhdGFsb2dWZXJzaW9uIjoiT25saW5lIn0=",
                "typeCode": "BannerComponent",
                "modifiedTime": "2020-02-11T18:14:59.097+05:30",
                "name": "osaned homepage valuable clients4",
                "container": "false",
                "external": "false",
                "media": {
                  "code": "gorenjeLogo",
                  "mime": "image/png",
                  "url": "/medias/gorenje.png?context=bWFzdGVyfGltYWdlc3w1NzAyfGltYWdlL3BuZ3xpbWFnZXMvaGQ5L2gxYS84Nzk2MTQzNzc5ODcwLnBuZ3w5MTYzNjJmZWQ3ZTY4MjE1NWMzNGRhZjcxZTlkMDMyMmRlNjA4ZWZjNmMxYmRkMzBlYTRkNjU1MDAyYWRhMmI2"
                },
                "urlLink": "#"
              }
            ]
          }
        },
        {
          "slotId": "FooterColumn1Slot",
          "slotUuid": "eyJpdGVtSWQiOiJGb290ZXJDb2x1bW4xU2xvdCIsImNhdGFsb2dJZCI6Im9zYW5lZENvbnRlbnRDYXRhbG9nIiwiY2F0YWxvZ1ZlcnNpb24iOiJPbmxpbmUifQ==",
          "position": "FooterColumn1",
          "name": "Footer Column1 Slot",
          "slotShared": true,
          "components": {
            "component": [
              {
                "uid": "footerColumn1LinkComponent1",
                "uuid": "eyJpdGVtSWQiOiJmb290ZXJDb2x1bW4xTGlua0NvbXBvbmVudDEiLCJjYXRhbG9nSWQiOiJvc2FuZWRDb250ZW50Q2F0YWxvZyIsImNhdGFsb2dWZXJzaW9uIjoiT25saW5lIn0=",
                "typeCode": "CMSLinkComponent",
                "modifiedTime": "2020-02-11T18:14:59.186+05:30",
                "name": "footer Column1 LinkComponent1",
                "container": "false",
                "external": "false",
                "linkName": "Why Saned",
                "url": "#",
                "target": "false"
              },
              {
                "uid": "footerColumn1LinkComponent2",
                "uuid": "eyJpdGVtSWQiOiJmb290ZXJDb2x1bW4xTGlua0NvbXBvbmVudDIiLCJjYXRhbG9nSWQiOiJvc2FuZWRDb250ZW50Q2F0YWxvZyIsImNhdGFsb2dWZXJzaW9uIjoiT25saW5lIn0=",
                "typeCode": "CMSLinkComponent",
                "modifiedTime": "2020-02-11T18:14:59.198+05:30",
                "name": "footer Column1 LinkComponent2",
                "container": "false",
                "external": "false",
                "linkName": "Finance",
                "url": "#",
                "target": "false"
              },
              {
                "uid": "footerColumn1LinkComponent3",
                "uuid": "eyJpdGVtSWQiOiJmb290ZXJDb2x1bW4xTGlua0NvbXBvbmVudDMiLCJjYXRhbG9nSWQiOiJvc2FuZWRDb250ZW50Q2F0YWxvZyIsImNhdGFsb2dWZXJzaW9uIjoiT25saW5lIn0=",
                "typeCode": "CMSLinkComponent",
                "modifiedTime": "2020-02-11T18:14:59.211+05:30",
                "name": "footer Column1 LinkComponent3",
                "container": "false",
                "external": "false",
                "linkName": "Saned Community",
                "url": "#",
                "target": "false"
              }
            ]
          }
        },
        {
          "slotId": "FooterColumn2Slot",
          "slotUuid": "eyJpdGVtSWQiOiJGb290ZXJDb2x1bW4yU2xvdCIsImNhdGFsb2dJZCI6Im9zYW5lZENvbnRlbnRDYXRhbG9nIiwiY2F0YWxvZ1ZlcnNpb24iOiJPbmxpbmUifQ==",
          "position": "FooterColumn2",
          "name": "Footer Column2 Slot",
          "slotShared": true,
          "components": {
            "component": [
              {
                "uid": "footerColumn2LinkComponent1",
                "uuid": "eyJpdGVtSWQiOiJmb290ZXJDb2x1bW4yTGlua0NvbXBvbmVudDEiLCJjYXRhbG9nSWQiOiJvc2FuZWRDb250ZW50Q2F0YWxvZyIsImNhdGFsb2dWZXJzaW9uIjoiT25saW5lIn0=",
                "typeCode": "CMSLinkComponent",
                "modifiedTime": "2020-02-11T18:14:59.232+05:30",
                "name": "footer Column2 LinkComponent1",
                "container": "false",
                "external": "false",
                "linkName": "Trade Mark",
                "url": "#",
                "target": "false"
              },
              {
                "uid": "footerColumn2LinkComponent2",
                "uuid": "eyJpdGVtSWQiOiJmb290ZXJDb2x1bW4yTGlua0NvbXBvbmVudDIiLCJjYXRhbG9nSWQiOiJvc2FuZWRDb250ZW50Q2F0YWxvZyIsImNhdGFsb2dWZXJzaW9uIjoiT25saW5lIn0=",
                "typeCode": "CMSLinkComponent",
                "modifiedTime": "2020-02-11T18:14:59.245+05:30",
                "name": "footer Column2 LinkComponent2",
                "container": "false",
                "external": "false",
                "linkName": "Site Map",
                "url": "#",
                "target": "false"
              },
              {
                "uid": "footerColumn2LinkComponent3",
                "uuid": "eyJpdGVtSWQiOiJmb290ZXJDb2x1bW4yTGlua0NvbXBvbmVudDMiLCJjYXRhbG9nSWQiOiJvc2FuZWRDb250ZW50Q2F0YWxvZyIsImNhdGFsb2dWZXJzaW9uIjoiT25saW5lIn0=",
                "typeCode": "CMSLinkComponent",
                "modifiedTime": "2020-02-11T18:14:59.257+05:30",
                "name": "footer Column2 LinkComponent3",
                "container": "false",
                "external": "false",
                "url": "#",
                "target": "false"
              }
            ]
          }
        },
        {
          "slotId": "FooterColumn3Slot",
          "slotUuid": "eyJpdGVtSWQiOiJGb290ZXJDb2x1bW4zU2xvdCIsImNhdGFsb2dJZCI6Im9zYW5lZENvbnRlbnRDYXRhbG9nIiwiY2F0YWxvZ1ZlcnNpb24iOiJPbmxpbmUifQ==",
          "position": "FooterColumn3",
          "name": "Footer Column3 Slot",
          "slotShared": true,
          "components": {
            "component": [
              {
                "uid": "footerColumn3LinkComponent1",
                "uuid": "eyJpdGVtSWQiOiJmb290ZXJDb2x1bW4zTGlua0NvbXBvbmVudDEiLCJjYXRhbG9nSWQiOiJvc2FuZWRDb250ZW50Q2F0YWxvZyIsImNhdGFsb2dWZXJzaW9uIjoiT25saW5lIn0=",
                "typeCode": "CMSLinkComponent",
                "modifiedTime": "2020-02-11T18:14:59.269+05:30",
                "name": "footer Column3 LinkComponent1",
                "container": "false",
                "external": "false",
                "linkName": "privacy",
                "url": "#",
                "target": "false"
              },
              {
                "uid": "footerColumn3LinkComponent2",
                "uuid": "eyJpdGVtSWQiOiJmb290ZXJDb2x1bW4zTGlua0NvbXBvbmVudDIiLCJjYXRhbG9nSWQiOiJvc2FuZWRDb250ZW50Q2F0YWxvZyIsImNhdGFsb2dWZXJzaW9uIjoiT25saW5lIn0=",
                "typeCode": "CMSLinkComponent",
                "modifiedTime": "2020-02-11T18:14:59.283+05:30",
                "name": "footer Column3 LinkComponent2",
                "container": "false",
                "external": "false",
                "linkName": "Terms of Use",
                "url": "#",
                "target": "false"
              },
              {
                "uid": "footerColumn3LinkComponent3",
                "uuid": "eyJpdGVtSWQiOiJmb290ZXJDb2x1bW4zTGlua0NvbXBvbmVudDMiLCJjYXRhbG9nSWQiOiJvc2FuZWRDb250ZW50Q2F0YWxvZyIsImNhdGFsb2dWZXJzaW9uIjoiT25saW5lIn0=",
                "typeCode": "CMSLinkComponent",
                "modifiedTime": "2020-02-11T18:14:59.296+05:30",
                "name": "footer Column3 LinkComponent3",
                "container": "false",
                "external": "false",
                "linkName": "Copy Rights",
                "url": "#",
                "target": "false"
              }
            ]
          }
        },
        {
          "slotId": "FooterColumn4Slot",
          "slotUuid": "eyJpdGVtSWQiOiJGb290ZXJDb2x1bW40U2xvdCIsImNhdGFsb2dJZCI6Im9zYW5lZENvbnRlbnRDYXRhbG9nIiwiY2F0YWxvZ1ZlcnNpb24iOiJPbmxpbmUifQ==",
          "position": "FooterColumn4",
          "name": "Footer Column4 Slot",
          "slotShared": true,
          "components": {
            "component": [
              {
                "uid": "footerColumn4LinkComponent1",
                "uuid": "eyJpdGVtSWQiOiJmb290ZXJDb2x1bW40TGlua0NvbXBvbmVudDEiLCJjYXRhbG9nSWQiOiJvc2FuZWRDb250ZW50Q2F0YWxvZyIsImNhdGFsb2dWZXJzaW9uIjoiT25saW5lIn0=",
                "typeCode": "CMSLinkComponent",
                "modifiedTime": "2020-02-11T18:14:59.323+05:30",
                "name": "footer Column4 LinkComponent1",
                "container": "false",
                "external": "false",
                "linkName": "Nirit76 Golan Street Nirit Israek",
                "url": "#",
                "target": "false"
              },
              {
                "uid": "footerColumn4LinkComponent2",
                "uuid": "eyJpdGVtSWQiOiJmb290ZXJDb2x1bW40TGlua0NvbXBvbmVudDIiLCJjYXRhbG9nSWQiOiJvc2FuZWRDb250ZW50Q2F0YWxvZyIsImNhdGFsb2dWZXJzaW9uIjoiT25saW5lIn0=",
                "typeCode": "CMSLinkComponent",
                "modifiedTime": "2020-02-11T18:14:59.338+05:30",
                "name": "footer Column4 LinkComponent2",
                "container": "false",
                "external": "false",
                "linkName": "+972-77-9322636",
                "url": "#",
                "target": "false"
              },
              {
                "uid": "footerColumn4LinkComponent3",
                "uuid": "eyJpdGVtSWQiOiJmb290ZXJDb2x1bW40TGlua0NvbXBvbmVudDMiLCJjYXRhbG9nSWQiOiJvc2FuZWRDb250ZW50Q2F0YWxvZyIsImNhdGFsb2dWZXJzaW9uIjoiT25saW5lIn0=",
                "typeCode": "CMSLinkComponent",
                "modifiedTime": "2020-02-11T18:14:59.352+05:30",
                "name": "footer Column4 LinkComponent3",
                "container": "false",
                "external": "false",
                "linkName": "info@saned.com",
                "url": "#",
                "target": "false"
              }
            ]
          }
        },
        {
          "slotId": "CopyRightsSlot",
          "slotUuid": "eyJpdGVtSWQiOiJDb3B5UmlnaHRzU2xvdCIsImNhdGFsb2dJZCI6Im9zYW5lZENvbnRlbnRDYXRhbG9nIiwiY2F0YWxvZ1ZlcnNpb24iOiJPbmxpbmUifQ==",
          "position": "CopyRights",
          "name": "CopyRights Slot",
          "slotShared": true,
          "components": {
            "component": [
              {
                "uid": "copyRightsComponent",
                "uuid": "eyJpdGVtSWQiOiJjb3B5UmlnaHRzQ29tcG9uZW50IiwiY2F0YWxvZ0lkIjoib3NhbmVkQ29udGVudENhdGFsb2ciLCJjYXRhbG9nVmVyc2lvbiI6Ik9ubGluZSJ9",
                "typeCode": "CMSParagraphComponent",
                "modifiedTime": "2020-02-11T18:21:18.973+05:30",
                "name": "copyRights Component",
                "container": "false",
                "content": "Copyright © 2020, company name. All Rights Reserved"
              }
            ]
          }
        },
        {
          "slotId": "SanedSolutionSlot",
          "slotUuid": "eyJpdGVtSWQiOiJTYW5lZFNvbHV0aW9uU2xvdCIsImNhdGFsb2dJZCI6Im9zYW5lZENvbnRlbnRDYXRhbG9nIiwiY2F0YWxvZ1ZlcnNpb24iOiJPbmxpbmUifQ==",
          "position": "SanedSolution",
          "name": "Saned Solution Slot",
          "slotShared": true,
          "components": {
            "component": [
              {
                "uid": "OsanedHompageFinanceSystemsBannerComponent",
                "uuid": "eyJpdGVtSWQiOiJPc2FuZWRIb21wYWdlRmluYW5jZVN5c3RlbXNCYW5uZXJDb21wb25lbnQiLCJjYXRhbG9nSWQiOiJvc2FuZWRDb250ZW50Q2F0YWxvZyIsImNhdGFsb2dWZXJzaW9uIjoiT25saW5lIn0=",
                "typeCode": "BannerComponent",
                "modifiedTime": "2020-02-11T18:14:58.907+05:30",
                "name": "Osaned Homepage Finance Systems Banner Component",
                "container": "false",
                "external": "false",
                "media": {
                  "code": "financeImage",
                  "mime": "image/png",
                  "url": "/medias/finance.png?context=bWFzdGVyfGltYWdlc3wzMTcwfGltYWdlL3BuZ3xpbWFnZXMvaDQ3L2gyMS84Nzk2MTQzNDg0OTU4LnBuZ3xmNTE4N2IwOTgzODM0ODBjNjQxZGU5MmFiZTZmZTkzNWUxNjljZjIyNzBjOGFiMDNkOWFmMGEzZWQwZTZiYzM1"
                },
                "headline": "Finance System",
                "urlLink": "#"
              },
              {
                "uid": "OsanedHompageHrmsBannerComponent",
                "uuid": "eyJpdGVtSWQiOiJPc2FuZWRIb21wYWdlSHJtc0Jhbm5lckNvbXBvbmVudCIsImNhdGFsb2dJZCI6Im9zYW5lZENvbnRlbnRDYXRhbG9nIiwiY2F0YWxvZ1ZlcnNpb24iOiJPbmxpbmUifQ==",
                "typeCode": "BannerComponent",
                "modifiedTime": "2020-02-11T18:14:58.935+05:30",
                "name": "Osaned Homepage HRMS  Banner Component",
                "container": "false",
                "external": "false",
                "media": {
                  "code": "hrImage",
                  "mime": "image/png",
                  "url": "/medias/hr.png?context=bWFzdGVyfGltYWdlc3wxMDExNnxpbWFnZS9wbmd8aW1hZ2VzL2gzYS9oYzMvODc5NjE0MzUxNzcyNi5wbmd8MGUwNzRmYWMwMzllY2NmM2QyNDViYzE1ZTE5Y2UyYjE2YmUyOTIwOGYxYmY5OTExNGRjODExNzQ0MDRhYzRhNQ"
                },
                "headline": "HRMS",
                "urlLink": "#"
              },
              {
                "uid": "OsanedHompageSupplyChainBannerComponent",
                "uuid": "eyJpdGVtSWQiOiJPc2FuZWRIb21wYWdlU3VwcGx5Q2hhaW5CYW5uZXJDb21wb25lbnQiLCJjYXRhbG9nSWQiOiJvc2FuZWRDb250ZW50Q2F0YWxvZyIsImNhdGFsb2dWZXJzaW9uIjoiT25saW5lIn0=",
                "typeCode": "BannerComponent",
                "modifiedTime": "2020-02-11T18:14:58.964+05:30",
                "name": "Osaned Homepage Supply Chain Banner Component",
                "container": "false",
                "external": "false",
                "media": {
                  "code": "supplyImage",
                  "mime": "image/png",
                  "url": "/medias/supply.png?context=bWFzdGVyfGltYWdlc3wzODE4fGltYWdlL3BuZ3xpbWFnZXMvaGIxL2gxNS84Nzk2MTQzNTgzMjYyLnBuZ3xmODdlZDMxYTUzYjc4OWE3YjZmMDhiY2E4NzBlNzE4ZTlkMGIxMGJlYzE4NGQ0Nzc4N2YyZmU0ZTI2MDkwN2I1"
                },
                "headline": "Supply Chain",
                "urlLink": "#"
              },
              {
                "uid": "OsanedHompageManufacturingBannerComponent",
                "uuid": "eyJpdGVtSWQiOiJPc2FuZWRIb21wYWdlTWFudWZhY3R1cmluZ0Jhbm5lckNvbXBvbmVudCIsImNhdGFsb2dJZCI6Im9zYW5lZENvbnRlbnRDYXRhbG9nIiwiY2F0YWxvZ1ZlcnNpb24iOiJPbmxpbmUifQ==",
                "typeCode": "BannerComponent",
                "modifiedTime": "2020-02-11T18:14:58.991+05:30",
                "name": "Osaned Homepage Manufacturing Banner Component",
                "container": "false",
                "external": "false",
                "media": {
                  "code": "manufacturingImage",
                  "mime": "image/png",
                  "url": "/medias/manufacturing.png?context=bWFzdGVyfGltYWdlc3w0ODMxfGltYWdlL3BuZ3xpbWFnZXMvaDIxL2hmNS84Nzk2MTQzNTUwNDk0LnBuZ3w2MTQzMzdjOWVhNTUwNmJmNWExMmIzNjg2ODZiNmZjYjA1ZmFkNmRlYTI3OWU2MGY3YzdjNTliMjU5M2EyNzRj"
                },
                "headline": "Manufacturing",
                "urlLink": "#"
              }
            ]
          }
        }
      ]
    },
    "label": "homepage"
  }