{
  "id": "620a4d5efc13ae12140004b0",
  "firstNname": "Novelia",
  "lastName": "Hadingham",
  "email": "nhadingham0@sina.com.cn",
  "password": "O64N85Rc",
  "isAdmin": true,
  "mobileNumber": "7599681493"
