rm -f *.exe *.o
gcc -g -Wall -std=c11 -c vector.c
gcc -o vector.exe vector.o -lFHBRS -lX11 -lpthread -lm
./vector.exe 10 16
p= 1, checksum=301, sequential time:  0.000002, parallel time:  0.000212, speedup:  0.0
p= 2, checksum=301, sequential time:  0.000002, parallel time:  0.000206, speedup:  0.0
p= 3, checksum=301, sequential time:  0.000002, parallel time:  0.000202, speedup:  0.0
p= 4, checksum=301, sequential time:  0.000002, parallel time:  0.000195, speedup:  0.0
p= 5, checksum=301, sequential time:  0.000002, parallel time:  0.000277, speedup:  0.0
p= 6, checksum=301, sequential time:  0.000002, parallel time:  0.000401, speedup:  0.0
p= 7, checksum=301, sequential time:  0.000002, parallel time:  0.000467, speedup:  0.0
p= 8, checksum=301, sequential time:  0.000002, parallel time:  0.000517, speedup:  0.0
p= 9, checksum=301, sequential time:  0.000002, parallel time:  0.000589, speedup:  0.0
p=10, checksum=301, sequential time:  0.000002, parallel time:  0.000590, speedup:  0.0
p=11, checksum=301, sequential time:  0.000002, parallel time:  0.000603, speedup:  0.0
p=12, checksum=301, sequential time:  0.000002, parallel time:  0.000634, speedup:  0.0
p=13, checksum=301, sequential time:  0.000002, parallel time:  0.000576, speedup:  0.0
p=14, checksum=301, sequential time:  0.000002, parallel time:  0.000560, speedup:  0.0
p=15, checksum=301, sequential time:  0.000002, parallel time:  0.000548, speedup:  0.0
p=16, checksum=301, sequential time:  0.000002, parallel time:  0.000548, speedup:  0.0
./vector.exe 10000000000 96
p= 1, checksum=-11666, sequential time: 92.679787, parallel time: 93.851120, speedup:  1.0
p= 2, checksum=-11666, sequential time: 92.679787, parallel time: 53.647523, speedup:  1.7
p= 3, checksum=-11666, sequential time: 92.679787, parallel time: 31.746497, speedup:  2.9
p= 4, checksum=-11666, sequential time: 92.679787, parallel time: 23.758922, speedup:  3.9
p= 5, checksum=-11666, sequential time: 92.679787, parallel time: 21.125770, speedup:  4.4
p= 6, checksum=-11666, sequential time: 92.679787, parallel time: 16.880423, speedup:  5.5
p= 7, checksum=-11666, sequential time: 92.679787, parallel time: 14.201011, speedup:  6.5
p= 8, checksum=-11666, sequential time: 92.679787, parallel time: 12.481112, speedup:  7.4
p= 9, checksum=-11666, sequential time: 92.679787, parallel time: 11.309812, speedup:  8.2
p=10, checksum=-11666, sequential time: 92.679787, parallel time: 10.329654, speedup:  9.0
p=11, checksum=-11666, sequential time: 92.679787, parallel time:  9.278064, speedup: 10.0
p=12, checksum=-11666, sequential time: 92.679787, parallel time:  8.580823, speedup: 10.8
p=13, checksum=-11666, sequential time: 92.679787, parallel time:  7.902234, speedup: 11.7
p=14, checksum=-11666, sequential time: 92.679787, parallel time:  7.262553, speedup: 12.8
p=15, checksum=-11666, sequential time: 92.679787, parallel time:  6.768883, speedup: 13.7
p=16, checksum=-11666, sequential time: 92.679787, parallel time:  6.386085, speedup: 14.5
p=17, checksum=-11666, sequential time: 92.679787, parallel time:  5.986862, speedup: 15.5
p=18, checksum=-11666, sequential time: 92.679787, parallel time:  5.708964, speedup: 16.2
p=19, checksum=-11666, sequential time: 92.679787, parallel time:  5.400486, speedup: 17.2
p=20, checksum=-11666, sequential time: 92.679787, parallel time:  5.161705, speedup: 18.0
p=21, checksum=-11666, sequential time: 92.679787, parallel time:  4.903866, speedup: 18.9
p=22, checksum=-11666, sequential time: 92.679787, parallel time:  4.642561, speedup: 20.0
p=23, checksum=-11666, sequential time: 92.679787, parallel time:  4.476955, speedup: 20.7
p=24, checksum=-11666, sequential time: 92.679787, parallel time:  4.319088, speedup: 21.5
p=25, checksum=-11666, sequential time: 92.679787, parallel time:  4.177709, speedup: 22.2
p=26, checksum=-11666, sequential time: 92.679787, parallel time:  3.970974, speedup: 23.3
p=27, checksum=-11666, sequential time: 92.679787, parallel time:  3.866774, speedup: 24.0
p=28, checksum=-11666, sequential time: 92.679787, parallel time:  3.875448, speedup: 23.9
p=29, checksum=-11666, sequential time: 92.679787, parallel time:  3.559493, speedup: 26.0
p=30, checksum=-11666, sequential time: 92.679787, parallel time:  3.534800, speedup: 26.2
p=31, checksum=-11666, sequential time: 92.679787, parallel time:  3.365529, speedup: 27.5
p=32, checksum=-11666, sequential time: 92.679787, parallel time:  3.506632, speedup: 26.4
p=33, checksum=-11666, sequential time: 92.679787, parallel time:  3.280717, speedup: 28.2
p=34, checksum=-11666, sequential time: 92.679787, parallel time:  3.178096, speedup: 29.2
p=35, checksum=-11666, sequential time: 92.679787, parallel time:  3.010215, speedup: 30.8
p=36, checksum=-11666, sequential time: 92.679787, parallel time:  2.896112, speedup: 32.0
p=37, checksum=-11666, sequential time: 92.679787, parallel time:  2.919639, speedup: 31.7
p=38, checksum=-11666, sequential time: 92.679787, parallel time:  2.883742, speedup: 32.1
p=39, checksum=-11666, sequential time: 92.679787, parallel time:  2.789158, speedup: 33.2
p=40, checksum=-11666, sequential time: 92.679787, parallel time:  2.735304, speedup: 33.9
p=41, checksum=-11666, sequential time: 92.679787, parallel time:  3.095372, speedup: 29.9
p=42, checksum=-11666, sequential time: 92.679787, parallel time:  3.054057, speedup: 30.3
p=43, checksum=-11666, sequential time: 92.679787, parallel time:  2.862726, speedup: 32.4
p=44, checksum=-11666, sequential time: 92.679787, parallel time:  2.717585, speedup: 34.1
p=45, checksum=-11666, sequential time: 92.679787, parallel time:  2.670919, speedup: 34.7
p=46, checksum=-11666, sequential time: 92.679787, parallel time:  3.248313, speedup: 28.5
p=47, checksum=-11666, sequential time: 92.679787, parallel time:  2.748322, speedup: 33.7
p=48, checksum=-11666, sequential time: 92.679787, parallel time:  3.094270, speedup: 30.0
p=49, checksum=-11666, sequential time: 92.679787, parallel time:  2.788861, speedup: 33.2
p=50, checksum=-11666, sequential time: 92.679787, parallel time:  2.979988, speedup: 31.1
p=51, checksum=-11666, sequential time: 92.679787, parallel time:  2.762867, speedup: 33.5
p=52, checksum=-11666, sequential time: 92.679787, parallel time:  2.839007, speedup: 32.6
p=53, checksum=-11666, sequential time: 92.679787, parallel time:  3.082999, speedup: 30.1
p=54, checksum=-11666, sequential time: 92.679787, parallel time:  3.030656, speedup: 30.6
p=55, checksum=-11666, sequential time: 92.679787, parallel time:  3.049701, speedup: 30.4
p=56, checksum=-11666, sequential time: 92.679787, parallel time:  2.697112, speedup: 34.4
p=57, checksum=-11666, sequential time: 92.679787, parallel time:  3.060471, speedup: 30.3
p=58, checksum=-11666, sequential time: 92.679787, parallel time:  2.993282, speedup: 31.0
p=59, checksum=-11666, sequential time: 92.679787, parallel time:  2.855059, speedup: 32.5
p=60, checksum=-11666, sequential time: 92.679787, parallel time:  2.860538, speedup: 32.4
p=61, checksum=-11666, sequential time: 92.679787, parallel time:  3.127306, speedup: 29.6
p=62, checksum=-11666, sequential time: 92.679787, parallel time:  2.856730, speedup: 32.4
p=63, checksum=-11666, sequential time: 92.679787, parallel time:  3.085877, speedup: 30.0
p=64, checksum=-11666, sequential time: 92.679787, parallel time:  2.902304, speedup: 31.9
p=65, checksum=-11666, sequential time: 92.679787, parallel time:  2.822563, speedup: 32.8
p=66, checksum=-11666, sequential time: 92.679787, parallel time:  3.068441, speedup: 30.2
p=67, checksum=-11666, sequential time: 92.679787, parallel time:  3.152200, speedup: 29.4
p=68, checksum=-11666, sequential time: 92.679787, parallel time:  2.996766, speedup: 30.9
p=69, checksum=-11666, sequential time: 92.679787, parallel time:  3.303534, speedup: 28.1
p=70, checksum=-11666, sequential time: 92.679787, parallel time:  3.008788, speedup: 30.8
p=71, checksum=-11666, sequential time: 92.679787, parallel time:  2.898525, speedup: 32.0
p=72, checksum=-11666, sequential time: 92.679787, parallel time:  2.916746, speedup: 31.8
p=73, checksum=-11666, sequential time: 92.679787, parallel time:  2.928582, speedup: 31.6
p=74, checksum=-11666, sequential time: 92.679787, parallel time:  3.187046, speedup: 29.1
p=75, checksum=-11666, sequential time: 92.679787, parallel time:  2.951147, speedup: 31.4
p=76, checksum=-11666, sequential time: 92.679787, parallel time:  3.039595, speedup: 30.5
p=77, checksum=-11666, sequential time: 92.679787, parallel time:  2.925714, speedup: 31.7
p=78, checksum=-11666, sequential time: 92.679787, parallel time:  3.044578, speedup: 30.4
p=79, checksum=-11666, sequential time: 92.679787, parallel time:  2.862665, speedup: 32.4
p=80, checksum=-11666, sequential time: 92.679787, parallel time:  2.935903, speedup: 31.6
p=81, checksum=-11666, sequential time: 92.679787, parallel time:  3.166502, speedup: 29.3
p=82, checksum=-11666, sequential time: 92.679787, parallel time:  2.978553, speedup: 31.1
p=83, checksum=-11666, sequential time: 92.679787, parallel time:  3.093014, speedup: 30.0
p=84, checksum=-11666, sequential time: 92.679787, parallel time:  3.091742, speedup: 30.0
p=85, checksum=-11666, sequential time: 92.679787, parallel time:  3.143336, speedup: 29.5
p=86, checksum=-11666, sequential time: 92.679787, parallel time:  3.268443, speedup: 28.4
p=87, checksum=-11666, sequential time: 92.679787, parallel time:  3.078155, speedup: 30.1
p=88, checksum=-11666, sequential time: 92.679787, parallel time:  3.001926, speedup: 30.9
p=89, checksum=-11666, sequential time: 92.679787, parallel time:  2.779470, speedup: 33.3
p=90, checksum=-11666, sequential time: 92.679787, parallel time:  2.995021, speedup: 30.9
p=91, checksum=-11666, sequential time: 92.679787, parallel time:  2.860247, speedup: 32.4
p=92, checksum=-11666, sequential time: 92.679787, parallel time:  3.095891, speedup: 29.9
p=93, checksum=-11666, sequential time: 92.679787, parallel time:  2.978983, speedup: 31.1
p=94, checksum=-11666, sequential time: 92.679787, parallel time:  3.116495, speedup: 29.7
p=95, checksum=-11666, sequential time: 92.679787, parallel time:  3.102023, speedup: 29.9
p=96, checksum=-11666, sequential time: 92.679787, parallel time:  3.173704, speedup: 29.2
