Programm wird ausgeführt auf  wr43
icc -qopenmp -fp-model strict -O2 -std=c99 -Wall -I/usr/local/include -c nbodySequential.c
icc -qopenmp -fp-model strict -o nbodySequential.exe nbodySequential.o -L/usr/local/lib -lFHBRS -lX11 -lpthread -lm
./nbodySequential.exe -t_end 36000000 -timesteps 10000 -bodies 1000 -nodisplay
time nbody : 26.784156
checksum OK: 6956984643621


for threads in 1 2 4 8 16 32 48 64 96 ; do \
	./nbody.exe -t_end 36000000 -timesteps 10000 -bodies 1000 -nodisplay -threads $threads ; \
done
1 threads -> time nbody : 70.649993
2 threads -> time nbody : 58.131687
4 threads -> time nbody : 43.614498
8 threads -> time nbody : 36.252025
16 threads -> time nbody : 25.443538
32 threads -> time nbody : 19.876793
48 threads -> time nbody : 17.971737
64 threads -> time nbody : 19.709808
96 threads -> time nbody : 21.838495
