Programm wird ausgeführt auf  wr43
for threads in 1 2 4 8 16 32 48 64 96 ; do \
	./mandelbrot.exe -2 -2 2 2 50000 0 $threads ; \
done
using 1 threads -> calculation took 17.72 s
using 2 threads -> calculation took 12.83 s
using 4 threads -> calculation took 11.78 s
using 8 threads -> calculation took 8.24 s
using 16 threads -> calculation took 4.85 s
using 32 threads -> calculation took 2.48 s
using 48 threads -> calculation took 1.89 s
using 64 threads -> calculation took 1.53 s
using 96 threads -> calculation took 1.14 s
