<?xml version="1.0" encoding="UTF-8" standalone="no"?>
<!-- Created with Inkscape (http://www.inkscape.org/) -->

<svg
   xmlns:dc="http://purl.org/dc/elements/1.1/"
   xmlns:cc="http://creativecommons.org/ns#"
   xmlns:rdf="http://www.w3.org/1999/02/22-rdf-syntax-ns#"
   xmlns:svg="http://www.w3.org/2000/svg"
   xmlns="http://www.w3.org/2000/svg"
   xmlns:sodipodi="http://sodipodi.sourceforge.net/DTD/sodipodi-0.dtd"
   xmlns:inkscape="http://www.inkscape.org/namespaces/inkscape"
   width="80.116852mm"
   height="105.92571mm"
   viewBox="0 0 80.116852 105.92571"
   version="1.1"
   id="svg8"
   inkscape:version="0.92.3 (2405546, 2018-03-11)"
   sodipodi:docname="node-classes.svg">
  <defs
     id="defs2" />
  <sodipodi:namedview
     id="base"
     pagecolor="#ffffff"
     bordercolor="#666666"
     borderopacity="1.0"
     inkscape:pageopacity="0.0"
     inkscape:pageshadow="2"
     inkscape:zoom="1.979899"
     inkscape:cx="177.29208"
     inkscape:cy="243.70945"
     inkscape:document-units="mm"
     inkscape:current-layer="layer2"
     showgrid="false"
     inkscape:snap-object-midpoints="false"
     showguides="false"
     inkscape:guide-bbox="true"
     fit-margin-top="0"
     fit-margin-left="0"
     fit-margin-right="0"
     fit-margin-bottom="0"
     inkscape:window-width="1920"
     inkscape:window-height="1173"
     inkscape:window-x="0"
     inkscape:window-y="27"
     inkscape:window-maximized="1">
    <inkscape:grid
       type="xygrid"
       id="grid815"
       originx="19.039559"
       originy="-48.724799" />
    <sodipodi:guide
       position="29.622892,66.368947"
       orientation="1,0"
       id="guide1794"
       inkscape:locked="false" />
    <sodipodi:guide
       position="40.206225,57.108537"
       orientation="1,0"
       id="guide1796"
       inkscape:locked="false" />
    <sodipodi:guide
       position="50.789557,66.368947"
       orientation="1,0"
       id="guide1798"
       inkscape:locked="false" />
    <sodipodi:guide
       position="26.977059,41.233534"
       orientation="1,0"
       id="guide1800"
       inkscape:locked="false" />
    <sodipodi:guide
       position="33.472113,81.034556"
       orientation="0,1"
       id="guide1960"
       inkscape:locked="false" />
    <sodipodi:guide
       position="23.008309,82.243946"
       orientation="1,0"
       id="guide2065"
       inkscape:locked="false" />
  </sodipodi:namedview>
  <metadata
     id="metadata5">
    <rdf:RDF>
      <cc:Work
         rdf:about="">
        <dc:format>image/svg+xml</dc:format>
        <dc:type
           rdf:resource="http://purl.org/dc/dcmitype/StillImage" />
        <dc:title></dc:title>
      </cc:Work>
    </rdf:RDF>
  </metadata>
  <g
     inkscape:label="bottom"
     inkscape:groupmode="layer"
     id="layer1"
     style="opacity:0.53908356"
     transform="translate(19.03956,-142.34949)" />
  <g
     inkscape:groupmode="layer"
     id="layer3"
     inkscape:label="edges"
     transform="translate(19.03956,-142.34949)" />
  <g
     inkscape:groupmode="layer"
     id="layer2"
     inkscape:label="top"
     transform="translate(19.03956,-142.34949)">
    <path
       style="fill:none;stroke:#aa0000;stroke-width:0.26499999;stroke-linecap:round;stroke-linejoin:round;stroke-miterlimit:4;stroke-dasharray:none;stroke-opacity:1"
       d="m 19.84375,226.88541 -11.9062497,15.875 18.5208327,5.29167 z"
       id="path1501"
       inkscape:connector-curvature="0" />
    <ellipse
       style="fill:#ffffff;fill-opacity:1;stroke:none;stroke-width:0.26499999;stroke-linecap:round;stroke-linejoin:round;stroke-miterlimit:4;stroke-dasharray:none;stroke-opacity:1"
       id="path1561-4"
       cx="238.64845"
       cy="27.603981"
       rx="0.34268764"
       ry="1.2994398"
       transform="rotate(77.751857)" />
    <path
       style="fill:none;stroke:#aa0000;stroke-width:0.26499999;stroke-linecap:round;stroke-linejoin:round;stroke-miterlimit:4;stroke-dasharray:none;stroke-opacity:1"
       d="m 19.84375,226.88541 10.583333,10.58334 -22.4895827,5.29166"
       id="path1503"
       inkscape:connector-curvature="0" />
    <path
       style="fill:none;stroke:#aa0000;stroke-width:0.26499999;stroke-linecap:round;stroke-linejoin:round;stroke-miterlimit:4;stroke-dasharray:none;stroke-opacity:1"
       d="m 26.458333,248.05208 3.96875,-10.58333"
       id="path1505"
       inkscape:connector-curvature="0" />
    <path
       style="fill:none;stroke:#000000;stroke-width:0.26499999;stroke-linecap:round;stroke-linejoin:round;stroke-miterlimit:4;stroke-dasharray:none;stroke-opacity:1"
       d="m 10.583333,192.48958 -2.6458337,3.96875 6.6145837,-1.32292 z"
       id="path1507"
       inkscape:connector-curvature="0" />
    <path
       style="fill:none;stroke:#a30000;stroke-width:0.26499999;stroke-linecap:round;stroke-linejoin:round;stroke-miterlimit:4;stroke-dasharray:none;stroke-opacity:1"
       d="M 10.583333,192.48958 V 171.32291 L 7.9374993,196.45833"
       id="path1511"
       inkscape:connector-curvature="0" />
    <circle
       style="fill:#000000;fill-opacity:1;stroke:none;stroke-width:0.44694582;stroke-linecap:round;stroke-linejoin:round;stroke-miterlimit:4;stroke-dasharray:none;stroke-opacity:1"
       id="path1606-95"
       cx="10.583334"
       cy="192.48958"
       r="0.22312154" />
    <circle
       style="fill:#000000;fill-opacity:1;stroke:none;stroke-width:0.44694582;stroke-linecap:round;stroke-linejoin:round;stroke-miterlimit:4;stroke-dasharray:none;stroke-opacity:1"
       id="path1606-5"
       cx="7.9374981"
       cy="196.45833"
       r="0.22312154" />
    <path
       style="fill:none;stroke:#aa0000;stroke-width:0.26499999;stroke-linecap:round;stroke-linejoin:round;stroke-miterlimit:4;stroke-dasharray:none;stroke-opacity:1"
       d="m 10.583333,171.32291 3.96875,23.8125"
       id="path1513"
       inkscape:connector-curvature="0" />
    <circle
       style="fill:#000000;fill-opacity:1;stroke:none;stroke-width:0.44694582;stroke-linecap:round;stroke-linejoin:round;stroke-miterlimit:4;stroke-dasharray:none;stroke-opacity:1"
       id="path1606-6"
       cx="14.552084"
       cy="195.13541"
       r="0.22312154" />
    <path
       style="fill:none;stroke:#aa0000;stroke-width:0.26499999;stroke-linecap:round;stroke-linejoin:round;stroke-miterlimit:4;stroke-dasharray:none;stroke-opacity:1"
       d="m 23.8125,196.45833 -5.291668,-23.8125 m 5.291668,-1.32292 v 25.13542 m -3.96875,-2.64583 -1.322917,-21.16667"
       id="path1517"
       inkscape:connector-curvature="0"
       sodipodi:nodetypes="cccccc" />
    <ellipse
       style="fill:#ffffff;fill-opacity:1;stroke:none;stroke-width:0.26499999;stroke-linecap:round;stroke-linejoin:round;stroke-miterlimit:4;stroke-dasharray:none;stroke-opacity:1"
       id="path1561"
       cx="52.546577"
       cy="178.927"
       rx="0.34268764"
       ry="1.2994399"
       transform="rotate(9.7965616)" />
    <path
       style="fill:none;stroke:#aa0000;stroke-width:0.26499999;stroke-linecap:round;stroke-linejoin:round;stroke-miterlimit:4;stroke-dasharray:none;stroke-opacity:1"
       d="M 23.8125,171.32291 19.84375,193.8125"
       id="path1519"
       inkscape:connector-curvature="0" />
    <g
       id="g1860"
       transform="translate(0,-14.287501)"
       style="stroke-linecap:round;stroke-linejoin:round">
      <path
         inkscape:connector-curvature="0"
         id="path1527"
         d="M 10.583333,158.09375 7.9374996,162.0625 H 13.229167 Z"
         style="fill:none;stroke:#000000;stroke-width:0.26499999;stroke-linecap:round;stroke-linejoin:round;stroke-miterlimit:4;stroke-dasharray:none;stroke-opacity:1" />
      <path
         inkscape:connector-curvature="0"
         id="path1529"
         d="m 10.583333,158.09375 2.645834,-1.32292 v 5.29167"
         style="fill:none;stroke:#000000;stroke-width:0.26499999;stroke-linecap:round;stroke-linejoin:round;stroke-miterlimit:4;stroke-dasharray:none;stroke-opacity:1" />
      <ellipse
         transform="rotate(45.196288)"
         ry="1.2994398"
         rx="0.34268764"
         cy="103.97769"
         cx="120.54467"
         id="path1561-9"
         style="fill:#ffffff;fill-opacity:1;stroke:none;stroke-width:0.26499999;stroke-linecap:round;stroke-linejoin:round;stroke-miterlimit:4;stroke-dasharray:none;stroke-opacity:1" />
      <path
         inkscape:connector-curvature="0"
         id="path1531"
         d="M 13.229167,156.77083 7.9374996,162.0625"
         style="fill:none;stroke:#000000;stroke-width:0.26499999;stroke-linecap:round;stroke-linejoin:round;stroke-miterlimit:4;stroke-dasharray:none;stroke-opacity:1" />
    </g>
    <path
       style="fill:none;stroke:#000000;stroke-width:0.26499999;stroke-linecap:round;stroke-linejoin:round;stroke-miterlimit:4;stroke-dasharray:none;stroke-opacity:1"
       d="m 18.520833,159.41666 1.322917,-5.29167 h 2.645833"
       id="path1537"
       inkscape:connector-curvature="0"
       sodipodi:nodetypes="ccc" />
    <path
       style="fill:none;stroke:#000000;stroke-width:0.26458332px;stroke-linecap:round;stroke-linejoin:round;stroke-opacity:1"
       d="m 18.520833,159.41666 3.96875,-5.29167"
       id="path1604"
       inkscape:connector-curvature="0" />
    <ellipse
       style="fill:#ffffff;fill-opacity:1;stroke:none;stroke-width:0.26499999;stroke-linecap:round;stroke-linejoin:round;stroke-miterlimit:4;stroke-dasharray:none;stroke-opacity:1"
       id="path1561-6"
       cx="2.6055481"
       cy="158.45276"
       rx="0.34268764"
       ry="1.2994398"
       transform="rotate(-6.3858636)" />
    <path
       style="fill:none;stroke:#000000;stroke-width:0.26499999;stroke-linecap:round;stroke-linejoin:round;stroke-miterlimit:4;stroke-dasharray:none;stroke-opacity:1"
       d="m 18.520833,159.41666 2.645833,5.29167"
       id="path1539"
       inkscape:connector-curvature="0" />
    <path
       style="fill:none;stroke:#aa0000;stroke-width:0.26499999;stroke-linecap:round;stroke-linejoin:round;stroke-miterlimit:4;stroke-dasharray:none;stroke-opacity:1"
       d="m 19.84375,154.12499 1.322916,10.58334 1.322917,-10.58334"
       id="path1535"
       inkscape:connector-curvature="0" />
    <path
       style="fill:none;stroke:#000000;stroke-width:0.26499999;stroke-linecap:round;stroke-linejoin:round;stroke-miterlimit:4;stroke-dasharray:none;stroke-opacity:1"
       d="m 13.229166,154.12499 -2.645833,5.29167 H 7.9375 Z"
       id="path1551"
       inkscape:connector-curvature="0" />
    <path
       style="fill:none;stroke:#000000;stroke-width:0.26499999;stroke-linecap:round;stroke-linejoin:round;stroke-miterlimit:4;stroke-dasharray:none;stroke-opacity:1"
       d="m 7.9375,159.41666 3.96875,5.29167 -1.322917,-5.29167"
       id="path1553"
       inkscape:connector-curvature="0" />
    <path
       style="fill:none;stroke:#aa0000;stroke-width:0.26499999;stroke-linecap:round;stroke-linejoin:round;stroke-miterlimit:4;stroke-dasharray:none;stroke-opacity:1"
       d="M 13.229166,154.12499 11.90625,164.70833"
       id="path1549"
       inkscape:connector-curvature="0" />
    <path
       style="fill:none;stroke:#000000;stroke-width:0.26499999;stroke-linecap:round;stroke-linejoin:round;stroke-miterlimit:4;stroke-dasharray:none;stroke-opacity:1"
       d="M 18.520832,172.64583 23.8125,171.32291"
       id="path1555"
       inkscape:connector-curvature="0" />
    <path
       style="fill:none;stroke:#000000;stroke-width:0.26499999;stroke-linecap:round;stroke-linejoin:round;stroke-miterlimit:4;stroke-dasharray:none;stroke-opacity:1"
       d="m 19.84375,193.8125 3.96875,2.64583"
       id="path1557"
       inkscape:connector-curvature="0" />
    <circle
       style="fill:#000000;fill-opacity:1;stroke:none;stroke-width:0.44694582;stroke-linecap:round;stroke-linejoin:round;stroke-miterlimit:4;stroke-dasharray:none;stroke-opacity:1"
       id="path1606"
       cx="13.229166"
       cy="154.12498"
       r="0.22312154" />
    <circle
       style="fill:#000000;fill-opacity:1;stroke:none;stroke-width:0.44694582;stroke-linecap:round;stroke-linejoin:round;stroke-miterlimit:4;stroke-dasharray:none;stroke-opacity:1"
       id="path1606-2"
       cx="11.906251"
       cy="164.70833"
       r="0.22312154" />
    <circle
       style="fill:#000000;fill-opacity:1;stroke:none;stroke-width:0.44694582;stroke-linecap:round;stroke-linejoin:round;stroke-miterlimit:4;stroke-dasharray:none;stroke-opacity:1"
       id="path1606-9"
       cx="7.937501"
       cy="159.41666"
       r="0.22312154" />
    <circle
       style="fill:#000000;fill-opacity:1;stroke:none;stroke-width:0.44694582;stroke-linecap:round;stroke-linejoin:round;stroke-miterlimit:4;stroke-dasharray:none;stroke-opacity:1"
       id="path1606-0"
       cx="10.583335"
       cy="159.41666"
       r="0.22312154" />
    <circle
       style="fill:#000000;fill-opacity:1;stroke:none;stroke-width:0.44694582;stroke-linecap:round;stroke-linejoin:round;stroke-miterlimit:4;stroke-dasharray:none;stroke-opacity:1"
       id="path1606-3"
       cx="22.489582"
       cy="154.12498"
       r="0.22312154" />
    <circle
       style="fill:#000000;fill-opacity:1;stroke:none;stroke-width:0.44694582;stroke-linecap:round;stroke-linejoin:round;stroke-miterlimit:4;stroke-dasharray:none;stroke-opacity:1"
       id="path1606-03"
       cx="19.84375"
       cy="154.12498"
       r="0.22312154" />
    <circle
       style="fill:#000000;fill-opacity:1;stroke:none;stroke-width:0.44694582;stroke-linecap:round;stroke-linejoin:round;stroke-miterlimit:4;stroke-dasharray:none;stroke-opacity:1"
       id="path1606-37"
       cx="18.520834"
       cy="159.41666"
       r="0.22312154" />
    <circle
       style="fill:#000000;fill-opacity:1;stroke:none;stroke-width:0.44694582;stroke-linecap:round;stroke-linejoin:round;stroke-miterlimit:4;stroke-dasharray:none;stroke-opacity:1"
       id="path1606-94"
       cx="21.166668"
       cy="164.70833"
       r="0.22312154" />
    <circle
       style="fill:#000000;fill-opacity:1;stroke:none;stroke-width:0.44694582;stroke-linecap:round;stroke-linejoin:round;stroke-miterlimit:4;stroke-dasharray:none;stroke-opacity:1"
       id="path1606-99"
       cx="19.843742"
       cy="193.8125"
       r="0.22312154" />
    <circle
       style="fill:#000000;fill-opacity:1;stroke:none;stroke-width:0.44694582;stroke-linecap:round;stroke-linejoin:round;stroke-miterlimit:4;stroke-dasharray:none;stroke-opacity:1"
       id="path1606-1"
       cx="23.812498"
       cy="196.45833"
       r="0.22312154" />
    <circle
       style="fill:#000000;fill-opacity:1;stroke:none;stroke-width:0.44694582;stroke-linecap:round;stroke-linejoin:round;stroke-miterlimit:4;stroke-dasharray:none;stroke-opacity:1"
       id="path1606-942"
       cx="18.520823"
       cy="172.64583"
       r="0.22312154" />
    <circle
       style="fill:#000000;fill-opacity:1;stroke:none;stroke-width:0.44694582;stroke-linecap:round;stroke-linejoin:round;stroke-miterlimit:4;stroke-dasharray:none;stroke-opacity:1"
       id="path1606-06"
       cx="23.812498"
       cy="171.32291"
       r="0.22312154" />
    <circle
       style="fill:#000000;fill-opacity:1;stroke:none;stroke-width:0.44694582;stroke-linecap:round;stroke-linejoin:round;stroke-miterlimit:4;stroke-dasharray:none;stroke-opacity:1"
       id="path1606-11"
       cx="10.583334"
       cy="171.32291"
       r="0.22312154" />
    <g
       id="g2063"
       style="">
      <circle
         r="0.22312154"
         cy="213.65625"
         cx="34.395836"
         id="path1606-7"
         style="fill:#000000;fill-opacity:1;stroke:none;stroke-width:0.44694582;stroke-linecap:round;stroke-linejoin:round;stroke-miterlimit:4;stroke-dasharray:none;stroke-opacity:1" />
      <path
         inkscape:connector-curvature="0"
         id="path1495"
         d="m 14.552084,201.75 -6.6145837,19.84375 26.4583337,-7.9375 z"
         style="fill:none;stroke:#aa0000;stroke-width:0.26499999;stroke-linecap:round;stroke-linejoin:round;stroke-miterlimit:4;stroke-dasharray:none;stroke-opacity:1" />
      <ellipse
         transform="rotate(64.28379)"
         ry="1.2994398"
         rx="0.34268764"
         cy="64.453896"
         cx="203.23825"
         id="path1561-8"
         style="fill:#ffffff;fill-opacity:1;stroke:none;stroke-width:0.26499999;stroke-linecap:round;stroke-linejoin:round;stroke-miterlimit:4;stroke-dasharray:none;stroke-opacity:1" />
      <path
         inkscape:connector-curvature="0"
         id="path1497"
         d="M 7.9375003,221.59375 33.072917,209.6875 14.552084,201.75"
         style="fill:none;stroke:#aa0000;stroke-width:0.26499999;stroke-linecap:round;stroke-linejoin:round;stroke-miterlimit:4;stroke-dasharray:none;stroke-opacity:1" />
      <path
         inkscape:connector-curvature="0"
         id="path1499"
         d="m 33.072917,209.6875 1.322917,3.96875"
         style="fill:none;stroke:#000000;stroke-width:0.26499999;stroke-linecap:round;stroke-linejoin:round;stroke-miterlimit:4;stroke-dasharray:none;stroke-opacity:1" />
      <circle
         r="0.22312154"
         cy="221.59375"
         cx="7.9375"
         id="path1606-4"
         style="fill:#000000;fill-opacity:1;stroke:none;stroke-width:0.44694582;stroke-linecap:round;stroke-linejoin:round;stroke-miterlimit:4;stroke-dasharray:none;stroke-opacity:1" />
      <circle
         r="0.22312154"
         cy="201.75"
         cx="14.552084"
         id="path1606-372"
         style="fill:#000000;fill-opacity:1;stroke:none;stroke-width:0.44694582;stroke-linecap:round;stroke-linejoin:round;stroke-miterlimit:4;stroke-dasharray:none;stroke-opacity:1" />
      <circle
         r="0.22312154"
         cy="209.6875"
         cx="33.072918"
         id="path1606-33"
         style="fill:#000000;fill-opacity:1;stroke:none;stroke-width:0.44694582;stroke-linecap:round;stroke-linejoin:round;stroke-miterlimit:4;stroke-dasharray:none;stroke-opacity:1" />
    </g>
    <circle
       style="fill:#000000;fill-opacity:1;stroke:none;stroke-width:0.44694582;stroke-linecap:round;stroke-linejoin:round;stroke-miterlimit:4;stroke-dasharray:none;stroke-opacity:1"
       id="path1606-92"
       cx="26.458334"
       cy="248.05208"
       r="0.22312154" />
    <circle
       style="fill:#000000;fill-opacity:1;stroke:none;stroke-width:0.44694582;stroke-linecap:round;stroke-linejoin:round;stroke-miterlimit:4;stroke-dasharray:none;stroke-opacity:1"
       id="path1606-44"
       cx="30.427084"
       cy="237.46875"
       r="0.22312154" />
    <circle
       style="fill:#000000;fill-opacity:1;stroke:none;stroke-width:0.44694582;stroke-linecap:round;stroke-linejoin:round;stroke-miterlimit:4;stroke-dasharray:none;stroke-opacity:1"
       id="path1606-49"
       cx="19.843748"
       cy="226.88541"
       r="0.22312154" />
    <circle
       style="fill:#000000;fill-opacity:1;stroke:none;stroke-width:0.44694582;stroke-linecap:round;stroke-linejoin:round;stroke-miterlimit:4;stroke-dasharray:none;stroke-opacity:1"
       id="path1606-93"
       cx="7.9375014"
       cy="242.76041"
       r="0.22312154" />
    <path
       style="fill:none;stroke:#000000;stroke-width:0.26458332px;stroke-linecap:round;stroke-linejoin:round;stroke-opacity:1"
       d="m 27.781251,195.13541 5.291666,-1.32291 3.96875,2.64583"
       id="path1755"
       inkscape:connector-curvature="0" />
    <path
       style="fill:none;stroke:#aa0000;stroke-width:0.26458332px;stroke-linecap:round;stroke-linejoin:round;stroke-opacity:1"
       d="m 27.781252,195.13541 9.260416,1.32292 -5.291666,-25.13542 z"
       id="path1757"
       inkscape:connector-curvature="0" />
    <path
       style="fill:none;stroke:#aa0000;stroke-width:0.26458332px;stroke-linecap:round;stroke-linejoin:round;stroke-opacity:1"
       d="m 31.750001,171.32291 1.322916,22.48959"
       id="path1759"
       inkscape:connector-curvature="0" />
    <circle
       style="fill:#000000;fill-opacity:1;stroke:none;stroke-width:0.44694582;stroke-linecap:round;stroke-linejoin:round;stroke-miterlimit:4;stroke-dasharray:none;stroke-opacity:1"
       id="path1606-06-8"
       cx="33.072918"
       cy="193.8125"
       r="0.22312154" />
    <circle
       style="fill:#000000;fill-opacity:1;stroke:none;stroke-width:0.44694582;stroke-linecap:round;stroke-linejoin:round;stroke-miterlimit:4;stroke-dasharray:none;stroke-opacity:1"
       id="path1606-06-3"
       cx="27.78125"
       cy="195.13541"
       r="0.22312154" />
    <circle
       style="fill:#000000;fill-opacity:1;stroke:none;stroke-width:0.44694582;stroke-linecap:round;stroke-linejoin:round;stroke-miterlimit:4;stroke-dasharray:none;stroke-opacity:1"
       id="path1606-06-2"
       cx="37.041668"
       cy="196.45833"
       r="0.22312154" />
    <circle
       style="fill:#000000;fill-opacity:1;stroke:none;stroke-width:0.44694582;stroke-linecap:round;stroke-linejoin:round;stroke-miterlimit:4;stroke-dasharray:none;stroke-opacity:1"
       id="path1606-06-9"
       cx="31.750002"
       cy="171.32291"
       r="0.22312154" />
    <path
       style="fill:none;stroke:#aa0000;stroke-width:0.26458332px;stroke-linecap:round;stroke-linejoin:round;stroke-opacity:1"
       d="m 26.458334,159.41667 10.583333,-2.64584"
       id="path1802"
       inkscape:connector-curvature="0" />
    <ellipse
       style="fill:#ffffff;fill-opacity:1;stroke:none;stroke-width:0.26499999;stroke-linecap:round;stroke-linejoin:round;stroke-miterlimit:4;stroke-dasharray:none;stroke-opacity:1"
       id="path1561-6-5"
       cx="5.2837467"
       cy="161.13977"
       rx="0.34268764"
       ry="1.2994398"
       transform="rotate(-9.2188988)" />
    <path
       style="fill:none;stroke:#000000;stroke-width:0.26458332px;stroke-linecap:round;stroke-linejoin:round;stroke-opacity:1"
       d="m 31.749999,163.38542 5.291668,-6.61459 -6.614583,-2.64583 -3.96875,5.29167 z"
       id="path1806"
       inkscape:connector-curvature="0"
       sodipodi:nodetypes="ccccc" />
    <path
       style="fill:none;stroke:#aa0000;stroke-width:0.26458332px;stroke-linecap:round;stroke-linejoin:round;stroke-opacity:1"
       d="m 30.427084,154.125 1.322915,9.26042"
       id="path1804"
       inkscape:connector-curvature="0"
       sodipodi:nodetypes="cc" />
    <circle
       style="fill:#000000;fill-opacity:1;stroke:none;stroke-width:0.44694582;stroke-linecap:round;stroke-linejoin:round;stroke-miterlimit:4;stroke-dasharray:none;stroke-opacity:1"
       id="path1606-3-4"
       cx="30.427084"
       cy="154.12509"
       r="0.22312154" />
    <circle
       style="fill:#000000;fill-opacity:1;stroke:none;stroke-width:0.44694582;stroke-linecap:round;stroke-linejoin:round;stroke-miterlimit:4;stroke-dasharray:none;stroke-opacity:1"
       id="path1606-3-3"
       cx="31.749998"
       cy="163.38542"
       r="0.22312154" />
    <circle
       style="fill:#000000;fill-opacity:1;stroke:none;stroke-width:0.44694582;stroke-linecap:round;stroke-linejoin:round;stroke-miterlimit:4;stroke-dasharray:none;stroke-opacity:1"
       id="path1606-3-9"
       cx="37.041664"
       cy="156.77092"
       r="0.22312154" />
    <circle
       style="fill:#000000;fill-opacity:1;stroke:none;stroke-width:0.44694582;stroke-linecap:round;stroke-linejoin:round;stroke-miterlimit:4;stroke-dasharray:none;stroke-opacity:1"
       id="path1606-3-49"
       cx="26.458334"
       cy="159.41676"
       r="0.22312154" />
    <g
       id="g1992"
       transform="translate(-0.18898733,0.18898667)"
       style="">
      <path
         sodipodi:nodetypes="cccc"
         inkscape:connector-curvature="0"
         id="path1862"
         d="m 39.876487,155.25893 v 6.61459 l 5.291667,-2.64584 5.291667,1.32292"
         style="fill:none;stroke:#000000;stroke-width:0.26458332px;stroke-linecap:round;stroke-linejoin:round;stroke-opacity:1" />
      <path
         sodipodi:nodetypes="cccc"
         inkscape:connector-curvature="0"
         id="path1864"
         d="m 39.876487,161.87352 10.583334,-1.32292 -10.583334,-5.29167 5.291667,3.96875"
         style="fill:none;stroke:#aa0000;stroke-width:0.26458332px;stroke-linecap:round;stroke-linejoin:round;stroke-opacity:1" />
      <circle
         r="0.22312154"
         cy="161.87354"
         cx="39.876488"
         id="path1606-3-4-5"
         style="fill:#000000;fill-opacity:1;stroke:none;stroke-width:0.44694582;stroke-linecap:round;stroke-linejoin:round;stroke-miterlimit:4;stroke-dasharray:none;stroke-opacity:1" />
      <circle
         r="0.22312154"
         cy="160.55061"
         cx="50.459824"
         id="path1606-3-4-57"
         style="fill:#000000;fill-opacity:1;stroke:none;stroke-width:0.44694582;stroke-linecap:round;stroke-linejoin:round;stroke-miterlimit:4;stroke-dasharray:none;stroke-opacity:1" />
      <circle
         r="0.22312154"
         cy="159.22769"
         cx="45.168152"
         id="path1606-3-4-3"
         style="fill:#000000;fill-opacity:1;stroke:none;stroke-width:0.44694582;stroke-linecap:round;stroke-linejoin:round;stroke-miterlimit:4;stroke-dasharray:none;stroke-opacity:1" />
      <circle
         r="0.22312154"
         cy="155.25894"
         cx="39.876488"
         id="path1606-3-4-9"
         style="fill:#000000;fill-opacity:1;stroke:none;stroke-width:0.44694582;stroke-linecap:round;stroke-linejoin:round;stroke-miterlimit:4;stroke-dasharray:none;stroke-opacity:1" />
    </g>
    <g
       id="g2001"
       transform="translate(-0.47247,-0.47247)"
       style="">
      <path
         inkscape:connector-curvature="0"
         id="path1901"
         d="m 52.06622,155.92039 3.96875,2.64583 5.291667,-2.64583"
         style="fill:none;stroke:#000000;stroke-width:0.26499999;stroke-linecap:round;stroke-linejoin:round;stroke-miterlimit:4;stroke-dasharray:none;stroke-opacity:1" />
      <path
         inkscape:connector-curvature="0"
         id="path1903"
         d="m 56.03497,158.56622 1.322917,5.29167"
         style="fill:none;stroke:#000000;stroke-width:0.26499999;stroke-linecap:round;stroke-linejoin:round;stroke-miterlimit:4;stroke-dasharray:none;stroke-opacity:1" />
      <path
         inkscape:connector-curvature="0"
         id="path1905"
         d="m 52.06622,155.92039 5.291667,7.9375 3.96875,-7.9375 H 52.06622"
         style="fill:none;stroke:#aa0000;stroke-width:0.26499999;stroke-linecap:round;stroke-linejoin:round;stroke-miterlimit:4;stroke-dasharray:none;stroke-opacity:1" />
      <circle
         r="0.22312154"
         cy="158.56622"
         cx="56.034973"
         id="path1606-3-4-9-0"
         style="fill:#000000;fill-opacity:1;stroke:none;stroke-width:0.44694582;stroke-linecap:round;stroke-linejoin:round;stroke-miterlimit:4;stroke-dasharray:none;stroke-opacity:1" />
      <circle
         r="0.22312154"
         cy="163.85789"
         cx="57.357891"
         id="path1606-3-4-9-7"
         style="fill:#000000;fill-opacity:1;stroke:none;stroke-width:0.44694582;stroke-linecap:round;stroke-linejoin:round;stroke-miterlimit:4;stroke-dasharray:none;stroke-opacity:1" />
      <circle
         r="0.22312154"
         cy="155.92039"
         cx="61.326637"
         id="path1606-3-4-9-2"
         style="fill:#000000;fill-opacity:1;stroke:none;stroke-width:0.44694582;stroke-linecap:round;stroke-linejoin:round;stroke-miterlimit:4;stroke-dasharray:none;stroke-opacity:1" />
      <circle
         r="0.22312154"
         cy="155.92039"
         cx="52.066223"
         id="path1606-3-4-9-72"
         style="fill:#000000;fill-opacity:1;stroke:none;stroke-width:0.44694582;stroke-linecap:round;stroke-linejoin:round;stroke-miterlimit:4;stroke-dasharray:none;stroke-opacity:1" />
    </g>
    <text
       xml:space="preserve"
       style="font-style:normal;font-variant:normal;font-weight:normal;font-stretch:normal;font-size:2.11666656px;line-height:1.25;font-family:sans-serif;-inkscape-font-specification:'sans-serif, Normal';font-variant-ligatures:normal;font-variant-caps:normal;font-variant-numeric:normal;font-feature-settings:normal;text-align:center;letter-spacing:0px;word-spacing:0px;writing-mode:lr-tb;text-anchor:middle;fill:#000000;fill-opacity:1;stroke:none;stroke-width:0.26458332"
       x="1.860142"
       y="146.15974"
       id="text1942"><tspan
         sodipodi:role="line"
         id="tspan1940"
         x="1.860142"
         y="146.15974"
         style="font-style:normal;font-variant:normal;font-weight:normal;font-stretch:normal;font-size:2.11666656px;font-family:sans-serif;-inkscape-font-specification:'sans-serif, Normal';font-variant-ligatures:normal;font-variant-caps:normal;font-variant-numeric:normal;font-feature-settings:normal;text-align:center;writing-mode:lr-tb;text-anchor:middle;stroke-width:0.26458332">void</tspan></text>
    <text
       xml:space="preserve"
       style="font-style:normal;font-variant:normal;font-weight:normal;font-stretch:normal;font-size:2.11666656px;line-height:1.25;font-family:sans-serif;-inkscape-font-specification:'sans-serif, Normal';font-variant-ligatures:normal;font-variant-caps:normal;font-variant-numeric:normal;font-feature-settings:normal;text-align:center;letter-spacing:0px;word-spacing:0px;writing-mode:lr-tb;text-anchor:middle;fill:#000000;fill-opacity:1;stroke:none;stroke-width:0.26458332"
       x="-4.5360003"
       y="159.40045"
       id="text1946"><tspan
         sodipodi:role="line"
         id="tspan1944"
         x="-4.5360007"
         y="159.40045"
         style="font-style:normal;font-variant:normal;font-weight:normal;font-stretch:normal;font-size:2.11666656px;font-family:sans-serif;-inkscape-font-specification:'sans-serif, Normal';font-variant-ligatures:normal;font-variant-caps:normal;font-variant-numeric:normal;font-feature-settings:normal;text-align:center;writing-mode:lr-tb;text-anchor:middle;stroke-width:0.26458332">kurto-parabolics</tspan></text>
    <text
       xml:space="preserve"
       style="font-style:normal;font-variant:normal;font-weight:normal;font-stretch:normal;font-size:2.11666656px;line-height:1.25;font-family:sans-serif;-inkscape-font-specification:'sans-serif, Normal';font-variant-ligatures:normal;font-variant-caps:normal;font-variant-numeric:normal;font-feature-settings:normal;text-align:center;letter-spacing:0px;word-spacing:0px;writing-mode:lr-tb;text-anchor:middle;fill:#000000;fill-opacity:1;stroke:none;stroke-width:0.26458332"
       x="1.4192387"
       y="187.16747"
       id="text1950"><tspan
         sodipodi:role="line"
         id="tspan1948"
         x="1.4192387"
         y="187.16747"
         style="font-style:normal;font-variant:normal;font-weight:normal;font-stretch:normal;font-size:2.11666656px;font-family:sans-serif;-inkscape-font-specification:'sans-serif, Normal';font-variant-ligatures:normal;font-variant-caps:normal;font-variant-numeric:normal;font-feature-settings:normal;text-align:center;writing-mode:lr-tb;text-anchor:middle;stroke-width:0.26458332">walls</tspan></text>
    <text
       xml:space="preserve"
       style="font-style:normal;font-variant:normal;font-weight:normal;font-stretch:normal;font-size:2.11666656px;line-height:1.25;font-family:sans-serif;-inkscape-font-specification:'sans-serif, Normal';font-variant-ligatures:normal;font-variant-caps:normal;font-variant-numeric:normal;font-feature-settings:normal;text-align:center;letter-spacing:0px;word-spacing:0px;writing-mode:lr-tb;text-anchor:middle;fill:#000000;fill-opacity:1;stroke:none;stroke-width:0.26458332"
       x="-0.44411865"
       y="212.22263"
       id="text1954"><tspan
         sodipodi:role="line"
         id="tspan1952"
         x="-0.44411877"
         y="212.22263"
         style="font-style:normal;font-variant:normal;font-weight:normal;font-stretch:normal;font-size:2.11666656px;font-family:sans-serif;-inkscape-font-specification:'sans-serif, Normal';font-variant-ligatures:normal;font-variant-caps:normal;font-variant-numeric:normal;font-feature-settings:normal;text-align:center;writing-mode:lr-tb;text-anchor:middle;stroke-width:0.26458332">filament</tspan></text>
    <text
       xml:space="preserve"
       style="font-style:normal;font-variant:normal;font-weight:normal;font-stretch:normal;font-size:2.11666656px;line-height:1.25;font-family:sans-serif;-inkscape-font-specification:'sans-serif, Normal';font-variant-ligatures:normal;font-variant-caps:normal;font-variant-numeric:normal;font-feature-settings:normal;text-align:center;letter-spacing:0px;word-spacing:0px;writing-mode:lr-tb;text-anchor:middle;fill:#000000;fill-opacity:1;stroke:none;stroke-width:0.26458332"
       x="0.33394742"
       y="238.80116"
       id="text1958"><tspan
         sodipodi:role="line"
         id="tspan1956"
         x="0.33394748"
         y="238.80116"
         style="font-style:normal;font-variant:normal;font-weight:normal;font-stretch:normal;font-size:2.11666656px;font-family:sans-serif;-inkscape-font-specification:'sans-serif, Normal';font-variant-ligatures:normal;font-variant-caps:normal;font-variant-numeric:normal;font-feature-settings:normal;text-align:center;writing-mode:lr-tb;text-anchor:middle;stroke-width:0.26458332">cluster</tspan></text>
    <text
       xml:space="preserve"
       style="font-style:normal;font-variant:normal;font-weight:normal;font-stretch:normal;font-size:2.11666667px;line-height:1.25;font-family:sans-serif;-inkscape-font-specification:'sans-serif, Normal';font-variant-ligatures:normal;font-variant-caps:normal;font-variant-numeric:normal;font-feature-settings:normal;text-align:center;letter-spacing:0px;word-spacing:0px;writing-mode:lr;text-anchor:middle;fill:#000000;fill-opacity:1;stroke:none;stroke-width:0.26458332;"
       x="10.583333"
       y="167.56935"
       id="text5772"><tspan
         sodipodi:role="line"
         id="tspan5770"
         x="10.583333"
         y="167.56935"
         style="stroke-width:0.26458332;-inkscape-font-specification:'sans-serif, Normal';font-family:sans-serif;font-weight:normal;font-style:normal;font-stretch:normal;font-variant:normal;font-size:2.11666667px;text-anchor:middle;text-align:center;writing-mode:lr;font-variant-ligatures:normal;font-variant-caps:normal;font-variant-numeric:normal;font-feature-settings:normal;">a</tspan></text>
    <text
       xml:space="preserve"
       style="font-style:normal;font-variant:normal;font-weight:normal;font-stretch:normal;font-size:2.11666667px;line-height:1.25;font-family:sans-serif;-inkscape-font-specification:'sans-serif, Normal';font-variant-ligatures:normal;font-variant-caps:normal;font-variant-numeric:normal;font-feature-settings:normal;text-align:center;letter-spacing:0px;word-spacing:0px;writing-mode:lr;text-anchor:middle;fill:#000000;fill-opacity:1;stroke:none;stroke-width:0.26458332;"
       x="21.166666"
       y="167.56935"
       id="text5776"><tspan
         sodipodi:role="line"
         id="tspan5774"
         x="21.166666"
         y="167.56935"
         style="stroke-width:0.26458332;-inkscape-font-specification:'sans-serif, Normal';font-family:sans-serif;font-weight:normal;font-style:normal;font-stretch:normal;font-variant:normal;font-size:2.11666667px;text-anchor:middle;text-align:center;writing-mode:lr;font-variant-ligatures:normal;font-variant-caps:normal;font-variant-numeric:normal;font-feature-settings:normal;">b</tspan></text>
    <text
       xml:space="preserve"
       style="font-style:normal;font-variant:normal;font-weight:normal;font-stretch:normal;font-size:2.11666667px;line-height:1.25;font-family:sans-serif;-inkscape-font-specification:'sans-serif, Normal';font-variant-ligatures:normal;font-variant-caps:normal;font-variant-numeric:normal;font-feature-settings:normal;text-align:center;letter-spacing:0px;word-spacing:0px;writing-mode:lr;text-anchor:middle;fill:#000000;fill-opacity:1;stroke:none;stroke-width:0.26458332;"
       x="31.75"
       y="167.56935"
       id="text5780"><tspan
         sodipodi:role="line"
         id="tspan5778"
         x="31.75"
         y="167.56935"
         style="stroke-width:0.26458332;-inkscape-font-specification:'sans-serif, Normal';font-family:sans-serif;font-weight:normal;font-style:normal;font-stretch:normal;font-variant:normal;font-size:2.11666667px;text-anchor:middle;text-align:center;writing-mode:lr;font-variant-ligatures:normal;font-variant-caps:normal;font-variant-numeric:normal;font-feature-settings:normal;">c</tspan></text>
    <text
       xml:space="preserve"
       style="font-style:normal;font-variant:normal;font-weight:normal;font-stretch:normal;font-size:2.11666667px;line-height:1.25;font-family:sans-serif;-inkscape-font-specification:'sans-serif, Normal';font-variant-ligatures:normal;font-variant-caps:normal;font-variant-numeric:normal;font-feature-settings:normal;text-align:center;letter-spacing:0px;word-spacing:0px;writing-mode:lr;text-anchor:middle;fill:#000000;fill-opacity:1;stroke:none;stroke-width:0.26458332;"
       x="43.434689"
       y="167.56935"
       id="text5784"><tspan
         sodipodi:role="line"
         id="tspan5782"
         x="43.434689"
         y="167.56935"
         style="stroke-width:0.26458332;-inkscape-font-specification:'sans-serif, Normal';font-family:sans-serif;font-weight:normal;font-style:normal;font-stretch:normal;font-variant:normal;font-size:2.11666667px;text-anchor:middle;text-align:center;writing-mode:lr;font-variant-ligatures:normal;font-variant-caps:normal;font-variant-numeric:normal;font-feature-settings:normal;">d</tspan></text>
    <text
       xml:space="preserve"
       style="font-style:normal;font-variant:normal;font-weight:normal;font-stretch:normal;font-size:2.11666667px;line-height:1.25;font-family:sans-serif;-inkscape-font-specification:'sans-serif, Normal';font-variant-ligatures:normal;font-variant-caps:normal;font-variant-numeric:normal;font-feature-settings:normal;text-align:center;letter-spacing:0px;word-spacing:0px;writing-mode:lr;text-anchor:middle;fill:#000000;fill-opacity:1;stroke:none;stroke-width:0.26458332;"
       x="56.330444"
       y="167.56935"
       id="text5788"><tspan
         sodipodi:role="line"
         id="tspan5786"
         x="56.330444"
         y="167.56935"
         style="stroke-width:0.26458332;-inkscape-font-specification:'sans-serif, Normal';font-family:sans-serif;font-weight:normal;font-style:normal;font-stretch:normal;font-variant:normal;font-size:2.11666667px;text-anchor:middle;text-align:center;writing-mode:lr;font-variant-ligatures:normal;font-variant-caps:normal;font-variant-numeric:normal;font-feature-settings:normal;">e</tspan></text>
    <text
       xml:space="preserve"
       style="font-style:normal;font-variant:normal;font-weight:normal;font-stretch:normal;font-size:2.11666667px;line-height:1.25;font-family:sans-serif;-inkscape-font-specification:'sans-serif, Normal';font-variant-ligatures:normal;font-variant-caps:normal;font-variant-numeric:normal;font-feature-settings:normal;text-align:center;letter-spacing:0px;word-spacing:0px;writing-mode:lr;text-anchor:middle;fill:#000000;fill-opacity:1;stroke:none;stroke-width:0.26458332;"
       x="10.663895"
       y="199.28343"
       id="text5772-9"><tspan
         sodipodi:role="line"
         id="tspan5770-7"
         x="10.663895"
         y="199.28343"
         style="stroke-width:0.26458332;-inkscape-font-specification:'sans-serif, Normal';font-family:sans-serif;font-weight:normal;font-style:normal;font-stretch:normal;font-variant:normal;font-size:2.11666667px;text-anchor:middle;text-align:center;writing-mode:lr;font-variant-ligatures:normal;font-variant-caps:normal;font-variant-numeric:normal;font-feature-settings:normal;">a</tspan></text>
    <text
       xml:space="preserve"
       style="font-style:normal;font-variant:normal;font-weight:normal;font-stretch:normal;font-size:2.11666667px;line-height:1.25;font-family:sans-serif;-inkscape-font-specification:'sans-serif, Normal';font-variant-ligatures:normal;font-variant-caps:normal;font-variant-numeric:normal;font-feature-settings:normal;text-align:center;letter-spacing:0px;word-spacing:0px;writing-mode:lr;text-anchor:middle;fill:#000000;fill-opacity:1;stroke:none;stroke-width:0.26458332;"
       x="21.247231"
       y="199.28343"
       id="text5776-7"><tspan
         sodipodi:role="line"
         id="tspan5774-5"
         x="21.247231"
         y="199.28343"
         style="stroke-width:0.26458332;-inkscape-font-specification:'sans-serif, Normal';font-family:sans-serif;font-weight:normal;font-style:normal;font-stretch:normal;font-variant:normal;font-size:2.11666667px;text-anchor:middle;text-align:center;writing-mode:lr;font-variant-ligatures:normal;font-variant-caps:normal;font-variant-numeric:normal;font-feature-settings:normal;">b</tspan></text>
    <text
       xml:space="preserve"
       style="font-style:normal;font-variant:normal;font-weight:normal;font-stretch:normal;font-size:2.11666667px;line-height:1.25;font-family:sans-serif;-inkscape-font-specification:'sans-serif, Normal';font-variant-ligatures:normal;font-variant-caps:normal;font-variant-numeric:normal;font-feature-settings:normal;text-align:center;letter-spacing:0px;word-spacing:0px;writing-mode:lr;text-anchor:middle;fill:#000000;fill-opacity:1;stroke:none;stroke-width:0.26458332;"
       x="31.830563"
       y="199.28343"
       id="text5780-4"><tspan
         sodipodi:role="line"
         id="tspan5778-4"
         x="31.830563"
         y="199.28343"
         style="stroke-width:0.26458332;-inkscape-font-specification:'sans-serif, Normal';font-family:sans-serif;font-weight:normal;font-style:normal;font-stretch:normal;font-variant:normal;font-size:2.11666667px;text-anchor:middle;text-align:center;writing-mode:lr;font-variant-ligatures:normal;font-variant-caps:normal;font-variant-numeric:normal;font-feature-settings:normal;">c</tspan></text>
  </g>
</svg>
