OFF
48 84 0
0.07071068 0 -1.343503 
0.07071068 0 -3 
0.7071068 -0.6363961 -3 
0.7071068 -0.6363961 -0.7071068 
1.343503 0 -3 
0.7071068 -0.6363961 0.7071068 
0.7071068 -0.6363961 3 
1.343503 0 3 
0.7071068 0.6363961 -0.7071068 
0.7071068 0.6363961 0.7071068 
0.7071068 0.6363961 -3 
0.7071068 0.6363961 3 
0.07071068 0 3 
0.07071068 0 0.07071068 
0.07071068 0 1.343503 
0.07071068 0 -0.07071068 
-1.343503 0.07071068 0 
-3 0.07071068 0 
-3 0.7071068 -0.6363961 
-0.7071068 0.7071068 -0.6363961 
-3 1.343503 0 
0.7071068 0.7071068 -0.6363961 
3 0.7071068 -0.6363961 
3 1.343503 0 
-0.7071068 0.7071068 0.6363961 
0.7071068 0.7071068 0.6363961 
-3 0.7071068 0.6363961 
3 0.7071068 0.6363961 
3 0.07071068 0 
0.07071068 0.07071068 0 
1.343503 0.07071068 0 
-0.07071068 0.07071068 0 
0 3 1.343503 
0 -3 1.343503 
0.6363961 -0.7071068 0.7071068 
0.6363961 0.7071068 0.7071068 
0.6363961 -3 0.7071068 
0.6363961 3 0.7071068 
0 1.343503 0.07071068 
0 3 0.07071068 
-0.6363961 0.7071068 0.7071068 
-0.6363961 3 0.7071068 
-0.6363961 -0.7071068 0.7071068 
-0.6363961 -3 0.7071068 
0 -3 0.07071068 
0 0.07071068 0.07071068 
0 -0.07071068 0.07071068 
0 -1.343503 0.07071068 
3 0 1 2 
3 0 2 3 
3 4 3 2 
3 4 5 3 
3 6 5 7 
3 4 7 5 
3 7 4 8 
3 7 8 9 
3 10 8 4 
3 7 9 11 
3 8 10 1 
3 8 1 0 
3 10 4 2 
3 10 2 1 
3 11 12 6 
3 11 6 7 
3 5 9 13 
3 5 14 9 
3 12 14 5 
3 12 5 6 
3 11 9 14 
3 11 14 12 
3 3 8 0 
3 3 15 8 
3 5 13 15 
3 15 3 5 
3 9 8 15 
3 9 15 13 
3 16 17 18 
3 16 18 19 
3 20 19 18 
3 20 21 19 
3 22 21 23 
3 20 23 21 
3 23 20 24 
3 23 24 25 
3 26 24 20 
3 23 25 27 
3 24 26 17 
3 24 17 16 
3 26 20 18 
3 26 18 17 
3 27 28 22 
3 27 22 23 
3 21 25 29 
3 21 30 25 
3 28 30 21 
3 28 21 22 
3 27 25 30 
3 27 30 28 
3 19 24 16 
3 19 31 24 
3 21 29 31 
3 31 19 21 
3 25 24 31 
3 25 31 29 
3 32 33 34 
3 32 34 35 
3 36 34 33 
3 32 35 37 
3 37 35 38 
3 37 38 39 
3 39 38 40 
3 39 40 41 
3 33 42 43 
3 33 40 42 
3 41 40 32 
3 33 32 40 
3 43 44 36 
3 43 36 33 
3 41 32 37 
3 41 37 39 
3 35 40 38 
3 35 45 40 
3 35 34 46 
3 35 46 45 
3 40 45 46 
3 46 42 40 
3 34 42 46 
3 34 47 42 
3 34 36 44 
3 34 44 47 
3 47 44 43 
3 47 43 42 
