{
  "swagger": "2.0",
  "info": {
    "version": "API ToS",
    "title": "RestApi Encuestas"
  },
  "basePath": "/dev",
  "schemes": [
    "https"
  ],
  "paths": {
    "/api/encuesta/listar": {
      "get": {
        "tags": [
          "api-encuesta-controller"
        ],
        "summary": "obtenerEncuestas",
        "operationId": "obtenerEncuestasUsingGET",
        "consumes": [
          "application/json"
        ],
        "produces": [
          "application/json"
        ],
        "responses": {
          "200": {
            "description": "OK",
            "schema": {
              "type": "array",
              "items": {
                "$ref": "#/definitions/Encuesta"
              }
            },
			"headers": {
              "Access-Control-Allow-Origin": {
                "type": "string"
              }
            }
          },
          "401": {
            "description": "Unauthorized"
          },
          "403": {
            "description": "Forbidden"
          },
          "404": {
            "description": "Not Found"
          }
        },
		"x-amazon-apigateway-integration": {
		  "uri": "http://alb-curso-2033969447.us-east-1.elb.amazonaws.com/api/encuesta/listar",
		  "responses": {
				"default": {
				  "statusCode": "200",
				  "responseParameters": {
					"method.response.header.Access-Control-Allow-Origin": "'*'"
				  }
				}
			},
			"passthroughBehavior": "when_no_match",
			"httpMethod": "GET",
			"type": "http_proxy"
        }
      },
	  "options": {
			"consumes": [
			  "application/json"
			],
			"responses": {
			  "200": {
				"description": "200 response",
				"headers": {
				  "Access-Control-Allow-Origin": {
					"type": "string"
				  },
				  "Access-Control-Allow-Methods": {
					"type": "string"
				  },
				  "Access-Control-Allow-Headers": {
					"type": "string"
				  }
				}
			  }
			},
			"x-amazon-apigateway-integration": {
			  "responses": {
				"default": {
				  "statusCode": "200",
				  "responseParameters": {
					"method.response.header.Access-Control-Allow-Methods": "'GET,OPTIONS'",
					"method.response.header.Access-Control-Allow-Headers": "'Content-Type,X-Amz-Date,Authorization,X-Api-Key,X-Amz-Security-Token'",
					"method.response.header.Access-Control-Allow-Origin": "'*'"
				  }
				}
			  },
			  "requestTemplates": {
				"application/json": "{\"statusCode\": 200}"
			  },
			  "passthroughBehavior": "when_no_match",
			  "type": "mock"
			}
		}
    },
    "/api/encuesta/registrar": {
      "post": {
        "tags": [
          "api-encuesta-controller"
        ],
        "summary": "guardar",
        "operationId": "guardarUsingPOST",
        "consumes": [
          "application/json"
        ],
        "produces": [
          "application/json"
        ],
        "parameters": [
          {
            "in": "body",
            "name": "negocio",
            "description": "negocio",
            "required": true,
            "schema": {
              "$ref": "#/definitions/Encuesta"
            }
          }
        ],
        "responses": {
          "200": {
            "description": "OK",
            "schema": {
              "$ref": "#/definitions/RespuestaApi"
            },
			"headers": {
              "Access-Control-Allow-Origin": {
                "type": "string"
              }
            }
          },
          "201": {
            "description": "Created"
          },
          "401": {
            "description": "Unauthorized"
          },
          "403": {
            "description": "Forbidden"
          },
          "404": {
            "description": "Not Found"
          }
        },
		"x-amazon-apigateway-integration": {
          "uri": "http://alb-curso-2033969447.us-east-1.elb.amazonaws.com/api/encuesta/registrar",
          "responses": {
            "default": {
              "statusCode": "200",
              "responseParameters": {
                "method.response.header.Access-Control-Allow-Origin": "'*'"
              }
            }
          },
          "passthroughBehavior": "when_no_match",
          "httpMethod": "POST",
          "type": "http_proxy"
        }
      },
	  "options": {
			"consumes": [
			  "application/json"
			],
			"responses": {
			  "200": {
				"description": "200 response",
				"headers": {
				  "Access-Control-Allow-Origin": {
					"type": "string"
				  },
				  "Access-Control-Allow-Methods": {
					"type": "string"
				  },
				  "Access-Control-Allow-Headers": {
					"type": "string"
				  }
				}
			  }
			},
			"x-amazon-apigateway-integration": {
			  "responses": {
				"default": {
				  "statusCode": "200",
				  "responseParameters": {
					"method.response.header.Access-Control-Allow-Methods": "'POST,OPTIONS'",
					"method.response.header.Access-Control-Allow-Headers": "'Content-Type,X-Amz-Date,Authorization,X-Api-Key,X-Amz-Security-Token'",
					"method.response.header.Access-Control-Allow-Origin": "'*'"
				  }
				}
			  },
			  "requestTemplates": {
				"application/json": "{\"statusCode\": 200}"
			  },
			  "passthroughBehavior": "when_no_match",
			  "type": "mock"
			}
		}
    },
    "/api/security/change-password": {
      "post": {
        "operationId": "updatePasswordUsingPOST",
        "consumes": [
          "application/json"
        ],
        "produces": [
          "application/json"
        ],
        "parameters": [
          {
            "in": "body",
            "name": "UpdatePasswordDTO",
            "required": true,
            "schema": {
              "$ref": "#/definitions/UpdatePasswordDTO"
            }
          }
        ],
        "responses": {
          "200": {
            "description": "200 response",
            "schema": {
              "$ref": "#/definitions/RespuestaApi"
            },
            "headers": {
              "Access-Control-Allow-Origin": {
                "type": "string"
              }
            }
          },
          "201": {
            "description": "201 response"
          },
          "401": {
            "description": "401 response"
          },
          "403": {
            "description": "403 response"
          },
          "404": {
            "description": "404 response"
          }
        },
        "x-amazon-apigateway-integration": {
          "uri": "http://alb-curso-2033969447.us-east-1.elb.amazonaws.com/api/security/change-password",
          "responses": {
            "default": {
              "statusCode": "200",
              "responseParameters": {
                "method.response.header.Access-Control-Allow-Origin": "'*'"
              }
            }
          },
          "passthroughBehavior": "when_no_match",
          "httpMethod": "POST",
          "type": "http_proxy"
        }
      },
      "options": {
        "consumes": [
          "application/json"
        ],
        "responses": {
          "200": {
            "description": "200 response",
            "headers": {
              "Access-Control-Allow-Origin": {
                "type": "string"
              },
              "Access-Control-Allow-Methods": {
                "type": "string"
              },
              "Access-Control-Allow-Headers": {
                "type": "string"
              }
            }
          }
        },
        "x-amazon-apigateway-integration": {
          "responses": {
            "default": {
              "statusCode": "200",
              "responseParameters": {
                "method.response.header.Access-Control-Allow-Methods": "'POST,OPTIONS'",
                "method.response.header.Access-Control-Allow-Headers": "'Content-Type,X-Amz-Date,Authorization,X-Api-Key,X-Amz-Security-Token'",
                "method.response.header.Access-Control-Allow-Origin": "'*'"
              }
            }
          },
          "requestTemplates": {
            "application/json": "{\"statusCode\": 200}"
          },
          "passthroughBehavior": "when_no_match",
          "type": "mock"
        }
      }
    },
    "/api/security/first-reset-password": {
      "post": {
        "operationId": "renewPasswordFirstUsingPOST",
        "consumes": [
          "application/json"
        ],
        "produces": [
          "application/json"
        ],
        "parameters": [
          {
            "in": "body",
            "name": "RenewPasswordFirstDTO",
            "required": true,
            "schema": {
              "$ref": "#/definitions/RenewPasswordFirstDTO"
            }
          }
        ],
        "responses": {
          "200": {
            "description": "200 response",
            "schema": {
              "$ref": "#/definitions/RespuestaApi"
            },
            "headers": {
              "Access-Control-Allow-Origin": {
                "type": "string"
              }
            }
          },
          "201": {
            "description": "201 response"
          },
          "401": {
            "description": "401 response"
          },
          "403": {
            "description": "403 response"
          },
          "404": {
            "description": "404 response"
          }
        },
        "x-amazon-apigateway-integration": {
          "uri": "http://alb-curso-2033969447.us-east-1.elb.amazonaws.com/api/security/first-reset-password",
          "responses": {
            "default": {
              "statusCode": "200",
              "responseParameters": {
                "method.response.header.Access-Control-Allow-Origin": "'*'"
              }
            }
          },
          "passthroughBehavior": "when_no_match",
          "httpMethod": "POST",
          "type": "http_proxy"
        }
      },
      "options": {
        "consumes": [
          "application/json"
        ],
        "responses": {
          "200": {
            "description": "200 response",
            "headers": {
              "Access-Control-Allow-Origin": {
                "type": "string"
              },
              "Access-Control-Allow-Methods": {
                "type": "string"
              },
              "Access-Control-Allow-Headers": {
                "type": "string"
              }
            }
          }
        },
        "x-amazon-apigateway-integration": {
          "responses": {
            "default": {
              "statusCode": "200",
              "responseParameters": {
                "method.response.header.Access-Control-Allow-Methods": "'POST,OPTIONS'",
                "method.response.header.Access-Control-Allow-Headers": "'Content-Type,X-Amz-Date,Authorization,X-Api-Key,X-Amz-Security-Token'",
                "method.response.header.Access-Control-Allow-Origin": "'*'"
              }
            }
          },
          "requestTemplates": {
            "application/json": "{\"statusCode\": 200}"
          },
          "passthroughBehavior": "when_no_match",
          "type": "mock"
        }
      }
    },
    "/api/security/login": {
      "post": {
        "operationId": "loginUsingPOST",
        "consumes": [
          "application/json"
        ],
        "produces": [
          "application/json"
        ],
        "parameters": [
          {
            "in": "body",
            "name": "LoginDTO",
            "required": true,
            "schema": {
              "$ref": "#/definitions/LoginDTO"
            }
          }
        ],
        "responses": {
          "200": {
            "description": "200 response",
            "schema": {
              "$ref": "#/definitions/RespuestaApi"
            },
            "headers": {
              "Access-Control-Allow-Origin": {
                "type": "string"
              }
            }
          },
          "201": {
            "description": "201 response"
          },
          "401": {
            "description": "401 response"
          },
          "403": {
            "description": "403 response"
          },
          "404": {
            "description": "404 response"
          }
        },
        "x-amazon-apigateway-integration": {
          "uri": "http://alb-curso-2033969447.us-east-1.elb.amazonaws.com/api/security/login",
          "responses": {
            "default": {
              "statusCode": "200",
              "responseParameters": {
                "method.response.header.Access-Control-Allow-Origin": "'*'"
              }
            }
          },
          "passthroughBehavior": "when_no_match",
          "httpMethod": "POST",
          "type": "http_proxy"
        }
      },
      "options": {
        "consumes": [
          "application/json"
        ],
        "responses": {
          "200": {
            "description": "200 response",
            "headers": {
              "Access-Control-Allow-Origin": {
                "type": "string"
              },
              "Access-Control-Allow-Methods": {
                "type": "string"
              },
              "Access-Control-Allow-Headers": {
                "type": "string"
              }
            }
          }
        },
        "x-amazon-apigateway-integration": {
          "responses": {
            "default": {
              "statusCode": "200",
              "responseParameters": {
                "method.response.header.Access-Control-Allow-Methods": "'POST,OPTIONS'",
                "method.response.header.Access-Control-Allow-Headers": "'Content-Type,X-Amz-Date,Authorization,X-Api-Key,X-Amz-Security-Token'",
                "method.response.header.Access-Control-Allow-Origin": "'*'"
              }
            }
          },
          "requestTemplates": {
            "application/json": "{\"statusCode\": 200}"
          },
          "passthroughBehavior": "when_no_match",
          "type": "mock"
        }
      }
    },
    "/api/security/refresh-token": {
      "post": {
        "operationId": "refreshTokenUsingPOST",
        "consumes": [
          "application/json"
        ],
        "produces": [
          "application/json"
        ],
        "parameters": [
          {
            "in": "body",
            "name": "BasicAccessDTO",
            "required": true,
            "schema": {
              "$ref": "#/definitions/BasicAccessDTO"
            }
          }
        ],
        "responses": {
          "200": {
            "description": "200 response",
            "schema": {
              "$ref": "#/definitions/RespuestaApi"
            },
            "headers": {
              "Access-Control-Allow-Origin": {
                "type": "string"
              }
            }
          },
          "201": {
            "description": "201 response"
          },
          "401": {
            "description": "401 response"
          },
          "403": {
            "description": "403 response"
          },
          "404": {
            "description": "404 response"
          }
        },
        "x-amazon-apigateway-integration": {
          "uri": "http://alb-curso-2033969447.us-east-1.elb.amazonaws.com/api/security/refresh-token",
          "responses": {
            "default": {
              "statusCode": "200",
              "responseParameters": {
                "method.response.header.Access-Control-Allow-Origin": "'*'"
              }
            }
          },
          "passthroughBehavior": "when_no_match",
          "httpMethod": "POST",
          "type": "http_proxy"
        }
      },
      "options": {
        "consumes": [
          "application/json"
        ],
        "responses": {
          "200": {
            "description": "200 response",
            "headers": {
              "Access-Control-Allow-Origin": {
                "type": "string"
              },
              "Access-Control-Allow-Methods": {
                "type": "string"
              },
              "Access-Control-Allow-Headers": {
                "type": "string"
              }
            }
          }
        },
        "x-amazon-apigateway-integration": {
          "responses": {
            "default": {
              "statusCode": "200",
              "responseParameters": {
                "method.response.header.Access-Control-Allow-Methods": "'POST,OPTIONS'",
                "method.response.header.Access-Control-Allow-Headers": "'Content-Type,X-Amz-Date,Authorization,X-Api-Key,X-Amz-Security-Token'",
                "method.response.header.Access-Control-Allow-Origin": "'*'"
              }
            }
          },
          "requestTemplates": {
            "application/json": "{\"statusCode\": 200}"
          },
          "passthroughBehavior": "when_no_match",
          "type": "mock"
        }
      }
    },
    "/api/security/signout": {
      "post": {
        "operationId": "signOutUsingPOST",
        "consumes": [
          "application/json"
        ],
        "produces": [
          "application/json"
        ],
        "parameters": [
          {
            "in": "body",
            "name": "BasicAccessDTO",
            "required": true,
            "schema": {
              "$ref": "#/definitions/BasicAccessDTO"
            }
          }
        ],
        "responses": {
          "200": {
            "description": "200 response",
            "schema": {
              "$ref": "#/definitions/RespuestaApi"
            },
            "headers": {
              "Access-Control-Allow-Origin": {
                "type": "string"
              }
            }
          },
          "201": {
            "description": "201 response"
          },
          "401": {
            "description": "401 response"
          },
          "403": {
            "description": "403 response"
          },
          "404": {
            "description": "404 response"
          }
        },
        "x-amazon-apigateway-integration": {
          "uri": "http://alb-curso-2033969447.us-east-1.elb.amazonaws.com/api/security/signout",
          "responses": {
            "default": {
              "statusCode": "200",
              "responseParameters": {
                "method.response.header.Access-Control-Allow-Origin": "'*'"
              }
            }
          },
          "passthroughBehavior": "when_no_match",
          "httpMethod": "POST",
          "type": "http_proxy"
        }
      },
      "options": {
        "consumes": [
          "application/json"
        ],
        "responses": {
          "200": {
            "description": "200 response",
            "headers": {
              "Access-Control-Allow-Origin": {
                "type": "string"
              },
              "Access-Control-Allow-Methods": {
                "type": "string"
              },
              "Access-Control-Allow-Headers": {
                "type": "string"
              }
            }
          }
        },
        "x-amazon-apigateway-integration": {
          "responses": {
            "default": {
              "statusCode": "200",
              "responseParameters": {
                "method.response.header.Access-Control-Allow-Methods": "'POST,OPTIONS'",
                "method.response.header.Access-Control-Allow-Headers": "'Content-Type,X-Amz-Date,Authorization,X-Api-Key,X-Amz-Security-Token'",
                "method.response.header.Access-Control-Allow-Origin": "'*'"
              }
            }
          },
          "requestTemplates": {
            "application/json": "{\"statusCode\": 200}"
          },
          "passthroughBehavior": "when_no_match",
          "type": "mock"
        }
      }
    },
    "/api/security/token": {
      "post": {
        "operationId": "verificarTokenUsingPOST",
        "produces": [
          "application/json"
        ],
        "responses": {
          "200": {
            "description": "200 response",
            "schema": {
              "$ref": "#/definitions/RespuestaApi"
            },
            "headers": {
              "Access-Control-Allow-Origin": {
                "type": "string"
              }
            }
          },
          "201": {
            "description": "201 response"
          },
          "401": {
            "description": "401 response"
          },
          "403": {
            "description": "403 response"
          },
          "404": {
            "description": "404 response"
          }
        },
        "x-amazon-apigateway-integration": {
          "uri": "http://alb-curso-2033969447.us-east-1.elb.amazonaws.com/api/security/token",
          "responses": {
            "default": {
              "statusCode": "200",
              "responseParameters": {
                "method.response.header.Access-Control-Allow-Origin": "'*'"
              }
            }
          },
          "passthroughBehavior": "when_no_match",
          "httpMethod": "POST",
          "type": "http_proxy"
        }
      },
      "options": {
        "consumes": [
          "application/json"
        ],
        "responses": {
          "200": {
            "description": "200 response",
            "headers": {
              "Access-Control-Allow-Origin": {
                "type": "string"
              },
              "Access-Control-Allow-Methods": {
                "type": "string"
              },
              "Access-Control-Allow-Headers": {
                "type": "string"
              }
            }
          }
        },
        "x-amazon-apigateway-integration": {
          "responses": {
            "default": {
              "statusCode": "200",
              "responseParameters": {
                "method.response.header.Access-Control-Allow-Methods": "'POST,OPTIONS'",
                "method.response.header.Access-Control-Allow-Headers": "'Content-Type,X-Amz-Date,Authorization,X-Api-Key,X-Amz-Security-Token'",
                "method.response.header.Access-Control-Allow-Origin": "'*'"
              }
            }
          },
          "requestTemplates": {
            "application/json": "{\"statusCode\": 200}"
          },
          "passthroughBehavior": "when_no_match",
          "type": "mock"
        }
      }
    }
  },
  "definitions": {
    "BasicAccessDTO": {
      "type": "object",
      "properties": {
        "token": {
          "type": "string"
        }
      }
    },
    "Encuesta": {
      "type": "object",
      "properties": {
        "apellidos": {
          "type": "string"
        },
        "edad": {
          "type": "integer",
          "format": "int32"
        },
        "id": {
          "type": "integer",
          "format": "int32"
        },
        "nombreEncuesta": {
          "type": "string"
        },
        "nombres": {
          "type": "string"
        },
        "opcionEncuesta": {
          "type": "string"
        },
        "tipoEncuesta": {
          "type": "string"
        }
      }
    },
    "LoginDTO": {
      "type": "object",
      "properties": {
        "password": {
          "type": "string"
        },
        "username": {
          "type": "string"
        }
      }
    },
    "RenewPasswordFirstDTO": {
      "type": "object",
      "properties": {
        "password": {
          "type": "string"
        },
        "session": {
          "type": "string"
        },
        "username": {
          "type": "string"
        }
      }
    },
    "RespuestaApi": {
      "type": "object",
      "properties": {
        "accessToken": {
          "type": "string"
        },
        "body": {
          "type": "object"
        },
        "idToken": {
          "type": "string"
        },
        "refreshToken": {
          "type": "string"
        },
        "sessionId": {
          "type": "string"
        },
        "status": {
          "type": "string"
        }
      }
    },
    "UpdatePasswordDTO": {
      "type": "object",
      "properties": {
        "newPassword": {
          "type": "string"
        },
        "oldPassword": {
          "type": "string"
        },
        "token": {
          "type": "string"
        },
        "username": {
          "type": "string"
        },
        "verificationCode": {
          "type": "string"
        }
      }
    }
  }
}