/Users/johanruiz/git/quind/clients/cilog-client/src/main/java/io/quind/model/ci/microsoft/build/vsts/details/RepositoryProperties.java
/Users/johanruiz/git/quind/clients/cilog-client/src/main/java/io/quind/model/ci/microsoft/build/tfs/details/RetentionRule.java
/Users/johanruiz/git/quind/clients/cilog-client/src/main/java/io/quind/client/ci/repository/jenkins/JenkinsRepository.java
/Users/johanruiz/git/quind/clients/cilog-client/src/main/java/io/quind/model/quind/jobs/JobDefinition.java
/Users/johanruiz/git/quind/clients/cilog-client/src/main/java/io/quind/model/ci/jenkins/JenkinsBuildDefinition.java
/Users/johanruiz/git/quind/clients/cilog-client/src/main/java/io/quind/model/ci/microsoft/build/vsts/Value.java
/Users/johanruiz/git/quind/clients/cilog-client/src/main/java/io/quind/client/ci/facade/ClientFacade.java
/Users/johanruiz/git/quind/clients/cilog-client/src/main/java/io/quind/client/ci/collectors/CICollector.java
/Users/johanruiz/git/quind/clients/cilog-client/src/main/java/io/quind/model/ci/jenkins/JenkinsJobBuild.java
/Users/johanruiz/git/quind/clients/cilog-client/src/main/java/io/quind/model/ci/microsoft/build/tfs/details/BuildPlatform.java
/Users/johanruiz/git/quind/clients/cilog-client/src/main/java/io/quind/model/ci/microsoft/build/vsts/details/RetentionRule.java
/Users/johanruiz/git/quind/clients/cilog-client/src/main/java/io/quind/model/ci/microsoft/build/vsts/Project.java
/Users/johanruiz/git/quind/clients/cilog-client/src/main/java/io/quind/client/ci/adapters/tfs/TFSAdapter.java
/Users/johanruiz/git/quind/clients/cilog-client/src/main/java/io/quind/model/ci/microsoft/build/tfs/details/BuildConfiguration.java
/Users/johanruiz/git/quind/clients/cilog-client/src/main/java/io/quind/model/ci/microsoft/build/tfs/Project.java
/Users/johanruiz/git/quind/clients/cilog-client/src/main/java/io/quind/client/ci/collectors/jenkins/JenkinsCollector.java
/Users/johanruiz/git/quind/clients/cilog-client/src/main/java/io/quind/model/ci/microsoft/build/vsts/Build.java
/Users/johanruiz/git/quind/clients/cilog-client/src/main/java/io/quind/model/ci/microsoft/build/vsts/details/Variables.java
/Users/johanruiz/git/quind/clients/cilog-client/src/main/java/io/quind/model/ci/microsoft/build/tfs/details/OptionDefinition.java
/Users/johanruiz/git/quind/clients/cilog-client/src/main/java/io/quind/repository/QuindRepository.java
/Users/johanruiz/git/quind/clients/cilog-client/src/main/java/io/quind/model/ci/jenkins/JenkinsJobDefinition.java
/Users/johanruiz/git/quind/clients/cilog-client/src/main/java/io/quind/model/ci/microsoft/release/tfs/details/ReleaseDetails.java
/Users/johanruiz/git/quind/clients/cilog-client/src/main/java/io/quind/model/ci/microsoft/release/vsts/details/Environment.java
/Users/johanruiz/git/quind/clients/cilog-client/src/main/java/io/quind/model/ci/microsoft/build/tfs/details/RepositoryProperties.java
/Users/johanruiz/git/quind/clients/cilog-client/src/main/java/io/quind/model/ci/microsoft/build/vsts/details/BuildPlatform.java
/Users/johanruiz/git/quind/clients/cilog-client/src/main/java/io/quind/model/ci/microsoft/build/vsts/yaml/BuildTask.java
/Users/johanruiz/git/quind/clients/cilog-client/src/main/java/io/quind/model/ci/microsoft/build/tfs/details/Variables.java
/Users/johanruiz/git/quind/clients/cilog-client/src/main/java/io/quind/model/ci/microsoft/build/vsts/details/Step.java
/Users/johanruiz/git/quind/clients/cilog-client/src/main/java/io/quind/model/ci/microsoft/build/tfs/details/SystemDebug.java
/Users/johanruiz/git/quind/clients/cilog-client/src/main/java/io/quind/client/ci/repository/tfs/TFSRepository.java
/Users/johanruiz/git/quind/clients/cilog-client/src/main/java/io/quind/model/ci/microsoft/build/vsts/Queue.java
/Users/johanruiz/git/quind/clients/cilog-client/src/main/java/io/quind/model/ci/microsoft/build/vsts/details/Phase.java
/Users/johanruiz/git/quind/clients/cilog-client/src/main/java/io/quind/client/ci/adapters/CIAdapter.java
/Users/johanruiz/git/quind/clients/cilog-client/src/main/java/io/quind/model/ci/jenkins/Action.java
/Users/johanruiz/git/quind/clients/cilog-client/src/main/java/io/quind/model/ci/microsoft/build/vsts/details/OptionDefinition.java
/Users/johanruiz/git/quind/clients/cilog-client/src/main/java/io/quind/model/ci/microsoft/build/vsts/details/BuildDetails.java
/Users/johanruiz/git/quind/clients/cilog-client/src/main/java/io/quind/model/ci/microsoft/release/tfs/details/Task.java
/Users/johanruiz/git/quind/clients/cilog-client/src/main/java/io/quind/model/quind/applications/ApplicationConfig.java
/Users/johanruiz/git/quind/clients/cilog-client/src/main/java/io/quind/model/ci/microsoft/build/tfs/details/OptionInputs.java
/Users/johanruiz/git/quind/clients/cilog-client/src/main/java/io/quind/model/ci/microsoft/release/tfs/Release.java
/Users/johanruiz/git/quind/clients/cilog-client/src/main/java/io/quind/model/ci/jenkins/Node.java
/Users/johanruiz/git/quind/clients/cilog-client/src/main/java/io/quind/model/ci/microsoft/build/tfs/details/Repository.java
/Users/johanruiz/git/quind/clients/cilog-client/src/main/java/io/quind/model/ci/microsoft/release/tfs/details/DeployStep.java
/Users/johanruiz/git/quind/clients/cilog-client/src/main/java/io/quind/model/ci/microsoft/build/tfs/details/Step.java
/Users/johanruiz/git/quind/clients/cilog-client/src/main/java/io/quind/client/ci/repository/CIRepository.java
/Users/johanruiz/git/quind/clients/cilog-client/src/main/java/io/quind/client/ci/helpers/JobDefinitionHelper.java
/Users/johanruiz/git/quind/clients/cilog-client/src/main/java/io/quind/model/ci/microsoft/release/tfs/Value.java
/Users/johanruiz/git/quind/clients/cilog-client/src/main/java/io/quind/model/ci/microsoft/release/tfs/RetentionPolicy.java
/Users/johanruiz/git/quind/clients/cilog-client/src/main/java/io/quind/model/ci/microsoft/release/vsts/RetentionPolicy.java
/Users/johanruiz/git/quind/clients/cilog-client/src/main/java/io/quind/model/quind/applications/Application.java
/Users/johanruiz/git/quind/clients/cilog-client/src/main/java/io/quind/model/ci/microsoft/release/tfs/ModifiedBy.java
/Users/johanruiz/git/quind/clients/cilog-client/src/main/java/io/quind/model/ci/microsoft/release/vsts/details/ReleaseDetails.java
/Users/johanruiz/git/quind/clients/cilog-client/src/main/java/io/quind/model/ci/microsoft/release/vsts/Value.java
/Users/johanruiz/git/quind/clients/cilog-client/src/main/java/io/quind/model/ci/microsoft/release/tfs/CreatedBy.java
/Users/johanruiz/git/quind/clients/cilog-client/src/main/java/io/quind/client/ci/facade/ClientAgent.java
/Users/johanruiz/git/quind/clients/cilog-client/src/main/java/io/quind/model/ci/microsoft/build/tfs/Build.java
/Users/johanruiz/git/quind/clients/cilog-client/src/main/java/io/quind/client/ci/adapters/jenkins/JenkinsAdapter.java
/Users/johanruiz/git/quind/clients/cilog-client/src/main/java/io/quind/model/ci/microsoft/build/vsts/Pool.java
/Users/johanruiz/git/quind/clients/cilog-client/src/main/java/io/quind/model/ci/microsoft/build/vsts/AuthoredBy.java
/Users/johanruiz/git/quind/clients/cilog-client/src/main/java/io/quind/model/ci/microsoft/build/tfs/details/BuildDetails.java
/Users/johanruiz/git/quind/clients/cilog-client/src/main/java/io/quind/model/ci/microsoft/build/vsts/details/SystemDebug.java
/Users/johanruiz/git/quind/clients/cilog-client/src/main/java/io/quind/model/ci/microsoft/build/vsts/yaml/BuildProcess.java
/Users/johanruiz/git/quind/clients/cilog-client/src/main/java/io/quind/client/ci/adapters/vsts/VSTSAdapter.java
/Users/johanruiz/git/quind/clients/cilog-client/src/main/java/io/quind/model/ci/microsoft/build/vsts/details/Option.java
/Users/johanruiz/git/quind/clients/cilog-client/src/main/java/io/quind/model/ci/microsoft/build/vsts/details/Repository.java
/Users/johanruiz/git/quind/clients/cilog-client/src/main/java/io/quind/model/ci/microsoft/release/vsts/details/DeployPhase.java
/Users/johanruiz/git/quind/clients/cilog-client/src/main/java/io/quind/model/ci/microsoft/build/tfs/Value.java
/Users/johanruiz/git/quind/clients/cilog-client/src/main/java/io/quind/model/ci/microsoft/build/vsts/details/OptionInputs.java
/Users/johanruiz/git/quind/clients/cilog-client/src/main/java/io/quind/model/ci/microsoft/build/vsts/details/Process.java
/Users/johanruiz/git/quind/clients/cilog-client/src/main/java/io/quind/model/ci/microsoft/release/vsts/details/WorkflowTask.java
/Users/johanruiz/git/quind/clients/cilog-client/src/main/java/io/quind/model/ci/microsoft/build/vsts/details/ProcessParametersInputs.java
/Users/johanruiz/git/quind/clients/cilog-client/src/main/java/io/quind/model/quind/jobs/Build.java
/Users/johanruiz/git/quind/clients/cilog-client/src/main/java/io/quind/client/ci/repository/vsts/VSTSRepository.java
/Users/johanruiz/git/quind/clients/cilog-client/src/main/java/io/quind/client/ci/helpers/ApplicationConfigHelper.java
/Users/johanruiz/git/quind/clients/cilog-client/src/main/java/io/quind/model/ci/microsoft/build/tfs/details/Option.java
/Users/johanruiz/git/quind/clients/cilog-client/src/main/java/io/quind/model/ci/microsoft/release/vsts/Release.java
/Users/johanruiz/git/quind/clients/cilog-client/src/main/java/io/quind/model/ci/microsoft/release/vsts/ModifiedBy.java
/Users/johanruiz/git/quind/clients/cilog-client/src/main/java/io/quind/model/ci/microsoft/release/tfs/details/Environment.java
/Users/johanruiz/git/quind/clients/cilog-client/src/main/java/io/quind/model/ci/microsoft/build/vsts/details/ProcessParameters.java
/Users/johanruiz/git/quind/clients/cilog-client/src/main/java/io/quind/model/quind/servers/TypeOfBuildServer.java
/Users/johanruiz/git/quind/clients/cilog-client/src/main/java/io/quind/model/ci/microsoft/build/vsts/details/BuildConfiguration.java
/Users/johanruiz/git/quind/clients/cilog-client/src/main/java/io/quind/model/ci/microsoft/release/vsts/CreatedBy.java
/Users/johanruiz/git/quind/clients/cilog-client/src/main/java/io/quind/model/ci/microsoft/build/tfs/AuthoredBy.java
/Users/johanruiz/git/quind/clients/cilog-client/src/main/java/io/quind/model/ci/jenkins/JenkinsFolderJob.java
