{
    "name": {
        "value": "Yaw",
        "description": "Name of motion paradigm"
    },
    "outFile": {
        "value": "yaw.mp4", 
        "description": "Name of output file"
    },
    "fps": {
        "value": 24, 
        "description": "Frames per second"
    },
    "dpi": {
        "value": 576, 
        "description": "Dots per inch (fig is 1 inch high))"
    },
    "align": {
        "value": "left", 
        "description": "Position of square in 16:9 rect (left/center/right)"
    },
    "range": {
        "value": 10.0,
        "description": "Motion range [°]"
    },
    "scale": {
        "value": 0.2,
        "description": "Scale factor"
    },
    "duration": {
        "value": 30.0,
        "description": "Total duration in sec"
    },
    "type": {
        "value": "yaw",
        "description": "Motion type: circular/yaw/pitch/random"
    }
}