{
    "name": {
        "value": "FromFile",
        "description": "Name of motion paradigm"
    },
    "inFile": {
        "value": "motionExample.tsm", 
        "description": "Name of input file"
    },
    "outFile": {
        "value": "fromFile.mp4",
        "description": "Name of output file"
    },
    "fps": {
        "value": 24, 
        "description": "Frames per second"
    },
    "dpi": {
        "value": 576, 
        "description": "Dots per inch (fig is 1 inch high))"
    },
    "align": {
        "value": "center", 
        "description": "Position of square in 16:9 rect (left/center/right)"
    },
    "scale": {
        "value": 0.1,
        "description": "Scale factor"
    }
}