{
    "name": {
        "value": "Cocktail",
        "description": "Name of motion paradigm"
    },
    "outFile": {
        "value": "cocktail.mp4", 
        "description": "Name of output file"
    },
    "fps": {
        "value": 24, 
        "description": "Frames per second"
    },
    "dpi": {
        "value": 576, 
        "description": "Dots per inch (fig is 1 inch high))"
    },
    "align": {
        "value": "center", 
        "description": "Position of square in 16:9 rect (left/center/right)"
    },
    "range": {
        "value": 20.0,
        "description": "Motion range [°]"
    },
    "scale": {
        "value": 0.1,
        "description": "Scale factor"
    },
    "duration": {
        "value": 30.0,
        "description": "Total duration in sec"
    },
    "poseDuration": {
        "value": 6.0,
        "description": "Duration of poses in sec (set to 0 for continuous)"
    },
    "moveDuration": {
        "value": 1.5,
        "description": "Duration between poses in sec"
    },
    "type": {
        "value": "cocktail",
        "description": "Motion type: circular/yaw/pitch/random"
    }
}