﻿{
	"name": "Anbennar-Vicky3",
	"id": "org.anbennar.based",
	"version": "1.0.0",
	"supported_game_version": "1.8.*",
	"short_description": "Blackpowder Age",
	"tags": ["overhaul"],
	"relationships": [],
	"game_custom_data": {
			"multiplayer_synchronized": false,
			"replace_paths": [
				"common/achievements",
				"common/map/textures",
				"common/character_templates",
				"common/customizable_localization",
				"common/company_types",
				"common/country_creation",
				"common/country_definitions",
				"common/country_formation",
				"common/dna_data",
				"common/decisions",
				"common/dynamic_country_map_colors",
				"common/dynamic_country_names",
				"common/strategic_regions",
				"common/flag_definitions",
				"common/history",
				"common/history/ai",
				"common/history/buildings",
				"common/history/characters",
				"common/history/countries",
				"common/history/diplomacy",
				"common/history/diplomatic_plays",
				"common/history/interests",
				"common/history/governments",
				"common/history/global",
				"common/history/military_formations",
				"common/history/pops",
				"common/history/population",
				"common/history/power_blocs",
				"common/history/production_methods",
				"common/history/states",
				"common/history/trade_routes",
				"common/journal_entries",
				"common/scripted_buttons",
				"common/subject_types",
				"events",
				"events/agitators_events",
				"events/american_civil_war",
				"events/brazil",
				"events/expedition_events",
				"gfx/map/textures",
				"map_data/state_regions"
			]
	}
}