﻿dna_rean_sil_tirufeld={
	portrait_info = {
		genes={ 		
			hair_color={ 235 108 235 108 }
			skin_color={ 104 24 104 24 }
			eye_color={ 171 185 171 185 }
			gene_cheek_fat={ "cheek_fat" 106 "cheek_fat" 106 }
			gene_cheek_forward={ "cheek_forward" 135 "cheek_forward" 135 }
			gene_cheek_height={ "cheek_height" 135 "cheek_height" 135 }
			gene_cheek_prom={ "cheek_prom" 121 "cheek_prom" 121 }
			gene_cheek_width={ "cheek_width" 158 "cheek_width" 158 }
			gene_chin_forward={ "chin_forward" 121 "chin_forward" 121 }
			gene_chin_height={ "chin_height" 135 "chin_height" 135 }
			gene_chin_width={ "chin_width" 154 "chin_width" 154 }
			gene_ear_angle={ "ear_angle" 96 "ear_angle" 96 }
			gene_ear_inner_shape={ "ear_inner_shape" 108 "ear_inner_shape" 108 }
			gene_ear_lower_bend={ "ear_lower_bend" 76 "ear_lower_bend" 76 }
			gene_ear_out={ "ear_out" 113 "ear_out" 113 }
			gene_ear_size={ "ear_size" 135 "ear_size" 135 }
			gene_ear_upper_bend={ "ear_upper_bend" 117 "ear_upper_bend" 117 }
			gene_eye_angle={ "eye_angle" 114 "eye_angle" 114 }
			gene_eye_depth={ "eye_depth" 107 "eye_depth" 107 }
			gene_eye_distance={ "eye_distance" 117 "eye_distance" 117 }
			gene_eye_height={ "eye_height" 146 "eye_height" 146 }
			gene_eye_shut={ "eye_shut" 131 "eye_shut" 131 }
			gene_eye_corner_def={ "eye_corner_def" 131 "eye_corner_def" 131 }
			gene_eye_corner_depth_min={ "eye_corner_depth_min" 184 "eye_corner_depth_min" 184 }
			gene_eye_fold_droop={ "eye_fold_droop" 123 "eye_fold_droop" 123 }
			gene_eye_fold_shape={ "eye_fold_shape" 156 "eye_fold_shape" 156 }
			gene_eye_size={ "eye_size" 145 "eye_size" 145 }
			gene_eye_upper_lid_size={ "eye_upper_lid_size" 114 "eye_upper_lid_size" 114 }
			gene_forehead_angle={ "forehead_angle" 122 "forehead_angle" 122 }
			gene_forehead_brow_curve={ "forehead_brow_curve" 133 "forehead_brow_curve" 133 }
			gene_forehead_brow_forward={ "forehead_brow_forward" 117 "forehead_brow_forward" 117 }
			gene_forehead_brow_height={ "forehead_brow_height" 123 "forehead_brow_height" 123 }
			gene_forehead_brow_inner_height={ "forehead_brow_inner_height" 140 "forehead_brow_inner_height" 140 }
			gene_forehead_brow_outer_height={ "forehead_brow_outer_height" 137 "forehead_brow_outer_height" 137 }
			gene_forehead_brow_width={ "forehead_brow_width" 129 "forehead_brow_width" 129 }
			gene_forehead_height={ "forehead_height" 137 "forehead_height" 137 }
			gene_forehead_roundness={ "forehead_roundness" 96 "forehead_roundness" 96 }
			gene_forehead_width={ "forehead_width" 118 "forehead_width" 118 }
			gene_head_height={ "head_height" 126 "head_height" 126 }
			gene_head_profile={ "head_profile" 125 "head_profile" 125 }
			gene_head_top_height={ "head_top_height" 135 "head_top_height" 135 }
			gene_head_top_width={ "head_top_width" 137 "head_top_width" 137 }
			gene_head_width={ "head_width" 139 "head_width" 139 }
			gene_jaw_angle={ "jaw_angle" 116 "jaw_angle" 116 }
			gene_jaw_def={ "jaw_def" 121 "jaw_def" 121 }
			gene_jaw_forward={ "jaw_forward" 130 "jaw_forward" 130 }
			gene_jaw_height={ "jaw_height" 123 "jaw_height" 123 }
			gene_jaw_width={ "jaw_width" 120 "jaw_width" 120 }
			gene_mouth_corner_height={ "mouth_corner_height" 137 "mouth_corner_height" 137 }
			gene_mouth_forward={ "mouth_forward" 133 "mouth_forward" 133 }
			gene_mouth_height={ "mouth_height" 136 "mouth_height" 136 }
			gene_mouth_lower_lip_def={ "mouth_lower_lip_def" 116 "mouth_lower_lip_def" 116 }
			gene_mouth_lower_lip_full={ "mouth_lower_lip_full" 108 "mouth_lower_lip_full" 108 }
			gene_mouth_lower_lip_pads={ "mouth_lower_lip_pads" 116 "mouth_lower_lip_pads" 116 }
			gene_mouth_lower_lip_size={ "mouth_lower_lip_size" 126 "mouth_lower_lip_size" 126 }
			gene_mouth_lower_lip_width={ "mouth_lower_lip_width" 121 "mouth_lower_lip_width" 121 }
			gene_mouth_open={ "mouth_open" 132 "mouth_open" 132 }
			gene_mouth_philtrum_curve={ "mouth_philtrum_curve" 78 "mouth_philtrum_curve" 78 }
			gene_mouth_philtrum_def={ "mouth_philtrum_def" 84 "mouth_philtrum_def" 84 }
			gene_mouth_philtrum_width={ "mouth_philtrum_width" 173 "mouth_philtrum_width" 173 }
			gene_mouth_upper_lip_curve={ "mouth_upper_lip_curve" 121 "mouth_upper_lip_curve" 121 }
			gene_mouth_upper_lip_def={ "mouth_upper_lip_def" 122 "mouth_upper_lip_def" 122 }
			gene_mouth_upper_lip_full={ "mouth_upper_lip_full" 132 "mouth_upper_lip_full" 132 }
			gene_mouth_upper_lip_width={ "mouth_upper_lip_width" 124 "mouth_upper_lip_width" 124 }
			gene_mouth_upper_lip_size={ "mouth_upper_lip_size" 137 "mouth_upper_lip_size" 137 }
			gene_mouth_width={ "mouth_width" 105 "mouth_width" 105 }
			gene_nose_curve={ "nose_curve" 140 "nose_curve" 140 }
			gene_nose_forward={ "nose_forward" 125 "nose_forward" 125 }
			gene_nose_hawk={ "nose_hawk" 120 "nose_hawk" 120 }
			gene_nose_height={ "nose_height" 130 "nose_height" 130 }
			gene_nose_length={ "nose_length" 126 "nose_length" 126 }
			gene_nose_nostril_angle={ "nose_nostril_angle" 135 "nose_nostril_angle" 135 }
			gene_nose_nostril_height={ "nose_nostril_height" 136 "nose_nostril_height" 136 }
			gene_nose_nostril_width={ "nose_nostril_width" 124 "nose_nostril_width" 124 }
			gene_nose_ridge_angle={ "nose_ridge_angle" 124 "nose_ridge_angle" 124 }
			gene_nose_ridge_def={ "nose_ridge_def" 131 "nose_ridge_def" 131 }
			gene_nose_ridge_def_min={ "nose_ridge_def_min" 140 "nose_ridge_def_min" 140 }
			gene_nose_ridge_width={ "nose_ridge_width" 127 "nose_ridge_width" 127 }
			gene_nose_size={ "nose_size" 129 "nose_size" 129 }
			gene_nose_tip_angle={ "nose_tip_angle" 128 "nose_tip_angle" 128 }
			gene_nose_tip_forward={ "nose_tip_forward" 136 "nose_tip_forward" 136 }
			gene_nose_tip_width={ "nose_tip_width" 121 "nose_tip_width" 121 }
			gene_neck_length={ "neck_length" 136 "neck_length" 136 }
			gene_neck_width={ "neck_width" 135 "neck_width" 135 }
			gene_bs_body_type={ "body_fat_head_fat_low" 129 "body_fat_head_fat_low" 129 }
			gene_height={ "normal_height" 135 "normal_height" 135 }
			gene_age={ "old_1" 127 "old_1" 127 }
			gene_old_ears={ "old_ears_01" 127 "old_ears_01" 127 }
			gene_old_eyes={ "old_eyes_02" 255 "old_eyes_02" 255 }
			gene_old_forehead={ "old_forehead_02" 255 "old_forehead_02" 255 }
			gene_old_mouth={ "old_mouth_03" 255 "old_mouth_03" 255 }
			gene_old_nose={ "old_nose_01" 127 "old_nose_01" 127 }
			gene_complexion={ "complexion_03" 0 "complexion_03" 0 }
			gene_stubble={ "stubble_low" 127 "stubble_low" 127 }
			gene_crowfeet={ "crowfeet_01" 14 "crowfeet_01" 14 }
			gene_face_dacals={ "face_dacal_02" 255 "face_dacal_02" 255 }
			gene_frown={ "frown_02" 20 "frown_02" 20 }
			gene_surprise={ "surprise_03" 11 "surprise_03" 11 }
			gene_eyebrows_shape={ "avg_spacing_avg_thickness" 146 "avg_spacing_avg_thickness" 146 }
			gene_eyebrows_fullness={ "layer_2_lower_thickness" 164 "layer_2_lower_thickness" 164 }
			hairstyles={ "european_hairstyles" 58 "european_hairstyles" 209 }
			beards={ "european_beards" 2 "european_beards" 2 }
			mustaches={ "european_mustaches" 0 "european_mustaches" 174 }
			props={ "no_prop" 0 "no_prop" 0 }
			eye_accessory={ "normal_eyes" 0 "normal_eyes" 0 }
			eye_lashes_accessory={ "normal_eyelashes" 0 "normal_eyelashes" 0 }
			teeth_accessory={ "normal_teeth" 0 "normal_teeth" 0 }
			POD_NOSschnoz={ "nosies" 0 "nosies" 0 }
			skin_color_override={ "default_1" 127 "default_1" 127 }
			race_gene_mer_ears_01={ "default_1" 127 "default_1" 127 }
			race_gene_mer_ears_02={ "default_1" 127 "default_1" 127 }
			civilian_coats={ "european_civilian_coats" 1 "all_civilian_coats" 0 }
			waistcoats={ "european_waistcoats" 121 "all_waistcoats" 0 }
			legwear={ "european_legwear" 0 "all_legwear" 0 }
		}
	}
	enabled=yes
}