#k_ginerdu
##d_idanas
###c_idanas
594 = {		#Idanas

    # Misc
    culture = barsibu
    religion = bulwari_sun_cult
	holding = castle_holding

    # History
}

6532 = {		#

    # Misc
    culture = barsibu
    religion = bulwari_sun_cult
	holding = none

    # History
}

6533 = {		#

    # Misc
    culture = barsibu
    religion = bulwari_sun_cult
	holding = none

    # History
}

###c_irrliam
595 = {		#Irrliam

    # Misc
    culture = sun_elvish
    religion = bulwari_sun_cult
	holding = castle_holding

    # History
}

6534 = {		#

    # Misc
    culture = sun_elvish
    religion = bulwari_sun_cult
	holding = none

    # History
}

6535 = {		#

    # Misc
    culture = sun_elivsh
    religion = bulwari_sun_cult
	holding = none

    # History
}

6536 = {		#

    # Misc
    culture = sun_elvish
    religion = bulwari_sun_cult
	holding = none

    # History
}

###c_asr_limes
593 = {		#Asr Limes

    # Misc
    culture = barsibu
    religion = bulwari_sun_cult
	holding = castle_holding

    # History
}

6530 = {		#

    # Misc
    culture = barsibu
    religion = bulwari_sun_cult
	holding = none

    # History
}

6531 = {		#

    # Misc
    culture = barsibu
    religion = bulwari_sun_cult
	holding = none

    # History
}

##d_anzabad
###c_anzabad
560 = {		#Anzabad

    # Misc
    culture = barsibu
    religion = bulwari_sun_cult
	holding = castle_holding

    # History
}

6518 = {		#

    # Misc
    culture = barsibu
    religion = bulwari_sun_cult
	holding = none

    # History
}

6519 = {		#

    # Misc
    culture = barsibu
    religion = bulwari_sun_cult
	holding = none

    # History
}

6520 = {		#

    # Misc
    culture = barsibu
    religion = bulwari_sun_cult
	holding = none

    # History
}

6521 = {		#

    # Misc
    culture = barsibu
    religion = bulwari_sun_cult
	holding = none

    # History
}

###c_zanakes
559 = {		#Zanakes

    # Misc
    culture = barsibu
    religion = bulwari_sun_cult
	holding = castle_holding

    # History
}

6522 = {		#

    # Misc
    culture = barsibu
    religion = bulwari_sun_cult
	holding = none

    # History
}

6523 = {		#

    # Misc
    culture = barsibu
    religion = bulwari_sun_cult
	holding = none

    # History
}

6524 = {		#

    # Misc
    culture = barsibu
    religion = bulwari_sun_cult
	holding = none

    # History
}

###c_ginerdu
586 = {		#Ginerdu

    # Misc
    culture = barsibu
    religion = bulwari_sun_cult
	holding = castle_holding

    # History
}

6525 = {		#

    # Misc
    culture = barsibu
    religion = bulwari_sun_cult
	holding = none

    # History
}

6526 = {		#

    # Misc
    culture = barsibu
    religion = bulwari_sun_cult
	holding = none

    # History
}

6527 = {		#

    # Misc
    culture = barsibu
    religion = bulwari_sun_cult
	holding = none

    # History
}

###c_duklum_tanuz
588 = {		#Duklum Tanuz

    # Misc
    culture = barsibu
    religion = bulwari_sun_cult
	holding = castle_holding

    # History
}

6528 = {		#

    # Misc
    culture = barsibu
    religion = bulwari_sun_cult
	holding = none

    # History
}

6529 = {		#

    # Misc
    culture = barsibu
    religion = bulwari_sun_cult
	holding = none

    # History
}

##d_medurubar
###c_medurubar
561 = {		#Medurubar

    # Misc
    culture = barsibu
    religion = bulwari_sun_cult
	holding = castle_holding

    # History
}

6509 = {		#

    # Misc
    culture = brasanni
    religion = bulwari_sun_cult
	holding = none

    # History
}

6510 = {		#

    # Misc
    culture = brasanni
    religion = bulwari_sun_cult
	holding = none

    # History
}

6511 = {		#

    # Misc
    culture = brasanni
    religion = bulwari_sun_cult
	holding = none

    # History
}

6512 = {		#

    # Misc
    culture = brasanni
    religion = bulwari_sun_cult
	holding = none

    # History
}

###c_aklum
584 = {		#Aklum

    # Misc
    culture = barsibu
    religion = bulwari_sun_cult
	holding = castle_holding

    # History
}

6513 = {		#

    # Misc
    culture = brasanni
    religion = bulwari_sun_cult
	holding = none

    # History
}

6514 = {		#

    # Misc
    culture = brasanni
    religion = bulwari_sun_cult
	holding = none

    # History
}