k_buranun = {
	1004.1.1 = {
		liege = e_bulwar
		holder = sun_elvish0022	#Gelmonias
	}
}

d_varamhar = {
	1004.1.1 = {
		liege = k_buranun
		holder = sun_elvish0022	#Gelmonias
	}
}

c_varamhar = {
	1004.1.1 = {
		liege = d_varamhar
		holder = sun_elvish0025	# Varamel Varamzuir
	}
}
