e_bulwar = {
	1002.1.1 = {
		holder = sun_elvish0001	# Jaher
	}
}

k_bulwar = {
	1002.1.1 = {
		holder = sun_elvish0001	# Jaher
	}
}

d_bulwar = {
	1002.1.1 = {
		holder = sun_elvish0001	# Jaher
	}
}

d_kalib = {
	1002.1.1 = {
		holder = sun_elvish0001	# Jaher
	}
}