<svg width="16" height="16" viewBox="0 0 16 16" fill="none" xmlns="http://www.w3.org/2000/svg">
<path fill-rule="evenodd" clip-rule="evenodd" d="M6.83523 8.05461L3.1743 11.7247C2.54671 12.3505 1.96317 12.9215 1.34108 13.5556C0.895164 14.0057 -0.549941 15.0516 0.231792 15.779C0.699731 16.2127 1.13739 15.93 1.47871 15.5978C2.52469 14.5849 7.46558 9.50945 7.9748 9.14437C8.20327 9.22123 13.502 14.5383 14.4571 15.5402C15.4949 16.6299 16.5133 15.4551 15.66 14.5657C15.349 14.2418 15.0599 13.9728 14.7406 13.6516C14.1076 13.0175 13.6286 12.5481 12.8689 11.785C12.4588 11.3733 9.32357 8.41694 9.16942 7.97775C9.4144 7.56325 13.9837 3.08069 14.6883 2.40268C15.3792 1.74114 16.5023 0.912152 15.7508 0.225906C15.3242 -0.163882 14.9113 0.0365015 14.5562 0.3659C12.8606 1.94152 10.3971 4.57671 8.52807 6.39389C8.43724 6.48173 8.36842 6.5531 8.29686 6.61898C8.1262 6.77819 8.17574 6.75623 7.9748 6.85505C7.57843 6.61074 2.39807 1.3239 1.48972 0.423545C1.1952 0.129831 0.749277 -0.237997 0.259318 0.206691C-0.522415 0.912152 0.652937 1.75486 1.28603 2.38072C1.8448 2.93246 2.45037 3.54459 3.15779 4.24731L5.9489 7.02524C6.24068 7.31621 6.73614 7.68129 6.83248 8.05461H6.83523Z" fill="#3A3541" fill-opacity="0.2"/>
</svg>
