<svg width="24" height="24" viewBox="0 0 24 24" fill="none" xmlns="http://www.w3.org/2000/svg">
<path fill-rule="evenodd" clip-rule="evenodd" d="M10.2529 12.0819L4.76145 17.587C3.82007 18.5258 2.94475 19.3822 2.01162 20.3333C1.34275 21.0086 -0.824912 22.5774 0.347688 23.6685C1.0496 24.3191 1.70609 23.895 2.21807 23.3967C3.78704 21.8774 11.1984 14.2642 11.9622 13.7165C12.3049 13.8318 20.253 21.8074 21.6857 23.3103C23.2423 24.9449 24.77 23.1826 23.49 21.8486C23.0235 21.3627 22.5899 20.9592 22.111 20.4774C21.1613 19.5263 20.4429 18.8222 19.3033 17.6776C18.6881 17.0599 13.9854 12.6254 13.7541 11.9666C14.1216 11.3449 20.9755 4.62104 22.0325 3.60402C23.0689 2.61171 24.7535 1.36823 23.6263 0.338858C22.9863 -0.245824 22.367 0.0547523 21.8343 0.54885C19.291 2.91228 15.5956 6.86506 12.7921 9.59083C12.6559 9.72259 12.5526 9.82965 12.4453 9.92847C12.1893 10.1673 12.2636 10.1343 11.9622 10.2826C11.3676 9.91612 3.59711 1.98585 2.23458 0.635317C1.79279 0.194747 1.12392 -0.356996 0.388977 0.310036C-0.783623 1.36823 0.979406 2.63229 1.92905 3.57108C2.76721 4.39869 3.67556 5.31689 4.73668 6.37097L8.92336 10.5379C9.36102 10.9743 10.1042 11.5219 10.2487 12.0819H10.2529Z" fill="#3A3541" fill-opacity="0.87"/>
</svg>
