<svg width="24" height="25" viewBox="0 0 24 25" fill="none" xmlns="http://www.w3.org/2000/svg">
<path fill-rule="evenodd" clip-rule="evenodd" d="M14.3248 6.87247H14.3968V6.58743H14.4688V6.44342H14.5408V6.2994H14.6128V6.15538H14.6848V6.08337H14.7568V5.93936H14.8288V5.86735H14.9008V5.79534H14.9727V5.72333H15.0447V5.65132H15.1167V5.57931H15.2607V5.5073H15.3327V5.43529H15.4767V5.36329H15.6207V5.29128H15.7646V5.21927H16.0526V5.14726H16.9165V5.21927H17.2044V5.29128H17.3484V5.36329H17.4924V5.43529H17.6364V5.5073H17.7083V5.57931H17.8523V5.65132H17.9243V5.72333H17.9963V5.79534H18.0683V5.86735H18.1403V5.93936H18.2123V6.08337H18.2843V6.15538H18.3562V6.2994H18.4282V6.44342H18.5002V6.58743H18.5722V6.87247H18.6442V7.73057H18.5722V8.01561H18.5002V8.15962H18.4282V8.30364H18.3562V8.44766H18.2843V8.51967H18.2123V8.66368H18.1403V8.73569H18.0683V8.8077H17.9963V8.87971H17.9243V8.95172H17.8523V9.02373H17.7083V9.09574H17.6364V9.16775H17.4924V9.23975H17.3484V9.31176H17.2044V9.38377H16.9165V9.45578H16.0526V9.38377H15.7646V9.31176H15.6207V9.23975H15.4767V9.16775H15.3327V9.09574H15.2607V9.02373H15.1167V8.95172H15.0447V8.87971H14.9727V8.8077H14.9008V8.73569H14.8288V8.66368H14.7568V8.51967H14.6848V8.44766H14.6128V8.30364H14.5408V8.15962H14.4688V8.01561H14.3968V7.73057H14.3248V6.87247ZM15.9116 3.51506H15.6236V3.58707H15.3357V3.65908H15.1197V3.73109H14.9038V3.8031H14.7598V3.87511H14.6158V3.94712H14.5438V4.01912H14.3998V4.09113H14.3278V4.16314H14.1839V4.23515H14.1119V4.30716H14.0399V4.37917H13.8959V4.45118H13.8239V4.52318H13.7519V4.59519H13.6799V4.6672H13.6079V4.73921H13.536V4.88323H13.464V4.95524H13.392V5.02725H13.32V5.09925H13.248V5.24327H13.176V5.38729H13.104V5.4593H13.032V5.60331H12.96V5.74733H12.8881V5.96036H12.8161V6.17338H12.7441V6.45842H12.6721V6.74345H12.6001V7.88659H12.6721V8.31564H12.7441V8.45966H12.8161V8.67269H12.8881V8.88571H12.96V9.02973H13.032V9.17375H13.104V9.24575H13.176V9.38977H13.248V9.53379H13.32V9.6058H13.392V9.67781H13.464V9.82182H13.536V9.89383H13.6079V9.96584H13.6799V10.0378H13.7519V10.1099H13.8239V10.1819H13.8959V10.2539H14.0399V10.3259H14.1119V10.3979H14.1839V10.4699H14.2559V10.5419H14.3998V10.6139H14.5438V10.6859H14.6158V10.7579H14.7598V10.8299H14.9757V10.902H15.1197V10.974H15.3357V11.046H15.6236V11.118H15.9116V11.19H16.9914V11.118H17.4954V11.046H17.6394V10.974H17.8553V10.902H18.0713V10.8299H18.2153V10.7579H18.3592V10.6859H18.4312V10.6139H18.5752V10.5419H18.6472V10.4699H18.7912V10.3979H18.8632V10.3259H18.9352V10.2539H19.0791V10.1819H19.1511V10.1099H19.2231V10.0378H19.2951V9.96584H19.3671V9.89383H19.4391V9.74982H19.5111V9.67781H19.5831V9.6058H19.6551V9.46178H19.727V9.38977H19.799V9.24575H19.871V9.17375H19.943V9.02973H20.015V8.88571H20.087V8.67269H20.159V8.45966H20.231V8.31564H20.303V7.81458H20.3749V6.74345H20.303V6.45842H20.231V6.17338H20.159V5.96036H20.087V5.81634H20.015V5.60331H19.943V5.4593H19.871V5.38729H19.799V5.24327H19.727V5.09925H19.6551V5.02725H19.5831V4.95524H19.5111V4.88323H19.4391V4.73921H19.3671V4.6672H19.2951V4.59519H19.2231V4.52318H19.1511V4.45118H19.0791V4.37917H19.0071V4.30716H18.8632V4.23515H18.7912V4.16314H18.7192V4.09113H18.5752V4.01912H18.4312V3.94712H18.3592V3.87511H18.2153V3.8031H18.0713V3.73109H17.8553V3.65908H17.6394V3.58707H17.4954V3.51506H16.9914V3.44305H15.9116V3.51506Z" fill="#3A3541" fill-opacity="0.87"/>
<path fill-rule="evenodd" clip-rule="evenodd" d="M2.53057 1.99088C2.94451 1.83186 15.1107 1.92187 17.2854 1.92187C23.0265 1.92187 22.1117 1.03676 22.1117 7.20251V20.0831C22.1117 20.9832 22.2407 21.7663 21.5148 22.0153C21.0018 22.1923 7.0809 22.0813 4.26732 22.0813C1.39374 22.0813 1.89167 22.4023 1.89167 16.8007V3.92011C1.89167 2.90299 1.73569 2.29092 2.53357 1.98788L2.53057 1.99088ZM0.0649384 21.3672C0.130929 22.2883 0.643853 23.0474 1.10578 23.3865C1.87367 23.9505 2.3146 24.0075 3.42144 24.0075H20.9628C22.7836 23.9925 23.9264 22.8614 23.9474 20.9712V8.72669C23.9474 6.85447 24.0734 4.46618 23.9354 2.65696C23.8664 1.72685 23.3655 0.970756 22.8946 0.625714C22.1357 0.0646466 21.6767 0.00463935 20.5759 0.00763972H3.0345C1.22277 0.0166408 0.0709375 1.15378 0.0499406 3.04401V15.2885C0.0499406 17.1817 -0.0700417 19.534 0.0619388 21.3702L0.0649384 21.3672Z" fill="#3A3541" fill-opacity="0.87"/>
<path fill-rule="evenodd" clip-rule="evenodd" d="M4.23447 18.2558H4.09349V18.3279H4.0215V18.3999H3.94951V18.4689H3.87752V18.5409H3.80853V18.6129H3.73654V18.7569H3.66455V19.327H3.73654V19.471H3.80853V19.543H3.87752V19.612H3.94951V19.684H4.0215V19.756H4.09349V19.828H4.23447V19.9H12.5192V19.828H12.6632V19.756H12.7352V19.684H12.8072V19.612H12.8762V19.543H12.9482V19.471H13.0202V19.327H13.0922V18.7569H13.0202V18.6129H12.9482V18.5409H12.8762V18.4689H12.8072V18.3999H12.7352V18.3279H12.6632V18.2558H12.5192V18.1838H4.23447V18.2558Z" fill="#3A3541" fill-opacity="0.87"/>
<path fill-rule="evenodd" clip-rule="evenodd" d="M4.23447 14.8264H4.09349V14.8984H4.0215V14.9705H3.94951V15.0425H3.87752V15.1115H3.80853V15.1835H3.73654V15.3275H3.66455V15.8976H3.73654V16.0416H3.80853V16.1136H3.87752V16.1856H3.94951V16.2546H4.0215V16.3266H4.09349V16.3986H4.23447V16.4706H8.23587V16.3986H8.37685V16.3266H8.44884V16.2546H8.52083V16.1856H8.59282V16.1136H8.66481V16.0416H8.7338V15.8976H8.80579V15.3275H8.7338V15.1835H8.66481V15.1115H8.59282V15.0425H8.52083V14.9705H8.44884V14.8984H8.37685V14.8264H8.23587V14.7544H4.23447V14.8264Z" fill="#E65525"/>
</svg>
