<svg width="521" height="185" viewBox="0 0 521 185" fill="none" xmlns="http://www.w3.org/2000/svg">
<path fill-rule="evenodd" clip-rule="evenodd" d="M498.906 76.1968C510.735 67.3149 512.739 48.6063 504.197 37.3811C501.967 34.433 498.301 31.4094 493.765 29.5197C483.485 25.1732 472.26 25.8535 461.11 25.8535C455.139 25.8535 449.091 25.6645 443.158 25.7779C442.553 26.685 442.893 27.2897 442.893 28.537C442.893 29.5953 442.893 30.6535 442.893 31.674C442.931 54.6913 443.044 78.0488 442.893 100.991C442.893 103.258 442.364 124.424 442.628 125.898C443.762 126.578 443.876 126.389 445.501 126.389C446.597 126.389 447.693 126.389 448.789 126.389C459.258 126.427 457.898 126.994 457.898 122.458C457.898 120.304 457.898 118.187 457.898 116.033C457.935 107.378 457.898 98.685 457.898 90.0299C457.898 74.9118 458.011 59.5669 457.898 44.4488C457.898 43.0882 457.52 39.2708 458.087 38.4393C459.032 37.1165 461.753 37.6834 463.643 37.7212C465.759 37.7968 467.8 37.8346 469.917 37.8346C474.112 37.8346 478.043 37.7212 481.86 38.9307C489.003 41.1606 492.858 44.7134 494.068 52.726C495.353 61.3433 490.817 67.3149 486.282 70.3764C479.517 74.9118 473.016 73.8913 464.21 74.3449C463.454 75.6677 460.165 84.1716 460.09 85.6079C462.093 85.6834 464.436 85.6456 466.439 85.5701C468.632 85.4945 469.728 85.2299 471.58 86.2882C473.923 87.611 475.51 90.6724 477.211 93.0913C478.08 94.3386 478.95 95.5102 479.819 96.7953C480.613 97.9669 481.482 99.2519 482.313 100.424L500.455 125.746C501.173 126.578 501.551 126.389 502.912 126.389L518.143 126.351C516.329 123.403 512.55 118.301 510.395 115.277L488.587 85.0409C488.021 84.2472 487.076 83.1134 486.698 82.2819C487.416 81.9039 489.079 81.4126 489.986 81.0346C493.652 79.5606 495.731 78.5023 498.83 76.159L498.906 76.1968Z" fill="#46494B"/>
<path fill-rule="evenodd" clip-rule="evenodd" d="M370.817 84.9274C371.12 83.6045 378.225 65.6518 378.981 63.6108C380.039 60.814 386.427 44.7132 387.032 42.4833C387.523 42.7478 387.334 42.6344 387.75 43.6549C387.939 44.1463 388.09 44.5242 388.279 45.0155C390.244 50.2691 402.943 82.9998 403.246 84.8518L370.817 84.8896V84.9274ZM434.276 126.2C434.313 124.801 427.737 108.436 426.679 105.828C422.748 95.9636 418.817 85.6077 414.773 75.8187C413.413 72.5305 412.09 69.2801 410.805 65.9163C406.95 56.014 402.717 45.9982 398.861 36.1337C394.213 24.2281 396.934 25.5132 388.77 25.6644C386.654 25.7022 384.159 25.8911 382.08 25.74C380.795 25.6644 379.85 25.4376 379.284 26.3447C378.83 27.0628 376.751 32.6187 376.335 33.7148C373.652 40.3289 371.006 46.9809 368.398 53.6329C365.791 60.247 363.032 66.7856 360.461 73.4376C357.891 80.1274 355.095 86.6659 352.524 93.3557L340.619 123.327C339.107 127.107 338.276 126.351 349.576 126.351C350.786 126.351 351.958 126.389 353.167 126.351C354.452 126.351 354.906 126.124 355.397 125.217C356.191 123.781 362.238 107.945 363.145 105.223C365.186 99.2896 364.619 99.5163 367.869 99.4785C369.003 99.4785 370.175 99.4785 371.309 99.4785H405.929C409.104 99.5163 408.953 99.6675 409.973 102.351C412.317 108.512 415.718 116.6 417.608 122.609C418.137 124.31 418.78 126.275 420.669 126.389C422.521 126.464 433.369 126.502 434.276 126.2Z" fill="#46494B"/>
<path fill-rule="evenodd" clip-rule="evenodd" d="M259.926 44.751C260.417 44.2597 262.232 39.6864 262.647 38.666C263.214 37.2675 264.877 33.488 264.802 32.0518C262.798 30.2376 257.658 27.8187 254.332 26.6849C244.279 23.2455 230.786 23.5478 221.828 29.5573C218.427 31.825 218.88 31.7494 216.424 34.0171C216.046 34.3573 215.857 34.6974 215.517 35.1132C210.376 40.9337 208.94 48.6439 209.28 56.5431C209.734 66.0675 215.706 72.266 221.904 75.4408C225.721 77.3683 228.745 78.7289 233.167 80.0518C239.895 82.0549 250.78 84.9274 254.521 90.4077C256.827 93.8093 256.902 99.4786 255.58 103.674C252.934 112.14 243.183 115.844 235.435 115.088C230.446 114.597 227.12 113.349 223.227 111.422L218.427 108.36C217.482 107.642 214.458 105.11 213.476 105.677C213.098 106.017 211.208 110.779 210.792 111.611C210.15 112.934 208.184 116.373 208.902 117.885C209.658 119.548 217.066 123.214 219.523 124.272C231.92 129.601 248.89 128.732 259.85 120.342C266.313 115.39 270.849 106.433 271.076 97.7022C271.34 87.0817 268.543 80.3919 260.002 74.9494C256.751 72.8707 252.443 71.0187 248.436 69.6581C242.049 67.5037 235.85 65.9919 230.03 62.5904C228.216 61.5321 226.742 60.3604 225.495 58.6975C222.849 55.1069 222.433 49.8534 224.701 45.4691C225.835 43.277 226.666 42.0675 228.48 40.8203C230.106 39.6864 232.071 38.7415 234.225 38.1368C238.307 36.9652 245.413 37.2297 249.343 38.5904C254.521 40.3667 257.318 43.3904 259.926 44.7888V44.751Z" fill="#46494B"/>
<path fill-rule="evenodd" clip-rule="evenodd" d="M348.443 38.5148C349.312 36.5116 350.068 34.2061 350.937 32.1652C351.542 30.7289 353.28 27.214 353.394 25.8534C351.806 25.551 335.29 25.74 332.266 25.74C325.161 25.74 318.055 25.7022 310.95 25.74C303.844 25.74 296.739 25.7778 289.633 25.7778C288.272 25.7778 279.806 25.5132 279.277 25.9667C278.71 26.4959 276.745 32.3163 276.216 33.6014C275.762 34.6219 274.969 36.3226 274.704 37.3809C274.364 38.9305 275.12 38.5148 278.597 38.5148L299.913 38.477C306.754 38.477 306.301 37.8723 306.301 42.8234V117.431C306.301 119.208 306.301 120.946 306.301 122.723C306.339 127.334 304.827 126.351 318.735 126.389C321.306 126.389 321.306 126.049 321.343 123.592V96.8707C321.343 79.2203 321.23 61.3431 321.381 43.6927C321.419 37.7211 320.739 38.5148 326.899 38.477L342.924 38.5148C344.625 38.5148 346.742 38.666 348.367 38.5526L348.443 38.5148Z" fill="#46494B"/>
<path fill-rule="evenodd" clip-rule="evenodd" d="M316.808 149.066C317.299 149.444 318.887 151.863 319.378 152.619C320.134 153.828 321.041 155.189 321.759 156.209C322.439 155.945 323.989 153.223 324.367 152.581L326.748 149.066C326.748 149.028 326.824 149.028 326.824 148.99L326.861 160.367L330.868 160.329V141.96H326.446C326.219 142.679 324.745 144.908 324.216 145.74C323.838 146.345 323.422 147.025 323.044 147.592C322.742 148.045 322.25 149.142 322.024 149.406C321.003 148.423 318.169 143.51 317.186 141.96L312.688 141.998V160.367L316.808 160.405L316.732 149.028L316.808 149.066Z" fill="#454546"/>
<path fill-rule="evenodd" clip-rule="evenodd" d="M451.17 156.398C451.699 156.058 453.476 153.223 453.854 152.657C454.269 151.976 455.857 149.293 456.386 149.028V160.442H460.468V142.036H456.159C455.743 142.225 452.153 148.612 451.435 149.406C450.981 149.028 449.545 146.458 449.054 145.664C448.6 144.946 447.202 142.452 446.71 141.96L442.288 141.998V160.329L446.332 160.367C446.332 159.082 446.181 150.011 446.446 149.293C446.446 149.255 446.484 149.255 446.484 149.217C446.484 149.179 446.521 149.142 446.521 149.142L448.903 152.77C449.583 153.828 450.717 155.264 451.17 156.36V156.398Z" fill="#434447"/>
<path fill-rule="evenodd" clip-rule="evenodd" d="M362.767 149.104C365.337 151.976 368.134 156.285 370.477 159.044C371.573 160.367 371.195 160.669 375.05 160.404L375.088 142.036H371.006L370.969 152.883C370.515 152.732 366.358 146.911 365.98 146.42C365.073 145.248 364.317 144.266 363.447 143.094C362.351 141.696 362.88 141.96 358.723 142.036L358.761 160.442H362.843L362.805 149.104H362.767Z" fill="#434447"/>
<path fill-rule="evenodd" clip-rule="evenodd" d="M489.117 149.142C489.91 149.709 493.69 154.924 494.257 155.643C494.748 156.285 495.088 156.739 495.542 157.343C496.336 158.402 497.469 160.254 498.301 160.367C499.019 160.443 500.417 160.405 501.211 160.405L501.287 141.998H497.167L497.243 152.581C496.487 152.165 491.536 145.362 490.931 144.531C490.402 143.813 489.381 142.376 488.739 141.923L485.073 142.074L485.11 160.367H489.117V149.142Z" fill="#434447"/>
<path fill-rule="evenodd" clip-rule="evenodd" d="M415.076 147.441C416.096 145.929 417.306 145.173 417.381 144.002C415.907 143.057 414.584 142.188 412.203 141.885C407.895 141.394 404.455 142.603 402.187 146.043C401.016 147.819 400.676 149.18 400.751 151.788C400.902 158.742 407.592 161.803 413.299 160.329C415.832 159.687 416.474 158.78 418.099 157.948V149.747H410.162V153.375H414.093L413.98 155.907C412.77 157.192 408.877 156.928 407.403 155.869C406.156 154.962 404.682 152.43 405.211 150.162C405.702 148.084 407.025 146.307 408.991 145.778C412.165 144.947 414.131 147.063 415.113 147.441H415.076Z" fill="#454649"/>
<path fill-rule="evenodd" clip-rule="evenodd" d="M270.509 145.778L280.147 145.702L280.184 141.998L266.276 142.036L266.313 160.404L280.335 160.442V156.625L270.509 156.587L270.471 152.996L279.013 152.959L278.975 149.255L270.509 149.217V145.778Z" fill="#434447"/>
<path fill-rule="evenodd" clip-rule="evenodd" d="M427.548 145.778H437.148L437.11 141.998H423.391L423.428 160.404H437.299L437.261 156.625L427.51 156.587L427.473 152.996H435.901C436.052 152.354 436.052 149.859 435.901 149.255L427.473 149.217L427.51 145.815L427.548 145.778Z" fill="#454546"/>
<path fill-rule="evenodd" clip-rule="evenodd" d="M470.294 145.778H479.932V141.998H466.175L466.213 160.367L480.121 160.329V156.587L470.332 156.549L470.294 152.959H478.836L478.723 149.33C478.685 149.33 478.647 149.293 478.609 149.293C478.572 149.293 478.534 149.255 478.496 149.255C477.778 149.104 471.731 149.33 470.294 149.179V145.778Z" fill="#434447"/>
<path fill-rule="evenodd" clip-rule="evenodd" d="M214.609 152.467C215.139 150.993 216.235 148.801 216.499 147.252C217.331 147.743 218.805 152.203 218.843 152.467L214.609 152.43V152.467ZM209.583 160.442C211.661 160.442 211.246 160.707 211.926 158.968C212.228 158.212 212.795 157.003 212.984 156.285L220.581 156.36L222.244 160.442L226.515 160.367C226.439 159.649 219.598 143.661 218.767 141.885H215.025C214.156 143.359 207.315 159.422 207.164 160.442H209.583Z" fill="#454546"/>
<path fill-rule="evenodd" clip-rule="evenodd" d="M386.654 152.43C387.107 151.371 388.165 147.894 388.959 147.327L390.962 152.43C390.32 152.581 387.296 152.581 386.654 152.43ZM383.29 160.442C383.781 159.649 384.688 157.305 385.028 156.323H392.625L394.137 160.404H398.408C398.559 159.497 391.643 143.926 390.773 141.885L386.918 141.96C386.011 144.152 379.17 159.686 379.246 160.404L383.29 160.442Z" fill="#454546"/>
<path fill-rule="evenodd" clip-rule="evenodd" d="M345.003 147.29C345.457 147.932 345.684 149.104 346.024 149.898C346.326 150.691 346.817 151.712 347.006 152.505H342.735C343.151 151.183 344.21 148.083 345.003 147.29ZM341.11 156.285H348.594C349.35 157.23 349.539 159.309 350.295 160.367H354.49C354.565 159.611 347.687 143.661 346.855 141.847L343 141.885L335.214 160.367L339.447 160.405L341.11 156.285Z" fill="#454546"/>
<path fill-rule="evenodd" clip-rule="evenodd" d="M241.028 147.327C241.444 146.42 242.918 144.984 243.032 144.039C240.802 141.696 231.882 139.882 230.068 145.664C229.463 147.592 229.879 149.482 230.899 150.729C232.713 152.883 238.761 153.035 239.441 154.773C240.046 156.247 237.476 158.061 233.432 155.907C232.184 155.264 232.033 154.849 231.353 154.698C230.824 155.718 229.501 156.512 229.161 157.608C229.841 158.288 230.106 158.515 230.975 159.044C231.617 159.422 232.373 159.724 233.167 159.989C234.792 160.518 237.022 160.745 238.799 160.405C243.145 159.649 244.43 155.453 243.258 152.732C241.936 149.671 237.211 149.444 234.943 148.31C232.865 147.29 234.15 145.249 236.531 145.4C238.421 145.513 239.706 146.723 240.953 147.252L241.028 147.327Z" fill="#464749"/>
<path fill-rule="evenodd" clip-rule="evenodd" d="M258.83 147.289C259.208 146.836 259.586 146.231 259.926 145.702C260.304 145.135 260.758 144.757 260.947 143.963C257.205 141.015 249.419 140.637 247.983 145.626C247.491 147.327 247.832 149.557 248.739 150.653C250.553 152.77 256.6 153.072 257.28 154.697C257.696 155.642 256.902 156.36 256.222 156.625C255.353 157.003 254.37 156.927 253.501 156.738C251.347 156.209 249.797 154.886 249.343 154.735C248.814 155.264 248.663 155.604 248.134 156.096C247.869 156.36 247.189 157.116 247.038 157.607C247.567 158.515 249.721 159.573 251.12 159.989C257.658 162.067 263.025 158.477 261.249 152.883C260.228 149.708 255.202 149.482 252.972 148.423C250.969 147.441 251.913 145.286 254.37 145.4C256.411 145.475 257.961 146.911 258.83 147.252V147.289Z" fill="#464749"/>
<path fill-rule="evenodd" clip-rule="evenodd" d="M293.526 152.052C293.526 150.805 293.526 149.557 293.564 148.348C293.602 145.589 293.299 145.967 294.811 146.005H299.006V142.036L283.926 142.074L284.002 146.005L289.331 146.042L289.406 160.442H293.488V152.09L293.526 152.052Z" fill="#454546"/>
<path fill-rule="evenodd" clip-rule="evenodd" d="M505.784 142.679C505.558 143.435 505.709 145.551 505.709 146.458L511.076 146.534V160.442L515.006 160.405L514.969 146.458L520.26 146.383L520.222 142.679H505.784Z" fill="#454546"/>
<path fill-rule="evenodd" clip-rule="evenodd" d="M114.301 146.118C115.435 145.854 119.63 142.49 120.839 141.658L133.387 132.625C134.257 132.02 139.284 128.619 139.548 128.052C134.106 127.258 128.965 126.313 123.561 125.595C122.238 125.406 119.252 124.915 118.118 124.953C117.136 127.863 114.452 143.699 114.263 146.118H114.301Z" fill="#F48920"/>
<path fill-rule="evenodd" clip-rule="evenodd" d="M48.7638 128.09C49.5575 128.883 50.9181 129.715 51.9008 130.395C54.5465 132.247 73.2173 145.816 74.5024 146.194C74.4646 145.022 71.8189 132.625 71.3654 130.395C70.1559 124.272 70.7228 124.65 67.7748 125.255C66.9055 125.406 65.9228 125.595 65.1291 125.709C63.0504 125.935 50.011 127.749 48.7638 128.09Z" fill="#F58A21"/>
<path fill-rule="evenodd" clip-rule="evenodd" d="M137.243 70.3004C136.449 71.9634 135.693 73.5508 134.861 75.2138C134.37 76.1965 132.405 79.2957 133.047 80.0138C133.501 80.4673 141.249 84.398 142.458 85.0784C143.857 85.8343 151 89.765 151.794 89.9917C151.718 89.2736 149.791 83.5665 149.413 82.3571L144.537 67.5413C144.046 66.0673 142.572 61.0406 141.778 60.4736L137.205 70.3004H137.243Z" fill="#F58A21"/>
<path fill-rule="evenodd" clip-rule="evenodd" d="M93.0599 50.7982C93.4379 51.1006 93.6268 51.1761 94.0426 51.5919C95.0253 51.2895 108.367 38.5903 109.274 36.7006C107.006 36.436 103.945 36.625 101.602 36.625L80.2851 36.6628C78.1686 36.6628 78.9245 36.7006 78.6599 37.0029C79.4536 37.532 84.9717 43.1257 86.2946 44.373C87.693 45.6958 88.7513 46.7541 90.1497 48.0769L93.0221 50.7604L93.0599 50.7982Z" fill="#F58A21"/>
<path fill-rule="evenodd" clip-rule="evenodd" d="M36.6315 89.9539C37.4252 89.8406 55.2268 80.2406 55.4536 79.8248C55.8693 79.1445 53.904 75.5539 53.4882 74.7602C52.5812 72.9083 47.0252 60.965 46.1182 60.4736C45.8158 60.965 45.7402 61.8721 45.5512 62.5146L36.5938 89.9162L36.6315 89.9539Z" fill="#F48920"/>
<path fill-rule="evenodd" clip-rule="evenodd" d="M95.4032 115.504C96.1213 115.239 99.5985 112.556 100.506 111.875L110.824 104.468C111.731 103.825 112.562 103.22 113.432 102.616C114.15 102.124 115.397 101.368 115.85 100.839L105.91 97.4377C103.945 96.7952 97.482 94.4519 95.63 94.4141C95.1386 97.2865 95.3654 111.384 95.4032 115.466V115.504Z" fill="#FBA518"/>
<path fill-rule="evenodd" clip-rule="evenodd" d="M72.8394 100.877C73.104 101.406 72.8016 101.142 73.3686 101.557L82.893 108.171C84.0646 109.003 92.5308 115.012 92.9465 115.05C93.0221 111.913 93.1355 96.4171 92.8331 94.3384C91.4347 94.3384 84.367 96.7951 82.704 97.362C82.1371 97.551 73.482 100.386 72.9906 100.688L72.8016 100.839L72.8394 100.877Z" fill="#FDA61A"/>
<path fill-rule="evenodd" clip-rule="evenodd" d="M96.3481 91.7305C97.293 92.2597 100.279 92.94 101.526 93.2801C104.663 94.1872 114.792 97.551 116.644 97.9668C116.606 96.9841 113.28 87.8754 112.713 86.099C112.071 84.0581 111.315 82.1683 110.71 80.2408C110.37 79.1447 109.236 74.9494 108.518 74.5337L105.495 78.9557C102.66 82.8487 100.014 86.8927 97.0284 90.6723C96.6882 91.088 96.4237 91.2014 96.3481 91.7305Z" fill="#FDA51A"/>
<path fill-rule="evenodd" clip-rule="evenodd" d="M82.4772 72.8705C82.2882 74.0422 83.0441 74.6847 83.5355 75.365L91.0945 85.6831C92.115 87.0437 93.3244 89.3115 94.4583 89.2737C95.441 89.2359 95.7811 88.1776 96.2725 87.5351L100.695 81.2233C101.488 80.0894 106.402 73.3996 106.553 72.7949L82.4772 72.8705Z" fill="#FDA61A"/>
<path fill-rule="evenodd" clip-rule="evenodd" d="M71.7433 97.8535C73.6331 97.6267 89.5071 92.411 91.7748 91.4283C91.6237 90.5212 86.5969 84.0204 85.6898 82.7354C84.5937 81.2236 80.5119 75.3653 79.5292 74.4204C79.189 75.2897 78.9244 76.5369 78.6221 77.4818L71.7811 97.8157L71.7433 97.8535Z" fill="#FDA51A"/>
<path fill-rule="evenodd" clip-rule="evenodd" d="M97.5953 117.204C100.052 118.149 103.113 118.867 105.91 119.623C107.347 120.001 108.821 120.379 110.257 120.682C116.002 122.004 115.548 122.836 116.039 117.847L117.211 103.031C116.531 103.22 108.518 109.154 107.384 110.023L98.767 116.297C97.8599 116.94 97.9355 116.638 97.6331 117.242L97.5953 117.204Z" fill="#F68B22"/>
<path fill-rule="evenodd" clip-rule="evenodd" d="M91.1702 117.167C90.8678 116.789 86.8615 114.105 86.1434 113.614L71.3276 103.031C71.4032 104.581 71.63 106.282 71.7434 107.982L72.3859 118.112C72.4237 118.905 72.4615 119.926 72.5749 120.682C72.8394 122.571 76.1276 121.097 78.4331 120.53C81.3056 119.812 89.3182 117.998 91.1702 117.129V117.167Z" fill="#F48920"/>
<path fill-rule="evenodd" clip-rule="evenodd" d="M69.1733 97.1354C69.589 96.5685 72.4993 87.3086 73.0662 85.759C73.6709 84.096 76.6945 75.2519 76.5812 74.0425C75.5985 74.1181 73.2552 75.3653 72.2725 75.7811C70.7985 76.4236 69.3623 76.9527 67.8882 77.5196C66.3764 78.0866 64.9402 78.6535 63.3906 79.1448C57.8725 80.959 60.4426 82.9244 62.3701 85.6456C63.5418 87.3086 69.0599 96.9464 69.2111 97.0976L69.1733 97.1354Z" fill="#F68B22"/>
<path fill-rule="evenodd" clip-rule="evenodd" d="M120.461 77.4817C118.874 76.8392 112.902 74.3069 111.655 74.1558C111.882 75.592 112.94 78.5022 113.469 80.0518C114.074 81.866 118.836 96.644 119.214 96.9841C119.781 96.266 119.97 96.0392 120.461 95.1321L123.825 89.3495C128.625 81.2235 129.759 81.488 126.924 80.1652C126.244 79.8628 125.602 79.5227 124.846 79.2581C123.409 78.6912 122.011 78.1243 120.461 77.4817Z" fill="#F48920"/>
<path fill-rule="evenodd" clip-rule="evenodd" d="M106.137 69.9225C105.835 69.1666 101.337 64.1398 100.392 62.9304C99.3339 61.6075 98.5024 60.6249 97.4819 59.3776C96.9528 58.7351 95.1008 56.0138 94.3449 56.0894C93.4 56.1272 86.5969 64.669 85.2363 66.332C84.2158 67.5414 82.5528 69.0154 82.704 69.9225H106.137Z" fill="#F68B22"/>
<path fill-rule="evenodd" clip-rule="evenodd" d="M97.6331 52.2722C98.2756 52.499 117.929 52.4234 120.159 52.3478L116.606 45.0533C116.039 43.7682 115.472 42.6344 114.868 41.3494C114.263 40.1021 113.809 38.8927 113.243 37.5698C112.638 37.6832 111.58 38.8927 111.126 39.3084L105.343 44.8265C104.625 45.5068 97.8599 51.5919 97.6331 52.2722Z" fill="#FDA51A"/>
<path fill-rule="evenodd" clip-rule="evenodd" d="M48.1591 104.468C48.726 103.749 54.9622 85.1164 55.1512 83.3022C53.904 83.5668 43.4347 89.5385 41.3182 90.6345C40.1465 91.2393 37.7276 92.4487 36.9339 93.1668C37.3496 94.1495 43.8126 100.537 45.3245 101.709C46.6095 102.729 47.8945 104.279 48.1591 104.468Z" fill="#FDA51A"/>
<path fill-rule="evenodd" clip-rule="evenodd" d="M94.1937 20.8267C95.9323 19.9574 98.3134 18.0676 100.014 17.0471C100.543 16.707 101.677 16.1778 102.093 15.7999C101.828 14.5904 100.77 12.9274 100.203 11.7936C99.1827 9.75263 94.7984 0.795154 94.0803 0.19043C93.4 0.90854 90.4898 7.29594 89.7717 8.92114C88.5244 11.7936 84.7827 14.5904 88.5622 17.5763L94.1937 20.7889V20.8267Z" fill="#FDA61A"/>
<path fill-rule="evenodd" clip-rule="evenodd" d="M57.3434 76.4991C57.9859 74.9117 58.515 72.8329 59.0442 71.1699L64.3733 55.1447C63.2772 55.0691 48.726 57.6014 47.8568 57.8282C48.0457 58.3573 48.726 59.6046 49.0662 60.1715C51.1827 63.762 55.6048 73.7778 57.3434 76.4991Z" fill="#FDA51A"/>
<path fill-rule="evenodd" clip-rule="evenodd" d="M47.1764 125.142C49.5197 125.406 55.0378 124.273 57.6079 123.932L67.8882 122.496C67.6237 122.043 66.0362 121.06 65.5827 120.758L49.8599 109.23C49.4819 110.099 47.063 124.008 47.1764 125.142Z" fill="#FDA319"/>
<path fill-rule="evenodd" clip-rule="evenodd" d="M75.5985 37.9858C74.6914 38.515 74.2 40.2158 73.6331 41.4252C72.7638 43.2394 68.6063 51.4032 68.6819 52.348H90.8678C90.7544 51.7433 82.8174 44.5622 81.4567 43.2772L79.5292 41.5008C78.9622 40.9339 78.2441 40.2914 77.6016 39.7244C77.0725 39.2709 76.1654 38.4016 75.5985 38.0614V37.9858Z" fill="#FDA51A"/>
<path fill-rule="evenodd" clip-rule="evenodd" d="M96.8016 139.466C97.6331 140.373 105.684 144.569 107.762 145.627C109.954 146.723 110.937 147.63 111.353 146.194C112.222 143.17 112.676 139.806 113.205 136.594C113.545 134.364 114.792 128.317 114.868 126.88C113.847 127.221 107.271 132.21 105.873 133.23L96.8772 139.466H96.8016Z" fill="#FDA51A"/>
<path fill-rule="evenodd" clip-rule="evenodd" d="M142.685 88.102C141.173 87.3083 134.332 83.5666 133.161 83.3398L135.088 88.669C135.693 90.4076 136.26 92.1839 136.827 93.9225C137.318 95.4343 139.888 103.825 140.38 104.43L143.328 101.633C144.273 100.65 145.142 99.7808 146.087 98.8359L150.244 94.565C150.622 94.1871 151.302 93.658 151.605 93.2422C151.113 92.2973 148.43 91.1257 147.221 90.5209C145.709 89.765 144.197 88.8957 142.647 88.102H142.685Z" fill="#FDA319"/>
<path fill-rule="evenodd" clip-rule="evenodd" d="M87.0505 136.291C85.5386 135.195 84.0646 134.212 82.515 133.116L73.4442 126.767L75.3717 136.82C75.9386 140.108 76.3922 143.737 77.1103 146.987C78.3953 147.176 86.4079 142.678 88.3355 141.62C89.356 141.053 91.019 140.297 91.6237 139.466L87.0505 136.291Z" fill="#FCA31A"/>
<path fill-rule="evenodd" clip-rule="evenodd" d="M146.276 152.846C145.633 149.52 144.953 149.52 141.362 149.52C138.376 149.52 136.638 149.255 135.542 151.787C132.254 159.384 132.443 158.666 137.772 161.35C139.548 162.257 141.324 163.202 143.101 164.184C144.159 164.751 147.334 166.641 148.354 166.868L146.313 152.846H146.276Z" fill="#FDA419"/>
<path fill-rule="evenodd" clip-rule="evenodd" d="M120.499 122.458C120.915 122.685 140.002 125.293 140.795 125.179C141.324 124.461 141.4 124.423 141.211 123.479C140.493 119.926 139.813 117.091 139.321 113.349C139.17 112.216 139.208 110.326 138.376 109.646C137.961 109.759 130.477 115.201 129.343 115.995C127.567 117.28 123.258 120.644 121.595 121.702C121.331 121.891 121.217 121.891 120.953 122.08C120.537 122.345 120.764 122.118 120.499 122.458Z" fill="#FDA51A"/>
<path fill-rule="evenodd" clip-rule="evenodd" d="M132.14 56.4674C129.495 56.1272 127.038 55.4847 124.468 55.1445C124.543 56.2028 127.151 64.291 127.68 65.954C128.096 67.2768 130.742 75.9697 131.082 76.3477C131.951 75.2138 132.745 73.2107 133.425 71.7745L137.998 62.4768C138.565 61.343 140.002 58.6973 139.964 57.5256C137.658 57.0343 134.635 56.8075 132.102 56.5052L132.14 56.4674Z" fill="#FDA61A"/>
<path fill-rule="evenodd" clip-rule="evenodd" d="M51.1071 104.921C52.5433 104.694 61.463 101.557 63.4284 100.839C64.7512 100.385 66.1874 99.743 67.5103 99.4406C67.3969 98.6469 58.5906 84.3225 57.8725 83.7178C57.1922 84.2847 56.4363 87.6485 56.0583 88.8957C55.2268 91.5414 51.2961 103.258 51.1071 104.959V104.921Z" fill="#FDA61A"/>
<path fill-rule="evenodd" clip-rule="evenodd" d="M40.1087 166.905C41.5827 166.489 50.8426 161.236 53.4504 159.951C54.1685 159.573 54.5843 159.195 55.189 158.855C55.189 157.154 53.2993 152.089 52.43 151.069C51.4851 149.973 50.3512 149.973 48.5371 149.784C47.2142 149.633 44.9087 149.293 43.7748 149.859C42.4142 150.54 42.5276 151.863 42.1874 153.563L40.1087 166.905Z" fill="#FDA419"/>
<path fill-rule="evenodd" clip-rule="evenodd" d="M95.3654 137.425C96.1969 137.16 99.0315 134.817 99.9008 134.175C101.526 132.927 113.205 124.688 113.545 124.121L95.7433 119.85C95.0252 120.795 95.3276 124.083 95.3276 125.557L95.3654 137.387V137.425Z" fill="#FBA518"/>
<path fill-rule="evenodd" clip-rule="evenodd" d="M130.78 83.7559C129.948 84.2472 124.543 93.2047 123.183 95.2834C122.465 96.4173 121.142 98.0047 121.217 99.6299C122.238 100.235 123.939 100.65 125.261 100.991C128.625 101.935 135.428 104.619 137.356 104.959C137.356 104.846 130.931 83.907 130.817 83.7559H130.78Z" fill="#FDA319"/>
<path fill-rule="evenodd" clip-rule="evenodd" d="M52.0142 107.453C52.9591 108.512 52.9591 108.36 54.1308 109.192L65.0158 117.167C65.8473 117.772 68.6819 120.039 69.6268 120.228C69.6646 118.225 69.0221 102.842 68.5686 102.2C68.3418 101.973 67.7749 102.124 67.4725 102.2C67.0567 102.275 66.7544 102.389 66.3386 102.502L52.0142 107.453Z" fill="#FDA61A"/>
<path fill-rule="evenodd" clip-rule="evenodd" d="M111.655 70.7163C112.033 71.0564 111.806 71.0942 112.524 71.4344L119.706 74.4202C121.255 75.1005 126.622 77.5572 128.398 77.3304C128.398 76.3478 127.189 73.1352 126.811 72.0391L122.691 59.3021C122.427 58.5084 122.313 57.3745 121.671 56.9966C121.18 57.4879 120.764 58.1682 120.348 58.7352L113.998 67.2391C113.469 67.8816 111.806 69.9604 111.693 70.7541L111.655 70.7163Z" fill="#FCA31A"/>
<path fill-rule="evenodd" clip-rule="evenodd" d="M55.567 32.43C56.2095 32.241 66.5276 25.7402 67.3969 25.2111L76.3166 19.8442C77.337 19.2772 78.3575 18.4835 79.3024 17.9922C79.3024 16.6316 79.2646 17.0095 75.4473 17.0095H65.4315C64.1843 17.0095 61.652 16.7449 60.5937 16.8583C60.0646 17.9922 59.6866 19.3906 59.2331 20.6379C58.5906 22.3008 55.6803 31.1449 55.567 32.4678V32.43Z" fill="#EA5321"/>
<path fill-rule="evenodd" clip-rule="evenodd" d="M59.8378 77.7462C61.8032 77.2926 76.3544 71.0186 76.7323 70.5651C76.5811 69.8848 75.863 69.2045 75.5229 68.7887C73.3685 66.2942 68.4174 58.0926 66.3008 56.9966C65.3559 60.5493 64.2599 63.9509 63.0882 67.3903C62.5213 69.0155 59.989 76.6123 59.8378 77.784V77.7462Z" fill="#FCA31A"/>
<path fill-rule="evenodd" clip-rule="evenodd" d="M173.261 103.561C174.433 102.767 175.718 102.124 175.983 100.537C176.172 99.2142 172.43 89.8409 171.561 87.422C171.296 86.7417 170.502 83.7181 169.86 83.3779C169.482 83.6047 169.595 83.6047 169.444 84.1338C169.369 84.4362 169.331 84.663 169.255 84.9275L168.008 90.1055C167.328 92.8645 163.132 109.457 163.057 110.78L173.299 103.561H173.261Z" fill="#EA7923"/>
<path fill-rule="evenodd" clip-rule="evenodd" d="M69.0599 55.1826L79.1512 69.2803C79.756 69.0535 80.3985 68.0708 80.7764 67.6173C82.5906 65.5007 90.7922 56.0141 91.0945 55.1826H69.0221H69.0599Z" fill="#FBA518"/>
<path fill-rule="evenodd" clip-rule="evenodd" d="M97.104 55.1823L103.038 62.0989C104.398 63.6485 107.687 68.3351 109.047 69.091C109.728 68.7886 111.239 66.4453 111.806 65.6894L116.795 58.6595C117.778 57.2611 119.328 56.0138 119.176 55.1445H97.1418L97.104 55.1823Z" fill="#FCA31A"/>
<path fill-rule="evenodd" clip-rule="evenodd" d="M150.131 144.153C150.811 143.926 162.528 135.724 163.85 134.742C164.531 134.25 165.135 133.91 165.702 133.306C165.627 132.625 161.091 118.074 160.978 117.923C160.6 118.225 155.347 130.471 154.515 132.587C154.364 133.003 154.024 133.608 153.797 134.175L151 140.827C150.055 142.641 149.866 142.943 150.131 144.191V144.153Z" fill="#EA5521"/>
<path fill-rule="evenodd" clip-rule="evenodd" d="M74.8047 124.159C75.1071 124.575 78.5843 126.994 79.3024 127.485L88.3733 133.835C89.2047 134.402 92.2662 136.783 92.9465 136.972L92.8709 120.002C91.6992 119.813 85.3118 121.551 83.6866 121.929L74.8047 124.121V124.159Z" fill="#FDA61A"/>
<path fill-rule="evenodd" clip-rule="evenodd" d="M7.68036 63.5353C7.86934 64.0266 7.52918 63.6109 7.98272 64.1022L19.1323 75.9321C19.6993 75.7054 20.0016 75.1762 20.6063 74.7227C27.4095 69.7337 26.8426 71.4723 25.7087 67.655C25.293 66.2943 24.9906 64.7069 24.6882 63.2707C24.0835 60.5495 22.8741 61.1542 21.7024 61.3809L7.68036 63.5353Z" fill="#FCA31A"/>
<path fill-rule="evenodd" clip-rule="evenodd" d="M139.586 36.7387C139.964 37.9103 144.802 41.7277 145.898 42.7481C146.427 43.2395 146.729 43.4662 147.183 43.882C149.148 45.7717 155.309 50.6851 157.879 52.8017C158.521 53.3308 159.882 54.6536 160.524 54.956C160.562 52.9906 156.178 38.0237 155.271 36.6631L139.586 36.7387Z" fill="#EA5521"/>
<path fill-rule="evenodd" clip-rule="evenodd" d="M180.896 63.5353C176.21 63.0061 170.994 62.288 166.458 61.3809C164.493 60.9652 164.72 61.5699 164.191 63.0817C163.813 64.1022 163.51 65.1227 163.17 66.2187C161.885 70.2628 160.827 69.4313 166.118 73.5132C167.441 74.5337 168.953 76.2345 170.2 75.5542C170.616 75.3274 176.701 68.4109 177.079 67.9573L180.934 63.5731L180.896 63.5353Z" fill="#FCA31A"/>
<path fill-rule="evenodd" clip-rule="evenodd" d="M109.085 17.3871C109.01 18.143 109.614 18.3697 110.181 18.6721L129.948 30.6532C130.742 31.1823 132.291 32.0894 132.858 32.6186C132.821 31.9004 130.931 26.08 130.591 24.8705C129.835 22.3004 129.117 19.5414 128.21 17.0847C126.924 16.9335 109.652 17.1981 109.085 17.3493V17.3871Z" fill="#EC7925"/>
<path fill-rule="evenodd" clip-rule="evenodd" d="M118.723 120.757C119.403 120.417 120.386 119.548 120.991 119.057C121.747 118.452 122.351 117.923 123.145 117.318C124.543 116.26 136.071 107.869 136.298 107.567C135.995 107.227 135.958 107.265 135.353 107.076C132.216 106.093 121.255 102.313 120.008 102.238L118.798 120.757H118.723Z" fill="#FCA31A"/>
<path fill-rule="evenodd" clip-rule="evenodd" d="M111.05 173.028C111.617 172.575 112.411 172.197 113.091 171.668L118.685 167.246C119.97 166.187 121.104 165.394 122.502 164.373C123.863 163.39 125.98 162.257 125.715 160.972C124.921 160.934 123.258 161.236 122.313 161.312C114.112 162.068 106.402 162.937 98.0867 163.542C98.4646 164.298 106.099 169.627 107.724 170.798L111.05 172.99V173.028Z" fill="#EC7925"/>
<path fill-rule="evenodd" clip-rule="evenodd" d="M27.6741 55.2958C28.619 54.9935 29.7906 53.7084 30.5465 53.1037C30.8489 52.8769 30.9245 52.7257 31.2268 52.499C36.2158 48.1525 41.5071 43.9572 46.4583 39.5352C47.1008 38.9683 48.6505 37.8344 48.8772 37.1163C47.7812 36.8895 38.03 36.6628 36.2914 36.6628C34.6284 36.6628 33.7213 36.436 32.8898 37.4187C32.5119 37.8722 32.2473 39.195 32.0583 39.8753L27.6741 55.258V55.2958Z" fill="#EB7925"/>
<path fill-rule="evenodd" clip-rule="evenodd" d="M18.6788 82.7731C18.2253 83.1889 15.0127 93.5826 14.0678 95.9259C13.652 96.9842 12.7449 99.2141 12.5182 100.272C12.2158 101.898 14.1812 102.805 15.126 103.447C16.4867 104.392 24.4993 110.401 25.4064 110.742C25.293 109.759 24.8016 108.247 24.5371 107.151C24.2725 105.979 24.0079 104.846 23.7056 103.674C22.9497 100.537 19.019 83.3023 18.641 82.7354L18.6788 82.7731Z" fill="#EA5521"/>
<path fill-rule="evenodd" clip-rule="evenodd" d="M27.4095 118.074C27.0315 118.452 26.2756 121.664 26.0489 122.534C25.5953 124.045 25.1796 125.444 24.6882 126.918C22.7985 132.776 21.6268 132.814 24.4615 134.741C26.767 136.329 29.1103 137.841 31.3402 139.466C32.7764 140.524 36.8205 143.888 38.5213 143.623C38.4457 143.132 37.463 141.015 37.1985 140.335C36.7827 139.277 36.2914 138.256 35.8378 137.123L30.3197 124.31C29.7528 123.063 28.0898 118.678 27.4473 118.074H27.4095Z" fill="#ED7922"/>
<path fill-rule="evenodd" clip-rule="evenodd" d="M62.3701 160.972C64.4867 162.899 66.6788 164.713 68.9465 166.565C70.0804 167.51 71.1008 168.493 72.2725 169.362C73.4819 170.307 74.5402 171.176 75.7119 172.084C77.5638 173.52 78.4709 172.273 79.7182 171.29C80.9276 170.345 82.0615 169.589 83.3087 168.72C84.5938 167.813 85.6898 167.095 86.9371 166.225C88.9402 164.827 90.0363 164.6 89.9607 163.239C88.7512 162.899 84.4426 162.975 82.7796 162.824C80.5119 162.597 78.093 162.521 75.863 162.295C73.5575 162.068 71.4032 161.803 68.9843 161.614C67.019 161.463 64.0331 160.896 62.3323 160.972H62.3701Z" fill="#EA5522"/>
<path fill-rule="evenodd" clip-rule="evenodd" d="M7.64258 60.5496C10.5906 60.3606 13.5764 59.7937 16.4489 59.4914C21.5512 58.9244 23.1386 59.3024 22.4205 56.2032C21.8536 53.6709 20.8709 51.1764 20.1528 48.6441L17.9607 41.1606C16.7512 42.0299 16.0709 44.2977 15.2016 45.8095C14.219 47.548 7.86935 59.5669 7.64258 60.5874V60.5496Z" fill="#EC7925"/>
<path fill-rule="evenodd" clip-rule="evenodd" d="M34.4017 87.4221C34.9686 86.6662 40.0709 70.7922 41.167 67.5796C41.6206 66.219 43.3213 62.0993 43.208 60.8521C42.2631 60.8898 40.4867 62.515 39.8064 63.082C36.7072 65.5765 33.4568 67.9576 30.3576 70.5276C29.1481 71.5103 29.6017 71.1324 30.4709 74.4206C31.0379 76.4993 33.8725 86.893 34.3639 87.3843L34.4017 87.4221Z" fill="#FDA61A"/>
<path fill-rule="evenodd" clip-rule="evenodd" d="M170.691 41.1226C170.124 41.5383 168.121 49.2107 167.97 49.8155C167.554 51.2139 165.4 57.7903 165.362 58.6974L180.821 60.6627C180.707 60.1714 170.956 41.3871 170.691 41.1226Z" fill="#EA5521"/>
<path fill-rule="evenodd" clip-rule="evenodd" d="M126.131 178.319C127.643 178.017 144.802 169.4 145.633 168.644C145.104 168.152 143.063 167.208 142.232 166.792C140.266 165.734 132.783 161.5 131.762 161.5L128.852 169.929C127.832 172.726 127.038 175.523 126.093 178.357L126.131 178.319Z" fill="#EC7925"/>
<path fill-rule="evenodd" clip-rule="evenodd" d="M2.31342 88.7824C2.69137 88.4423 3.63625 87.8754 4.16538 87.4974L13.3874 80.5809C15.1638 79.2202 15.2394 79.4848 16.9024 77.7462C15.9197 76.6502 15.3906 75.9699 14.4079 75.025C13.4252 74.1179 12.7071 73.2486 11.7622 72.3793C10.2882 71.0187 9.07877 70.0738 7.60475 68.5242C7.18901 68.1084 6.77326 67.5415 5.97956 67.5415C5.48822 68.184 4.99688 72.0769 4.8457 72.7573L2.31342 88.7824Z" fill="#EA5521"/>
<path fill-rule="evenodd" clip-rule="evenodd" d="M104.21 14.0991C104.965 13.9101 107.347 12.1337 108.065 11.6424C110.521 9.90382 117.665 5.2172 119.328 3.89437C117.627 3.13846 111.05 2.38256 108.745 2.0046C105.986 1.58885 99.7119 0.379406 97.7087 0.19043C98.0111 1.62665 100.165 5.74634 100.921 7.25815C101.488 8.392 103.756 13.6455 104.247 14.0991H104.21Z" fill="#EC7925"/>
<path fill-rule="evenodd" clip-rule="evenodd" d="M182.106 66.4453C181.765 66.6343 179.724 68.9776 179.309 69.4689C178.402 70.5272 177.381 71.3587 176.436 72.4548C173.602 75.743 170.578 77.217 172.695 78.6154C175.076 80.165 177.23 81.9414 179.498 83.5288C180.896 84.5115 184.902 88.3288 186.036 88.6311C186.036 87.1193 185.432 84.5115 185.129 82.8863C184.524 79.4469 183.164 67.9571 182.143 66.4831L182.106 66.4453Z" fill="#EE7A26"/>
<path fill-rule="evenodd" clip-rule="evenodd" d="M42.9811 168.342C43.1701 168.909 43.3213 169.022 43.926 169.249C45.2867 169.778 51.2961 172.953 52.5811 173.595C54.2441 174.465 55.8693 175.258 57.5701 176.052C59.1197 176.77 61.0095 177.904 62.6725 178.32C62.4835 177.715 62.1055 176.921 61.841 176.241L59.4977 169.854C58.893 168.115 57.3055 162.521 56.2851 161.539L42.9811 168.38V168.342Z" fill="#EB5623"/>
<path fill-rule="evenodd" clip-rule="evenodd" d="M69.2111 3.93216L75.8252 8.31641C84.9717 14.5526 83.4977 15.6109 87.3906 7.71169L91.1701 0.19043C87.504 0.606178 83.8 1.43767 80.0961 1.92901C79.4536 2.0046 69.8914 3.28964 69.2489 3.93216H69.2111Z" fill="#EB5623"/>
<path fill-rule="evenodd" clip-rule="evenodd" d="M154.477 68.0328C153.419 67.2013 152.625 66.4454 151.567 65.6517C150.66 64.9335 146.011 61.1162 145.482 60.9272C145.558 62.0611 147.032 66.332 147.485 67.8438C148.165 70.1115 148.884 72.3414 149.602 74.6091L152.89 84.6249C153.495 86.4391 153.457 87.1194 154.439 87.3839L157.992 74.6469C158.484 72.6816 158.672 71.7367 157.425 70.4895C156.48 69.5446 155.535 68.8265 154.477 67.995V68.0328Z" fill="#FBA518"/>
<path fill-rule="evenodd" clip-rule="evenodd" d="M37.7276 164.373C37.9922 161.916 38.3701 159.384 38.7859 157.003C40.1465 148.952 41.3182 149.141 35.989 149.104H26.5402C24.6883 149.028 23.6678 148.65 22.5717 149.746C22.9875 150.426 29.3749 156.36 30.1308 157.154C31.0001 158.061 37.1229 164.033 37.7276 164.335V164.373Z" fill="#ED7C29"/>
<path fill-rule="evenodd" clip-rule="evenodd" d="M134.143 147.063C135.164 145.022 136.298 141.771 137.091 139.315C137.696 137.387 139.699 133.003 139.661 131.151C138.868 131.189 134.635 134.552 133.954 135.044L120.31 144.984C119.365 145.664 117.891 146.42 117.589 147.063L134.106 147.025L134.143 147.063Z" fill="#FDA61A"/>
<path fill-rule="evenodd" clip-rule="evenodd" d="M68.0772 144.984C65.3937 143.095 49.8599 131.567 48.8394 131.265C49.1418 133.57 53.6394 145.665 54.4709 147.29C55.0378 147.29 55.4914 147.101 56.2851 147.101C60.8583 147.063 66.5276 147.176 70.7229 147.025C70.5717 146.496 68.6819 145.4 68.0772 144.947V144.984Z" fill="#FDA215"/>
<path fill-rule="evenodd" clip-rule="evenodd" d="M80.0961 33.866C88.3355 33.3369 99.6363 34.1306 108.216 33.8282C107.838 33.2613 99.5607 27.592 97.8599 26.5715C96.8016 25.929 95.2898 24.7951 94.1938 24.3794C93.7024 24.3794 80.3985 33.2991 80.0961 33.866Z" fill="#FDA61A"/>
<path fill-rule="evenodd" clip-rule="evenodd" d="M138.074 34.2062C140.38 34.2439 153.268 34.4707 154.477 34.055C154.553 33.3369 152.587 27.403 152.209 26.1558C151.416 23.4723 150.773 20.7888 149.98 18.2188C149.564 18.4077 148.657 19.8062 148.354 20.2219C147.825 20.94 147.372 21.5825 146.88 22.1873C145.482 23.9258 138.263 33.3369 138.074 34.2439V34.2062Z" fill="#ED7922"/>
<path fill-rule="evenodd" clip-rule="evenodd" d="M182.635 119.359C181.803 116.789 180.745 114.068 179.876 111.271L177.872 105.11C177.003 102.918 175.794 104.732 173.186 106.622L165.362 112.405C164.871 112.783 164.191 113.161 163.926 113.728C165.816 114.37 181.765 119.435 182.597 119.359H182.635Z" fill="#ED5521"/>
<path fill-rule="evenodd" clip-rule="evenodd" d="M95.441 184.783C96.0079 184.631 104.058 178.32 105.268 177.413C105.948 176.883 108.178 175.598 108.291 174.88C108.443 173.784 106.591 173.066 105.381 172.159C104.247 171.328 103.34 170.609 102.169 169.778C100.997 168.946 96.5749 165.431 95.3654 165.091L95.441 184.783Z" fill="#EA5521"/>
<path fill-rule="evenodd" clip-rule="evenodd" d="M38.8615 18.2565C38.2945 19.0125 36.6315 24.6817 36.2536 26.0424L33.9103 34.2062H50.3134C50.1622 33.4125 45.4 27.1384 44.6441 26.1558L40.3355 20.1841C40.0331 19.7306 39.315 18.4077 38.8993 18.2188L38.8615 18.2565Z" fill="#EA5321"/>
<path fill-rule="evenodd" clip-rule="evenodd" d="M20.115 131.567C21.2867 129.866 20.9087 130.055 21.589 127.938C22.0426 126.616 22.5339 125.444 22.9874 124.159L25.3307 116.184C23.8945 116.449 7.03784 121.778 6.73547 122.042C7.07563 122.458 19.1701 131.151 20.1528 131.567H20.115Z" fill="#EB5623"/>
<path fill-rule="evenodd" clip-rule="evenodd" d="M79.6426 174.767C81.3812 176.846 88.2977 181.381 91.2457 183.724C91.7749 184.14 92.304 184.631 92.9087 184.896V165.469C92.5308 165.583 80.0205 173.822 79.6426 174.767Z" fill="#EC7B28"/>
<path fill-rule="evenodd" clip-rule="evenodd" d="M5.82837 119.435C6.58427 119.359 24.1969 113.879 24.3858 113.727C23.252 112.518 18.263 108.89 16.3733 107.453L13.9544 105.564C13.5386 105.186 13.6142 105.186 13.1984 104.883C12.5937 104.468 12.1402 104.165 11.1953 104.127C10.0992 106.584 9.41892 109.116 8.43624 111.762C7.9827 112.934 5.94175 118.527 5.82837 119.435Z" fill="#EC7925"/>
<path fill-rule="evenodd" clip-rule="evenodd" d="M176.89 120.531C174.169 119.624 165.211 116.562 163.057 116.146L168.046 131.529C169.18 131.302 173.866 127.863 175 127.069C177.154 125.595 179.687 124.083 181.387 122.156C180.972 121.778 177.419 120.682 176.89 120.531Z" fill="#EA7923"/>
<path fill-rule="evenodd" clip-rule="evenodd" d="M135.958 32.5052L147.41 17.0848C146.389 16.7824 133.236 16.9714 131.195 17.047C131.044 17.5383 133.123 23.8123 133.425 24.795C133.879 26.1556 135.315 31.8249 135.958 32.543V32.5052Z" fill="#EA5521"/>
<path fill-rule="evenodd" clip-rule="evenodd" d="M47.9701 54.8803C52.1654 54.6157 60.0268 52.8771 64.0331 52.8016C63.8441 52.159 59.4599 46.4519 58.7417 45.5449C57.8347 44.3732 56.9276 43.2393 56.0205 41.9921C55.4536 41.1984 53.904 38.8929 53.2992 38.5527C52.9969 38.8929 53.0347 39.0819 52.8835 39.5732C52.7701 39.9512 52.6945 40.2157 52.5811 40.5559L49.2173 50.7984C48.8394 51.9323 48.1213 53.822 47.9701 54.9181V54.8803Z" fill="#EC7925"/>
<path fill-rule="evenodd" clip-rule="evenodd" d="M95.3654 159.876C96.3103 159.498 98.2001 157.986 98.9938 157.381C101.866 155.189 106.855 151.372 109.728 149.822C108.329 148.839 96.4993 142.414 95.3654 142.188V159.876Z" fill="#EB7925"/>
<path fill-rule="evenodd" clip-rule="evenodd" d="M78.7733 149.746C79.1134 150.275 81.5701 151.787 82.326 152.316C83.8378 153.375 92.0772 159.498 92.8709 159.838V142.225C92.1528 142.376 86.6725 145.324 85.7276 145.853C83.8 146.95 80.2095 148.461 78.7733 149.746Z" fill="#EB5825"/>
<path fill-rule="evenodd" clip-rule="evenodd" d="M41.4693 17.0095C41.5827 17.5764 42.452 18.5213 42.7921 19.0126L50.9559 30.578C51.3717 31.1827 51.9386 32.052 52.3921 32.4677C53.2614 30.9559 54.4331 26.8362 55.0378 24.8331C55.4158 23.5481 57.6079 17.841 57.3433 17.0095L41.4315 16.9717L41.4693 17.0095Z" fill="#EC7925"/>
<path fill-rule="evenodd" clip-rule="evenodd" d="M150.811 163.958C151.529 163.542 153.835 161.047 154.515 160.329L165.476 149.671C164.493 149.444 162.754 149.558 161.658 149.558L154.515 149.369C147.523 149.369 148.09 149.066 148.884 153.261C149.11 154.471 149.299 155.605 149.45 156.814C149.791 159.271 150.282 161.652 150.773 163.958H150.811Z" fill="#EA5521"/>
<path fill-rule="evenodd" clip-rule="evenodd" d="M69.5512 44.0708C70.156 42.7479 72.8016 37.9857 72.5749 36.7007L56.0583 36.7763C55.8694 37.6456 65.5449 50.6471 66.0741 51.0251C66.2631 50.6093 66.3764 50.5715 66.6032 50.1558C66.7544 49.8912 66.8678 49.5889 67.019 49.2865L69.5512 44.1086V44.0708Z" fill="#EA5521"/>
<path fill-rule="evenodd" clip-rule="evenodd" d="M47.2898 109.154L30.4709 114.445C30.9623 115.201 33.1166 116.6 33.9481 117.204C35.1954 118.074 36.2536 118.867 37.4631 119.699C38.6347 120.53 43.8883 124.461 44.6064 124.763L47.252 109.116L47.2898 109.154Z" fill="#EC7925"/>
<path fill-rule="evenodd" clip-rule="evenodd" d="M157.917 114.408L141.098 109.154C141.211 110.288 141.627 111.8 141.854 112.972C142.685 117.054 142.95 121.022 143.668 124.726C144.197 124.537 157.425 115.164 157.917 114.408Z" fill="#EA5521"/>
<path fill-rule="evenodd" clip-rule="evenodd" d="M124.846 52.537C125.791 53.2173 134.937 54.2 137.583 54.6535C139.283 54.9559 140.644 55.5984 139.888 53.2173C139.095 50.7606 138.263 48.3417 137.469 45.7716C137.091 44.4866 135.58 39.0819 134.975 38.5527L124.883 52.537H124.846Z" fill="#EB5623"/>
<path fill-rule="evenodd" clip-rule="evenodd" d="M58.4395 33.8281C59.3087 34.584 61.4253 34.2816 62.7481 34.2816L72.0458 34.3194C73.9355 34.3194 74.5402 34.2816 75.1828 32.8454C76.1276 30.7667 77.0725 28.4989 78.1308 26.4958C78.8867 25.0596 80.8521 21.7336 81.1544 20.4107C80.0961 19.806 79.0001 20.9399 78.1308 21.469L69.7402 26.7982C67.8505 27.9698 65.9985 29.1415 64.0709 30.2753C63.0127 30.9178 59.0064 33.2233 58.4772 33.8281H58.4395Z" fill="#EC7925"/>
<path fill-rule="evenodd" clip-rule="evenodd" d="M29.526 112.027C30.6221 111.762 32.4363 110.931 33.6079 110.515C36.2158 109.532 45.1733 107 45.7024 106.017C45.2866 104.959 43.7748 103.976 43.0567 103.22C41.4315 101.444 36.1024 96.0771 34.8174 95.6235L30.7355 107.794C30.3575 109.041 29.6772 110.779 29.4882 112.027H29.526Z" fill="#EA5522"/>
<path fill-rule="evenodd" clip-rule="evenodd" d="M153.646 95.208C152.55 95.586 148.997 99.7434 148.014 100.802C147.145 101.747 143.214 105.98 142.798 106.736C145.18 107.68 148.317 108.55 150.924 109.343C152.285 109.759 153.57 110.213 154.893 110.666C156.102 111.082 157.652 111.8 158.824 112.065L153.608 95.208H153.646Z" fill="#EC7925"/>
<path fill-rule="evenodd" clip-rule="evenodd" d="M130.364 40.2536C130.893 39.4977 132.783 37.3056 132.934 36.6631L115.813 36.7387C115.775 37.5324 118.421 42.7481 118.95 43.9576L122.2 50.9875L130.364 40.2914V40.2536Z" fill="#EA7923"/>
<path fill-rule="evenodd" clip-rule="evenodd" d="M158.484 57.4505C158.484 56.6946 157.198 55.9009 156.254 55.1072L141.211 42.1056C140.228 41.1985 139.321 40.1402 138.641 40.367C138.339 41.0095 139.321 43.0505 139.624 43.882L141.891 51.0631C142.194 52.0836 142.572 53.7088 142.987 54.5402C143.668 55.9009 144.499 55.7875 146.276 56.0143C147.636 56.1654 148.997 56.3544 150.32 56.5434C152.134 56.808 156.896 57.6773 158.521 57.4883L158.484 57.4505Z" fill="#ED7922"/>
<path fill-rule="evenodd" clip-rule="evenodd" d="M27.0694 87.611C26.2001 86.704 25.3308 86.0614 24.4615 85.0788C23.9323 84.474 22.5339 82.9244 21.6268 82.6221C21.8536 85.1166 25.2174 98.4205 26.0489 102.049C26.389 103.523 26.8804 107.454 27.7119 108.209C28.43 107.643 31.0756 98.8362 31.8694 96.6819C32.2851 95.5481 33.1544 93.8851 32.4363 92.6756C32.0583 91.9953 28.0898 88.6693 27.0694 87.611Z" fill="#ED7922"/>
<path fill-rule="evenodd" clip-rule="evenodd" d="M29.9796 56.9588C32.2473 57.2233 36.5181 56.732 38.7859 56.3918C43.6992 55.6359 44.7575 56.5808 45.6646 53.9729C46.4583 51.5918 47.1386 49.2485 47.9701 46.8296C48.3859 45.6202 50.3134 40.7068 50.2756 39.9131C49.2551 40.3666 48.4992 41.2737 47.6677 41.954L37.5386 50.5336C36.7827 51.1383 30.1307 56.6564 30.0173 56.9966L29.9796 56.9588Z" fill="#EB5623"/>
<path fill-rule="evenodd" clip-rule="evenodd" d="M107.687 20.1084L110.408 26.458C110.937 27.5541 111.391 28.4989 111.882 29.5572C113.998 34.0549 113.356 34.2438 116.342 34.2816C118.723 34.2816 128.89 34.5462 129.797 33.9793C129.532 33.2234 127.794 32.4297 127.151 32.0139C126.206 31.4092 125.337 30.9178 124.392 30.3509C121.595 28.6501 108.896 20.2974 107.687 20.1084Z" fill="#EA5521"/>
<path fill-rule="evenodd" clip-rule="evenodd" d="M39.693 139.919C40.2221 141.28 40.5623 142.641 41.4316 142.754C41.8095 142.149 42.3764 136.102 42.641 134.704C43.0945 132.436 44.4174 128.959 43.0945 127.107C42.452 126.162 39.1638 124.197 37.7654 123.138C29.1481 116.713 30.1686 116.864 32.8142 123.516C34.893 128.732 37.8032 135.006 39.693 139.919Z" fill="#ED5521"/>
<path fill-rule="evenodd" clip-rule="evenodd" d="M99.5607 160.632C101.072 160.669 110.71 159.876 112.676 159.687C116.833 159.271 121.482 159.271 125.488 158.591C124.543 157.57 120.575 155.378 118.912 154.471C116.871 153.375 113.167 150.805 111.617 151.447L102.433 158.099C101.791 158.553 99.9008 159.876 99.5985 160.632H99.5607Z" fill="#EB5623"/>
<path fill-rule="evenodd" clip-rule="evenodd" d="M88.6001 160.594C88.1465 160.027 77.4127 151.712 76.619 151.447C75.3717 150.994 73.9733 151.938 72.7639 152.657C71.7056 153.299 70.3828 153.942 69.3245 154.509L64.1843 157.23C63.504 157.608 62.8993 157.721 62.8993 158.439C63.693 159.044 73.6709 159.573 75.5607 159.686C78.093 159.838 86.9371 160.783 88.5623 160.594H88.6001Z" fill="#EC7925"/>
<path fill-rule="evenodd" clip-rule="evenodd" d="M160.978 108.89C161.432 108.134 162.112 103.561 162.376 102.276C163.775 95.7369 165.551 89.1605 166.798 82.7354C165.665 83.3779 161.961 87.1196 160.6 88.3291C157.123 91.4661 154.893 91.4661 156.972 97.2487C158.181 100.65 159.202 104.619 160.487 108.02C160.562 108.209 160.6 108.361 160.713 108.512L160.978 108.852V108.89Z" fill="#EA5521"/>
<path fill-rule="evenodd" clip-rule="evenodd" d="M147.145 142.678C147.939 142.263 151.869 132.436 152.474 130.962C153.343 128.77 157.274 119.812 157.501 118.83C156.821 118.981 152.172 122.042 151.378 122.571C150.433 123.214 149.375 123.894 148.506 124.574C145.028 127.182 144.159 127.031 144.877 130.395C145.142 131.718 145.369 133.116 145.633 134.515L147.145 142.716V142.678Z" fill="#EC7925"/>
<path fill-rule="evenodd" clip-rule="evenodd" d="M9.8347 99.2895C10.5906 98.5336 12.5938 92.184 13.1229 90.5966L15.5796 84.0202C15.9197 83.0376 16.2599 82.773 15.8063 82.0171C15.1638 82.0171 14.5213 82.6974 13.8032 83.2643C10.0993 86.2502 6.54651 88.7824 2.80477 91.5793C2.27564 91.995 1.51973 92.4108 0.990601 92.8643C1.40635 93.6202 8.51186 98.7226 9.8347 99.2895Z" fill="#EC7925"/>
<path fill-rule="evenodd" clip-rule="evenodd" d="M180.027 87.384C178.893 86.4769 173.602 82.2439 172.543 82.0171C172.581 82.5084 173.715 85.7966 173.98 86.5147C175.076 89.6139 177.872 97.3242 178.326 99.7431C179.384 99.2139 183.92 95.5856 185.243 94.5651C185.885 94.0738 187.019 93.4313 187.321 92.8265L179.951 87.3462L180.027 87.384Z" fill="#EA5521"/>
<path fill-rule="evenodd" clip-rule="evenodd" d="M163.586 54.9934C164.871 50.8359 166.194 46.1115 167.706 41.954C168.083 40.8958 168.461 39.8375 168.802 38.7792C169.595 36.3981 167.706 36.6627 166.987 36.6627C164.795 36.7005 160.562 36.4359 158.672 36.7761C158.483 38.3257 160.411 44.3351 160.94 46.1115C161.091 46.7162 163.132 54.4265 163.586 54.9934Z" fill="#ED7922"/>
<path fill-rule="evenodd" clip-rule="evenodd" d="M24.6882 54.8046C25.3307 53.9353 27.0693 47.5857 27.5606 45.9983C28.0898 44.3731 30.3575 38.2125 29.9417 36.7007L19.737 36.7763C19.3969 38.0613 24.6504 54.8046 24.6882 54.8424V54.8046Z" fill="#EA5521"/>
<path fill-rule="evenodd" clip-rule="evenodd" d="M151.491 146.799C153.646 147.063 167.214 146.421 170.049 146.194C169.935 145.362 168.121 139.542 167.592 138.143C166.987 136.518 167.214 136.934 166.269 136.027C165.702 136.367 164.984 137.01 164.417 137.425C163.775 137.879 163.246 138.257 162.603 138.748C160.827 140.109 151.794 146.156 151.529 146.799H151.491Z" fill="#EC7925"/>
<path fill-rule="evenodd" clip-rule="evenodd" d="M122.087 180.776C122.88 179.491 128.247 164.902 128.398 163.277C127.832 163.39 127.794 163.617 127.378 163.995L115.435 172.952C112.94 174.54 113.507 174.918 117.816 177.866C119.101 178.735 121.217 180.776 122.087 180.776Z" fill="#EB5623"/>
<path fill-rule="evenodd" clip-rule="evenodd" d="M109.123 14.4769C113.091 14.5903 125.602 14.8171 127.076 14.2501C127.038 13.4942 124.165 4.72571 123.787 4.23438C122.502 4.30997 114.036 10.5084 112.487 11.6422C111.693 12.2092 109.387 13.721 109.123 14.4769Z" fill="#EB5623"/>
<path fill-rule="evenodd" clip-rule="evenodd" d="M71.2898 171.819C69.3622 170.496 61.841 164.373 60.3292 164.033C60.4803 165.432 62.6347 170.95 63.2394 172.462C63.9575 174.2 65.6205 179.68 66.2252 180.625C67.3969 180.701 70.0048 178.509 70.7607 177.942C71.5544 177.337 72.1213 176.884 72.8394 176.317C73.5953 175.712 74.1622 175.334 74.767 174.691C74.3134 173.784 72.3859 172.613 71.3276 171.857L71.2898 171.819Z" fill="#EA7923"/>
<path fill-rule="evenodd" clip-rule="evenodd" d="M61.1606 14.0614C63.3528 14.1748 69.5512 14.5528 71.3276 14.4016L79.2646 14.2126C79.0756 13.3811 65.3181 4.19688 64.8646 4.0835C64.6 4.53704 64.4866 4.53704 64.2599 5.17956L62.1055 11.6048C61.841 12.3607 61.274 13.4189 61.1984 14.0614H61.1606Z" fill="#EC7925"/>
<path fill-rule="evenodd" clip-rule="evenodd" d="M18.6788 146.043C19.5103 146.534 35.0441 146.496 36.7071 146.194C36.4803 145.816 33.5323 144.002 32.8898 143.586L21.6646 135.951L18.6788 146.043Z" fill="#EA5321"/>
<path fill-rule="evenodd" clip-rule="evenodd" d="M158.106 87.8756C159.126 87.3087 163.661 81.7906 165.135 80.4299C165.4 80.2032 166.761 78.6913 166.836 78.389C167.29 76.726 165.4 76.726 163.397 74.7228C162.906 74.2315 162.187 73.2866 161.243 73.2866C160.827 74.2693 157.047 85.8347 156.896 87.3087L158.068 87.9134L158.106 87.8756Z" fill="#F5891E"/>
<path fill-rule="evenodd" clip-rule="evenodd" d="M21.4001 77.6707C21.3245 78.9935 22.4961 79.9762 23.441 80.6943C25.104 82.0171 30.3198 87.2707 31.3024 87.4975C31.4536 85.9479 29.9418 81.7904 29.4883 80.0896C28.9969 78.162 28.1654 74.6849 27.4473 73.1353C26.0111 73.5132 22.3828 76.877 21.4001 77.6707Z" fill="#F5891E"/>
<path fill-rule="evenodd" clip-rule="evenodd" d="M159.693 68.5621C162.452 59.7558 162.187 60.5495 158.37 60.1338L148.165 58.7354C148.052 59.6424 148.695 59.8314 149.224 60.2472L156.669 66.2566C157.35 66.8235 158.937 68.222 159.693 68.5621Z" fill="#F58A21"/>
<path fill-rule="evenodd" clip-rule="evenodd" d="M28.8457 68.4488C29.4882 68.1465 33.2299 65.1229 34.137 64.4048C35.8756 63.0441 37.5764 61.6457 39.3528 60.3229C40.411 59.5292 41.9228 58.4709 38.9748 58.9622C35.2709 59.6048 29.526 60.0961 26.8425 60.663C26.8803 61.6835 28.4677 67.8441 28.8457 68.4488Z" fill="#F48920"/>
<path fill-rule="evenodd" clip-rule="evenodd" d="M141.665 147.139C143.365 147.176 144.953 147.328 144.726 145.4C144.272 141.394 143.441 137.425 142.836 133.457C142.761 132.965 142.761 132.852 142.534 132.587C142.005 133.268 137.318 145.967 137.205 147.101L141.665 147.176V147.139Z" fill="#F3861B"/>
<path fill-rule="evenodd" clip-rule="evenodd" d="M79.189 31.0692C80.0961 30.8046 90.9811 23.2078 91.737 22.6786L87.5039 19.655C85.3118 17.9542 85.4252 17.5385 83.7622 20.8645C82.9307 22.5275 82.1748 24.266 81.3811 25.929C80.8898 26.9495 79.1134 30.1243 79.189 31.107V31.0692Z" fill="#F58A21"/>
<path fill-rule="evenodd" clip-rule="evenodd" d="M96.7638 22.7166C98.6914 24.115 101.072 25.4756 103.151 26.9118L109.312 31.3339C109.387 30.2756 107.12 25.8158 106.553 24.6819C105.835 23.1701 103.718 19.4284 103.302 18.3701C102.546 18.4835 98.8047 21.2426 97.5953 22.0363C97.4441 22.1496 97.3307 22.1874 97.1795 22.3386C96.8394 22.641 97.0662 22.3386 96.8016 22.7544L96.7638 22.7166Z" fill="#F5891E"/>
<path fill-rule="evenodd" clip-rule="evenodd" d="M46.156 133.003C45.6646 134.023 44.3796 141.582 44.0772 143.245C43.3969 146.76 42.9812 147.138 45.3245 147.138C47.1387 147.138 49.5198 147.29 51.2583 147.101C50.7292 144.908 49.5198 142.301 48.7261 140.071C48.2725 138.823 47.9324 137.652 47.5166 136.442C47.2898 135.8 46.7985 133.419 46.1938 133.041L46.156 133.003Z" fill="#F3861B"/>
<path fill-rule="evenodd" clip-rule="evenodd" d="M58.137 157.343C59.3465 157.457 63.3906 154.773 64.6 154.055C65.6583 153.413 70.2315 150.994 70.5717 150.502L55.6048 150.54C55.5292 151.221 56.474 153.261 56.7386 154.055C57.2677 155.605 57.3433 156.361 58.137 157.381V157.343Z" fill="#F68B22"/>
<path fill-rule="evenodd" clip-rule="evenodd" d="M131.724 154.282C132.027 153.488 132.858 151.372 132.896 150.54L118.307 150.578C118.118 151.409 120.272 152.127 120.953 152.468L129.948 157.419C131.006 156.474 131.157 155.831 131.762 154.282H131.724Z" fill="#F58A21"/>
<path fill-rule="evenodd" clip-rule="evenodd" d="M7.79374 106.131C8.09611 105.488 8.58745 104.732 8.73863 103.939C9.30556 101.406 6.73548 100.272 4.46776 98.7228C3.74965 98.2315 3.48508 97.7023 2.27563 97.6646C2.31343 100.499 4.61894 108.474 4.73233 112.48C5.90398 112.102 7.03784 107.68 7.79374 106.093V106.131Z" fill="#EA5521"/>
<path fill-rule="evenodd" clip-rule="evenodd" d="M171.296 141.847C172.128 141.393 174.357 136.745 175.076 135.384L178.628 128.543C176.361 128.921 172.392 131.907 170.654 132.965C168.726 134.174 168.953 134.893 169.784 137.198C170.313 138.71 170.767 140.411 171.296 141.847Z" fill="#ED5925"/>
<path fill-rule="evenodd" clip-rule="evenodd" d="M47.4788 13.6456L47.6677 14.0991L54.7355 14.0613C56.663 14.0235 58.2504 14.3637 58.7418 13.4566C59.1197 12.7385 60.8205 7.22037 60.8961 6.35107C60.1024 6.54005 58.2882 7.63611 57.5323 8.08966C56.1717 8.84556 47.9323 13.003 47.5166 13.6456H47.4788Z" fill="#ED5925"/>
<path fill-rule="evenodd" clip-rule="evenodd" d="M102.32 183.535C104.285 183.573 107.724 182.704 109.803 182.364C112.335 181.91 114.906 181.759 117.513 181.494C117.022 180.701 114.754 179.076 113.885 178.395C112.033 176.921 111.164 176.09 109.576 177.45C108.896 178.017 108.367 178.395 107.649 178.962C106.628 179.718 102.546 182.553 102.32 183.573V183.535Z" fill="#EE7A26"/>
<path fill-rule="evenodd" clip-rule="evenodd" d="M141.362 13.4188C138.301 12.1337 134.143 9.90382 131.082 8.27862C130.137 7.78728 128.55 6.72902 127.491 6.54004C127.68 7.6739 128.474 9.41248 128.89 10.6597C129.117 11.3778 129.343 12.0581 129.532 12.7385C129.797 13.7211 129.759 14.0613 130.969 14.1369C133.463 14.2503 139.624 14.5526 141.4 13.4566L141.362 13.4188Z" fill="#F17A24"/>
<path fill-rule="evenodd" clip-rule="evenodd" d="M17.9607 133.192C17.0158 132.474 11.1575 128.43 10.2882 128.203C10.2126 129.035 14.2189 136.631 15.0882 138.332L16.6756 141.696C17.5827 141.318 18.1118 138.257 18.5654 137.198C19.5103 134.931 19.926 134.704 17.9607 133.192Z" fill="#ED7922"/>
<path fill-rule="evenodd" clip-rule="evenodd" d="M85.8788 183.611C85.5764 182.741 81.6457 179.718 80.5496 178.849C78.3953 177.148 77.6772 176.278 76.2032 177.11C75.3717 177.564 71.1764 180.889 70.7985 181.456C73.4819 181.721 75.9764 181.948 78.6221 182.364L85.9166 183.611H85.8788Z" fill="#EB5623"/>
<path fill-rule="evenodd" clip-rule="evenodd" d="M183.315 112.48C183.806 110.893 185.961 98.9116 185.998 97.3242L182.408 100.008C180.783 101.217 179.384 101.973 179.876 103.409C180.367 104.921 180.934 106.584 181.501 108.096C181.728 108.701 182.899 112.064 183.353 112.48H183.315Z" fill="#EE7A26"/>
<path fill-rule="evenodd" clip-rule="evenodd" d="M23.8568 34.2064C25.5575 34.3575 27.6741 34.2819 29.4127 34.2441C30.5087 34.2441 30.9623 34.3953 31.3402 33.4504L34.5528 22.9434C33.3434 23.8127 26.389 31.1071 25.0284 32.6945C24.5749 33.2237 24.0079 33.4882 23.8568 34.1686V34.2064Z" fill="#EE7A26"/>
<path fill-rule="evenodd" clip-rule="evenodd" d="M164.493 34.2063C164.228 33.4126 160.6 29.8221 159.655 28.8394C158.635 27.7811 155.422 23.8882 154.666 23.5103C154.817 26.3449 155.876 29.3307 156.707 31.7874C157.35 33.6772 157.236 34.1685 158.106 34.2441L164.493 34.2063Z" fill="#ED551D"/>
</svg>
