<svg width="24" height="25" viewBox="0 0 24 25" fill="none" xmlns="http://www.w3.org/2000/svg">
<path fill-rule="evenodd" clip-rule="evenodd" d="M9.60479 20.634L14.3777 20.607C13.5047 22.89 10.4928 22.884 9.60479 20.634ZM3.97391 15.4831C4.63689 15.3961 17.3266 15.4591 18.9256 15.4591C20.0626 15.4591 20.5696 15.4771 21.3435 16.0411C21.7575 16.3411 22.3575 17.2381 22.2705 18.0991C22.1685 19.122 21.0616 18.894 20.0686 18.894C18.7786 18.894 2.64794 19.011 2.17995 18.792C1.46596 18.462 1.70896 17.2711 2.12595 16.6531C2.49794 16.1071 3.02293 15.6091 3.97091 15.4831H3.97391ZM5.14988 13.7431C5.11088 10.8092 4.97889 9.02424 6.53886 6.98728C9.2808 3.39935 14.7257 3.40835 17.4646 6.98728C19.0186 9.01824 18.8896 10.8212 18.8536 13.7461L5.14988 13.7431ZM3.41292 13.8151C2.75293 14.1061 2.44094 14.0911 1.84995 14.5141C0.403982 15.5551 -0.46 17.6131 0.256985 19.143C0.772975 20.238 1.73295 20.607 3.29292 20.607C4.5589 20.607 6.61985 20.484 7.78983 20.631C8.02982 21.171 8.02682 21.444 8.34782 21.981C9.99178 24.7289 14.0747 24.6929 15.6827 21.936C15.9737 21.438 15.9887 21.138 16.2137 20.631C17.3866 20.487 19.4446 20.607 20.7106 20.607C24.7335 20.61 24.3675 17.2471 23.2545 15.6301C22.3275 14.2831 21.6345 14.2771 20.5906 13.8151C20.4106 12.3032 20.7196 10.8962 20.3716 9.28823C19.6336 5.8743 16.7926 3.03936 12.8837 2.63137C12.7247 1.63239 13.2497 0.0214233 12.0017 0.0214233C10.7508 0.0214233 11.2758 1.62939 11.1198 2.63137C8.22182 2.93736 6.29586 4.44333 5.10489 6.0453C2.83093 9.10824 3.70691 11.3582 3.41592 13.8121L3.41292 13.8151Z" fill="#524E59"/>
</svg>
