{
    "dataset_reader": {
        "type": "pharmareader"
    },
    "iterator": {
        "type": "basic",
        "batch_size": 64
    },
    "model": {
        "type": "crf_tagger",
        "calculate_span_f1": true,
        "dropout": 0.5,
        "encoder": {
            "type": "lstm",
            "bidirectional": true,
            "dropout": 0.5,
            "hidden_size": 70,
            "input_size": 100,
            "num_layers": 2
        },
        "include_start_end_transitions": false,
        "label_encoding": "BIOUL",
        "regularizer": [
            [
                "scalar_parameters",
                {
                    "alpha": 0.1,
                    "type": "l2"
                }
            ]
        ],
        "text_field_embedder": {
            "token_embedders": {
                "tokens": {
                    "type": "embedding",
                    "embedding_dim": 100,
                    "pretrained_file": "https://s3-us-west-2.amazonaws.com/allennlp/datasets/glove/glove.6B.100d.txt.gz",
                    "trainable": false
                }
            }
        },
        "verbose_metrics": true
    },
    "train_data_path": "./train_data_allen_full_1031.txt",
    "test_data_path": "./test_data_allen_full_1031.txt",
    "trainer": {
        "cuda_device": 0,
        "grad_norm": 5,
        "num_epochs": 50,
        "num_serialized_models_to_keep": 3,
        "optimizer": {
            "type": "adam",
            "lr": 0.001
        },
        "patience": 25,
        "validation_metric": "+f1-measure-overall"
    },
    "evaluate_on_test": true
}