<?xml version="1.0" encoding="utf-8"?>
<COLLADA xmlns="http://www.collada.org/2005/11/COLLADASchema" version="1.4.1" xmlns:xsi="http://www.w3.org/2001/XMLSchema-instance">
  <asset>
    <contributor>
      <author>Blender User</author>
      <authoring_tool>Blender 2.79.0 commit date:2018-03-22, commit time:14:10, hash:f4dc9f9d68b</authoring_tool>
    </contributor>
    <created>2019-03-17T10:19:09</created>
    <modified>2019-03-17T10:19:09</modified>
    <unit name="meter" meter="1"/>
    <up_axis>Z_UP</up_axis>
  </asset>
  <library_images/>
  <library_geometries>
    <geometry id="Circle_007-mesh" name="Circle.007">
      <mesh>
        <source id="Circle_007-mesh-positions">
          <float_array id="Circle_007-mesh-positions-array" count="540">-1.851219 0.9384191 16.45913 -0.9614258 -1.660165 12.81062 -3.232193 7.525287 15.79846 -2.342403 4.926702 12.14996 -0.418251 1.902833 12.53543 -1.308044 4.501417 16.18395 -2.123203 6.371104 14.0039 -0.7422333 -0.2157654 14.66455 -0.1990509 3.347235 14.38938 0.5185127 1.456222 16.56506 1.40831 -1.142361 12.91655 -0.8624573 8.043091 15.9044 0.0273323 5.444507 12.25589 -0.5158463 1.881508 12.53107 -1.40564 4.480092 16.17958 -1.081657 6.598689 14.05046 0.2993164 0.01182126 14.71112 -1.624832 3.035692 14.32564 2.140224 7.954428 15.17583 2.972088 1.581247 12.80261 -5.20764 7.016633 15.0929 -4.375776 0.6434515 12.71968 -0.7831535 1.682077 12.27184 -1.615017 8.055262 14.64506 -4.835472 4.136734 13.64289 2.51239 5.074528 13.72582 -1.242851 5.175359 13.19506 1.984039 9.048817 14.23593 2.815903 2.675636 11.86271 -5.363821 8.111023 14.153 -4.531963 1.737839 11.77978 -0.7767181 1.637006 12.31055 -1.608578 8.010193 14.68377 -4.904121 4.617741 13.22979 2.443745 5.555536 13.31272 -1.148884 4.516908 13.76056 -0.9627228 -1.420438 15.85255 1.767555 -1.120469 12.20404 -7.692156 -1.327501 15.19189 -4.961884 -1.027534 11.54338 -1.590412 0.1887507 11.92886 -4.320688 -0.1112186 15.57737 -6.323387 -0.4977633 13.39733 0.4060478 -0.5907049 14.05798 -2.951916 0.7185221 13.78281 -0.949749 1.00517 15.95849 1.780518 1.305145 12.30998 -7.679188 1.098112 15.29783 -4.948917 1.398079 11.64932 -1.590946 0.08885443 11.9245 -4.321224 -0.2111148 15.57301 -6.317686 0.5683419 13.44389 0.411747 0.4754039 14.10455 -2.959721 -0.7408776 13.71907 -6.936014 4.008722 14.56926 -0.535183 3.426698 12.19604 -7.627827 -3.366368 14.48633 -1.22699 -3.948394 12.11311 -1.454807 -0.2155949 11.66527 -7.85564 0.3664305 14.03849 -4.736244 -3.633016 13.03632 -4.044434 3.742074 13.11925 -4.964058 0.09978079 12.58849 -8.038067 4.09565 13.62936 -1.63723 3.513624 11.25614 -8.729882 -3.279436 13.54643 -2.329041 -3.861469 11.17321 -1.409416 -0.2191724 11.70398 -7.810255 0.3628578 14.0772 -5.220625 -3.594811 12.62322 -4.528814 3.780282 12.70615 -4.300995 0.04747647 13.15398 1.480873 1.02307 15.85255 -1.250603 0.7342403 12.20404 8.209874 0.9026834 15.19189 5.478401 0.6138567 11.54338 2.101994 -0.5886656 11.92886 4.833473 -0.2998357 15.57737 6.83773 0.07853645 13.39733 0.1087303 0.1989275 14.05798 3.461327 -1.123986 13.78281 1.458008 -1.402465 15.95849 -1.27346 -1.6913 12.30998 8.187012 -1.522857 15.29783 5.45554 -1.811684 11.64932 2.102936 -0.4887725 11.9245 4.834415 -0.1999426 15.57301 6.827682 -0.9875366 13.44389 0.0986824 -0.8671491 14.10455 3.475086 0.3353692 13.71907 7.431972 -4.430411 14.56926 1.033565 -3.822281 12.19604 8.153859 2.941796 14.48633 1.755451 3.549926 12.11311 1.96804 -0.1837704 11.66527 8.366444 -0.7919004 14.03849 5.26339 3.220237 13.03632 4.5415 -4.151969 13.11925 5.475975 -0.5134578 12.58849 8.533661 -4.521833 13.62936 2.13525 -3.913703 11.25614 9.255551 2.85037 13.54643 2.857136 3.458508 11.17321 1.922665 -0.1800073 11.70398 8.32108 -0.7881428 14.0772 5.747616 3.180056 12.62322 5.025722 -4.192153 12.70615 4.813129 -0.4584492 13.15398 1.154839 -0.3961299 16.60653 0.119831 2.148108 12.95802 2.905296 -6.894577 15.94587 1.870293 -4.350343 12.29736 -0.2214241 -1.439862 12.68284 0.8135834 -3.984102 16.33135 1.732944 -5.804812 14.1513 -0.01750564 0.6936374 14.81196 -0.3587723 -2.894335 14.53678 -1.181896 -1.046823 16.71246 -2.216911 1.497405 13.06396 0.5685539 -7.545277 16.0518 -0.4664497 -5.001042 12.4033 -0.1251869 -1.413064 12.67848 0.9098206 -3.957304 16.32699 0.7059021 -6.090807 14.19786 -1.044556 0.4076412 14.85852 1.047157 -2.502838 14.47304 -2.434345 -7.626191 15.32323 -3.624508 -1.310106 12.95001 4.848892 -6.275262 15.2403 3.65873 0.04082417 12.86708 0.1304397 -1.198875 12.41924 1.320599 -7.514957 14.79246 4.314812 -3.42095 13.7903 -2.968426 -4.771876 13.87323 0.7865219 -4.660645 13.34246 -2.216656 -8.710021 14.38333 -3.406818 -2.393931 12.01011 5.066578 -7.359096 14.30041 3.876423 -1.043 11.92719 0.1214714 -1.154236 12.45795 1.311634 -7.47033 14.83117 4.410496 -3.897327 13.37719 -2.872745 -5.248249 13.46012 0.6555481 -4.008544 13.90796 -5.454391 1.527945 15.55823 -3.571342 1.239115 12.51518 0.43293 1.407558 17.1672 2.315979 1.118732 14.12415 -0.6969872 -0.08379054 13.34976 -2.580032 0.2050393 16.39281 1.337143 0.5834115 15.66187 -4.550171 0.7038025 14.05291 -1.675819 -0.6191115 14.88748 -5.587517 -0.8975902 15.61604 -3.704464 -1.186425 12.57299 0.2998047 -1.017982 17.225 2.182854 -1.306808 14.18195 -0.6915093 0.01610255 13.34738 -2.574551 0.3049324 16.39043 1.278633 -0.4826616 15.68728 -4.608681 -0.3622741 14.07832 -1.595718 0.8402442 14.8527 0.5149078 -3.925536 16.55466 -1.808807 -3.317406 13.19331 1.159645 3.446671 16.71992 -1.164066 4.054801 13.35856 -0.5122757 0.3211046 13.14886 1.811436 -0.2870254 16.51022 0.5221863 3.725112 14.97083 -0.1225547 -3.647094 14.80558 1.173973 -0.00858283 14.76113 2.386162 -4.016958 16.31057 0.06244277 -3.408828 12.94921 3.030903 3.355245 16.47583 0.7071838 3.963383 13.11447 -0.589344 0.3248677 13.15891 1.734375 -0.2832677 16.52027 1.34465 3.684931 14.86355 0.6999054 -3.687278 14.6983 0.04811096 0.04642575 14.90799</float_array>
          <technique_common>
            <accessor source="#Circle_007-mesh-positions-array" count="180" stride="3">
              <param name="X" type="float"/>
              <param name="Y" type="float"/>
              <param name="Z" type="float"/>
            </accessor>
          </technique_common>
        </source>
        <source id="Circle_007-mesh-normals">
          <float_array id="Circle_007-mesh-normals-array" count="540">0.9733344 0.2166831 0.07528972 0.7829456 0.4424707 -0.4372825 0.8455446 0.5312541 -0.05313456 0.8817033 0.3423047 0.3246951 0.8236578 0.5443747 0.158884 0.8233143 -0.08212691 0.5616129 0.9685912 -0.1313551 0.2111325 0.9841518 0.06326621 -0.1656581 -0.9733344 -0.2166831 -0.07528972 -0.8233143 0.08212691 -0.5616129 -0.8817033 -0.3423047 -0.3246951 -0.9841518 -0.06326621 0.1656581 -0.9685912 0.1313551 -0.2111325 -0.7829456 -0.4424707 0.4372825 -0.8455446 -0.5312541 0.05313456 -0.8236578 -0.5443747 -0.158884 -0.02188235 0.2527615 -0.9672812 -0.2070139 0.3169758 -0.9255656 -0.0358597 0.3561864 -0.9337266 -0.2294453 0.4138745 -0.8809443 -0.04687798 0.4443643 -0.8946188 0.1363608 0.4595006 -0.8776475 0.1399905 0.361131 -0.9219475 0.0358597 -0.3561864 0.9337266 -0.1363608 -0.4595006 0.8776475 0.04687798 -0.4443643 0.8946188 0.02188235 -0.2527615 0.9672812 -0.1399905 -0.361131 0.9219475 0.2070139 -0.3169758 0.9255656 0.1851308 -0.2282548 0.955838 0.2294453 -0.4138745 0.8809443 0.001403868 0.9971607 0.07529133 -0.2605128 0.8607664 -0.4372805 -0.3334783 0.9412593 -0.05313313 -0.1411808 0.9352238 0.3246915 -0.3510608 0.9227746 0.1588823 0.2602081 0.7854158 0.5616173 0.3399821 0.9164258 0.2111307 0.1534503 0.9741718 -0.165658 -0.001403868 -0.9971607 -0.07529133 -0.2602081 -0.7854158 -0.5616173 0.1411808 -0.9352238 -0.3246915 -0.1534503 -0.9741718 0.165658 -0.3399821 -0.9164258 -0.2111307 0.2605128 -0.8607664 0.4372805 0.3334783 -0.9412593 0.05313313 0.3510608 -0.9227746 -0.1588823 -0.2514194 0.03390711 -0.9672842 -0.3545764 -0.1326686 -0.9255672 -0.355395 0.04287934 -0.9337322 -0.454036 -0.1333999 -0.8809403 -0.4438731 0.05142503 -0.894613 -0.4185443 0.2335656 -0.877649 -0.3217623 0.2155866 -0.9219499 0.355395 -0.04287934 0.9337322 0.4185443 -0.2335656 0.877649 0.4438731 -0.05142503 0.894613 0.2514194 -0.03390711 0.9672842 0.3217623 -0.2155866 0.9219499 0.3545764 0.1326686 0.9255672 0.2632013 0.1307156 0.9558444 0.454036 0.1333999 0.8809403 -0.005462884 -0.9971467 0.07529032 0.257 -0.8618244 -0.4372754 0.3296363 -0.9426117 -0.05313366 0.1373683 -0.9357894 0.3246971 0.3472753 -0.9242059 0.1588817 -0.2633841 -0.7843534 0.5616214 -0.3437367 -0.9150239 0.2111312 -0.157419 -0.9735381 -0.1656593 0.005462884 0.9971467 -0.07529032 0.2633841 0.7843534 -0.5616214 -0.1373683 0.9357894 -0.3246971 0.157419 0.9735381 0.1656593 0.3437367 0.9150239 -0.2111312 -0.257 0.8618244 0.4372754 -0.3296363 0.9426117 0.05313366 -0.3472753 0.9242059 -0.1588817 0.2512677 -0.03491437 -0.9672878 0.3551238 0.1312334 -0.925562 0.3552123 -0.0443443 -0.9337333 0.454584 0.1315379 -0.8809377 0.4436597 -0.05322569 -0.8946135 0.4175961 -0.2352735 -0.8776445 0.3209048 -0.2168968 -0.9219413 -0.3552123 0.0443443 0.9337333 -0.4175961 0.2352735 0.8776445 -0.4436597 0.05322569 0.8946135 -0.2512677 0.03491437 0.9672878 -0.3208774 0.216899 0.9219505 -0.3551238 -0.1312334 0.925562 -0.2637492 -0.1296467 0.955839 -0.454584 -0.1315379 0.8809377 -0.9595581 -0.2712557 0.07529115 -0.7567356 -0.4859344 -0.437286 -0.8142181 -0.5781226 -0.05313366 -0.8609857 -0.3915042 0.324697 -0.7916398 -0.5899684 0.1588834 -0.8266384 0.03552412 0.5616111 -0.9744618 0.07647979 0.2111282 -0.9790119 -0.118718 -0.1656559 0.9595581 0.2712557 -0.07529115 0.8266384 -0.03552412 -0.5616111 0.8609857 0.3915042 -0.324697 0.9790119 0.118718 0.1656559 0.9744618 -0.07647979 -0.2111282 0.7567356 0.4859344 0.437286 0.8142181 0.5781226 0.05313366 0.7916398 0.5899684 -0.1588834 0.0361045 -0.2511141 -0.967284 0.2245624 -0.3047981 -0.9255647 0.05588024 -0.3535931 -0.9337287 0.252456 -0.4002612 -0.8809409 0.0718736 -0.441008 -0.8946207 -0.1102361 -0.4664589 -0.8776471 -0.1193901 -0.3684554 -0.9219473 -0.05588024 0.3535931 0.9337287 0.1102361 0.4664589 0.8776471 -0.0718736 0.441008 0.8946207 -0.0361045 0.2511141 0.967284 0.1193901 0.3684554 0.9219473 -0.2245624 0.3047981 0.9255647 -0.1977064 0.217422 0.9558452 -0.252456 0.4002612 0.8809409 0.1224143 -0.9589275 -0.2558767 0.3159636 -0.9256729 0.2080788 -0.04452782 -0.9973451 0.0576207 0.1818357 -0.812401 0.5540221 -0.1954447 -0.9049235 0.3780408 -0.3964129 -0.9142309 -0.08389705 -0.4569623 -0.8667116 0.1999915 -0.2576081 -0.8498231 -0.4598249 0.3963872 0.914242 0.08389806 0.1954447 0.9049235 -0.3780408 0.04452782 0.9973451 -0.0576207 0.2576081 0.8498231 0.4598249 -0.1224107 0.95893 0.2558693 -0.3159636 0.9256729 -0.2080788 -0.3860642 0.9194737 0.07431352 -0.1818357 0.812401 -0.5540221 0.6873849 -0.03253346 -0.7255644 0.8229153 0.1740195 -0.5408584 0.84031 -0.05356079 -0.5394538 0.9330347 0.1803383 -0.3113269 0.9315671 -0.08609455 -0.3532289 0.776019 -0.2834039 -0.5634508 0.8741242 -0.3159629 -0.3688827 -0.776019 0.2834039 0.5634508 -0.9315771 0.08609545 0.3532021 -0.8403087 0.05359125 0.5394529 -0.6873849 0.03253346 0.7255644 -0.8229153 -0.1740195 0.5408584 -0.6983186 -0.1610518 0.6974335 -0.9330347 -0.1803383 0.3113269 0.988588 -0.1506443 4.88312e-4 -0.9885834 0.1506741 -4.8831e-4 -0.1851308 0.2282548 -0.955838 0.1418541 0.2703101 -0.9522657 -0.1418541 -0.2703101 0.9522657 0.3632046 0.9317094 4.88301e-4 -0.3632046 -0.9317094 -4.88301e-4 -0.2632013 -0.1307156 -0.9558444 -0.2327705 0.1975207 -0.9522624 0.2327705 -0.1975207 0.9522624 -0.3669928 -0.9302237 4.88306e-4 0.3670192 0.9302133 -4.88301e-4 0.2637492 0.1296467 -0.955839 0.2319474 -0.1984676 -0.9522663 -0.2319474 0.1984676 0.9522663 -0.9955114 0.09464055 4.8831e-4 0.9955114 -0.09464055 -4.8831e-4 0.1977064 -0.217422 -0.9558452 -0.1263497 -0.2779084 -0.9522619 0.1263497 0.2779084 0.9522619 0.3860642 -0.9194737 -0.07431352 0.4569623 0.8667116 -0.1999915 0.6983186 0.1610518 -0.6974335 0.6461905 -0.2391207 -0.7247478 -0.8741242 0.3159629 0.3688827 -0.6461905 0.2391207 0.7247478</float_array>
          <technique_common>
            <accessor source="#Circle_007-mesh-normals-array" count="180" stride="3">
              <param name="X" type="float"/>
              <param name="Y" type="float"/>
              <param name="Z" type="float"/>
            </accessor>
          </technique_common>
        </source>
        <source id="Circle_007-mesh-map-0">
          <float_array id="Circle_007-mesh-map-0-array" count="960">0.4999998 0.5 0.9998998 9.998e-5 0.9998998 0.5 0.4999998 0.9999001 0.9998998 0.5 0.9998998 0.9999001 9.998e-5 0.9999001 0.4999998 0.5 0.4999998 0.9999001 9.998e-5 0.5 0.4999998 9.998e-5 0.4999998 0.5 0.4999998 0.5 0.9998998 9.998e-5 0.4999998 9.998e-5 0.4999998 0.9999001 0.9998998 0.5 0.4999998 0.5 9.998e-5 0.9999001 0.4999998 0.5 9.998e-5 0.5 9.998e-5 0.5 0.4999998 9.998e-5 9.998e-5 9.998e-5 0.4999998 9.998e-5 0.9998998 0.5 0.4999998 0.5 0.4999998 0.5 0.9998998 0.9999001 0.4999998 0.9999001 9.998e-5 0.9999001 0.4999998 0.5 0.4999998 0.9999001 9.998e-5 0.5 0.4999998 9.998e-5 0.4999998 0.5 0.4999998 0.5 0.9998998 9.998e-5 0.4999998 9.998e-5 0.4999998 0.9999001 0.9998998 0.5 0.4999998 0.5 0.4999998 0.9999001 9.998e-5 0.5 9.998e-5 0.9999001 0.4999998 0.5 9.998e-5 9.998e-5 9.998e-5 0.5 0.4999998 0.5 0.9998998 9.998e-5 0.9998998 0.5 0.4999998 0.9999001 0.9998998 0.5 0.9998998 0.9999001 9.998e-5 0.9999001 0.4999998 0.5 0.4999998 0.9999001 9.998e-5 0.5 0.4999998 9.998e-5 0.4999998 0.5 0.4999998 0.5 0.9998998 9.998e-5 0.4999998 9.998e-5 0.4999998 0.9999001 0.9998998 0.5 0.4999998 0.5 9.998e-5 0.9999001 0.4999998 0.5 9.998e-5 0.5 9.998e-5 0.5 0.4999998 9.998e-5 9.998e-5 9.998e-5 0.4999998 9.998e-5 0.9998998 0.5 0.4999998 0.5 0.4999998 0.5 0.9998998 0.9999001 0.4999998 0.9999001 9.998e-5 0.9999001 0.4999998 0.5 0.4999998 0.9999001 9.998e-5 0.5 0.4999998 9.998e-5 0.4999998 0.5 0.4999998 0.5 0.9998998 9.998e-5 0.4999998 9.998e-5 0.4999998 0.9999001 0.9998998 0.5 0.4999998 0.5 0.4999998 0.9999001 9.998e-5 0.5 9.998e-5 0.9999001 0.4999998 0.5 9.998e-5 9.998e-5 9.998e-5 0.5 0.4999998 0.5 0.9998998 9.998e-5 0.9998998 0.5 0.4999998 0.9999001 0.9998998 0.5 0.9998998 0.9999001 9.998e-5 0.9999001 0.4999998 0.5 0.4999998 0.9999001 9.998e-5 0.5 0.4999998 9.998e-5 0.4999998 0.5 0.4999998 0.5 0.9998998 9.998e-5 0.4999998 9.998e-5 0.4999998 0.9999001 0.9998998 0.5 0.4999998 0.5 9.998e-5 0.9999001 0.4999998 0.5 9.998e-5 0.5 9.998e-5 0.5 0.4999998 9.998e-5 9.998e-5 9.998e-5 0.4999998 9.998e-5 0.9998998 0.5 0.4999998 0.5 0.4999998 0.5 0.9998998 0.9999001 0.4999998 0.9999001 9.998e-5 0.9999001 0.4999998 0.5 0.4999998 0.9999001 9.998e-5 0.5 0.4999998 9.998e-5 0.4999998 0.5 0.4999998 0.5 0.9998998 9.998e-5 0.4999998 9.998e-5 0.4999998 0.9999001 0.9998998 0.5 0.4999998 0.5 0.4999998 0.9999001 9.998e-5 0.5 9.998e-5 0.9999001 0.4999998 0.5 9.998e-5 9.998e-5 9.998e-5 0.5 0.4999998 0.5 0.9998998 9.998e-5 0.9998998 0.5 0.4999998 0.9999001 0.9998998 0.5 0.9998998 0.9999001 9.998e-5 0.9999001 0.4999998 0.5 0.4999998 0.9999001 9.998e-5 0.5 0.4999998 9.998e-5 0.4999998 0.5 0.4999998 0.5 0.9998998 9.998e-5 0.4999998 9.998e-5 0.4999998 0.9999001 0.9998998 0.5 0.4999998 0.5 9.998e-5 0.9999001 0.4999998 0.5 9.998e-5 0.5 9.998e-5 0.5 0.4999998 9.998e-5 9.998e-5 9.998e-5 0.4999998 9.998e-5 0.9998998 0.5 0.4999998 0.5 0.4999998 0.5 0.9998998 0.9999001 0.4999998 0.9999001 9.998e-5 0.9999001 0.4999998 0.5 0.4999998 0.9999001 9.998e-5 0.5 0.4999998 9.998e-5 0.4999998 0.5 0.4999998 0.5 0.9998998 9.998e-5 0.4999998 9.998e-5 0.4999998 0.9999001 0.9998998 0.5 0.4999998 0.5 0.4999998 0.9999001 9.998e-5 0.5 9.998e-5 0.9999001 0.4999998 0.5 9.998e-5 9.998e-5 9.998e-5 0.5 0.4999998 9.998e-5 0.9998998 0.5 0.4999998 0.5 0.4999998 0.5 0.9998998 0.9999001 0.4999998 0.9999001 9.998e-5 0.5 0.4999998 0.9999001 9.998e-5 0.9999001 9.998e-5 9.998e-5 0.4999998 0.5 9.998e-5 0.5 0.9998998 0.5 0.4999998 9.998e-5 0.4999998 0.5 0.9998998 0.9999001 0.4999998 0.5 0.4999998 0.9999001 0.4999998 0.9999001 9.998e-5 0.5 9.998e-5 0.9999001 0.4999998 0.5 9.998e-5 9.998e-5 9.998e-5 0.5 0.4999998 9.998e-5 0.9998998 0.5 0.4999998 0.5 0.4999998 0.5 0.9998998 0.9999001 0.4999998 0.9999001 9.998e-5 0.5 0.4999998 0.9999001 9.998e-5 0.9999001 9.998e-5 0.5 0.4999998 9.998e-5 0.4999998 0.5 0.9998998 0.5 0.4999998 9.998e-5 0.4999998 0.5 0.4999998 0.9999001 0.9998998 0.5 0.4999998 0.5 0.4999998 0.9999001 9.998e-5 0.5 9.998e-5 0.9999001 0.4999998 0.5 9.998e-5 9.998e-5 9.998e-5 0.5 0.4999998 0.5 0.4999998 9.998e-5 0.9998998 9.998e-5 0.4999998 0.9999001 0.4999998 0.5 0.9998998 0.5 9.998e-5 0.9999001 9.998e-5 0.5 0.4999998 0.5 9.998e-5 0.5 9.998e-5 9.998e-5 0.4999998 9.998e-5 0.4999998 0.5 0.9998998 0.5 0.9998998 9.998e-5 0.4999998 0.9999001 0.9998998 0.9999001 0.9998998 0.5 9.998e-5 0.9999001 0.4999998 0.9999001 0.4999998 0.5 9.998e-5 0.5 0.4999998 0.5 0.4999998 9.998e-5 0.4999998 9.998e-5 0.9998998 9.998e-5 0.9998998 0.5 0.4999998 0.5 0.9998998 0.5 0.9998998 0.9999001 9.998e-5 0.9999001 9.998e-5 0.5 0.4999998 0.5 9.998e-5 0.5 9.998e-5 9.998e-5 0.4999998 9.998e-5 0.4999998 0.5 0.9998998 0.5 0.9998998 9.998e-5 0.4999998 0.9999001 0.9998998 0.9999001 0.9998998 0.5 0.4999998 0.9999001 0.4999998 0.5 9.998e-5 0.5 0.4999998 0.5 0.4999998 9.998e-5 9.998e-5 9.998e-5 0.4999998 0.5 0.4999998 9.998e-5 0.9998998 9.998e-5 0.4999998 0.9999001 0.4999998 0.5 0.9998998 0.5 9.998e-5 0.9999001 9.998e-5 0.5 0.4999998 0.5 9.998e-5 0.5 9.998e-5 9.998e-5 0.4999998 9.998e-5 0.4999998 0.5 0.9998998 0.5 0.9998998 9.998e-5 0.4999998 0.9999001 0.9998998 0.9999001 0.9998998 0.5 9.998e-5 0.9999001 0.4999998 0.9999001 0.4999998 0.5 9.998e-5 0.5 0.4999998 0.5 0.4999998 9.998e-5 0.4999998 9.998e-5 0.9998998 9.998e-5 0.9998998 0.5 0.4999998 0.5 0.9998998 0.5 0.9998998 0.9999001 9.998e-5 0.9999001 9.998e-5 0.5 0.4999998 0.5 9.998e-5 0.5 9.998e-5 9.998e-5 0.4999998 9.998e-5 0.4999998 0.5 0.9998998 0.5 0.9998998 9.998e-5 0.4999998 0.9999001 0.9998998 0.9999001 0.9998998 0.5 0.4999998 0.9999001 0.4999998 0.5 9.998e-5 0.5 0.4999998 0.5 0.4999998 9.998e-5 9.998e-5 9.998e-5 0.4999998 0.5 0.4999998 9.998e-5 0.9998998 9.998e-5 0.4999998 0.9999001 0.4999998 0.5 0.9998998 0.5 9.998e-5 0.9999001 9.998e-5 0.5 0.4999998 0.5 9.998e-5 0.5 9.998e-5 9.998e-5 0.4999998 9.998e-5 0.4999998 0.5 0.9998998 0.5 0.9998998 9.998e-5 0.4999998 0.9999001 0.9998998 0.9999001 0.9998998 0.5 9.998e-5 0.9999001 0.4999998 0.9999001 0.4999998 0.5 9.998e-5 0.5 0.4999998 0.5 0.4999998 9.998e-5 0.4999998 9.998e-5 0.9998998 9.998e-5 0.9998998 0.5 0.4999998 0.5 0.9998998 0.5 0.9998998 0.9999001 9.998e-5 0.9999001 9.998e-5 0.5 0.4999998 0.5 9.998e-5 0.5 9.998e-5 9.998e-5 0.4999998 9.998e-5 0.4999998 0.5 0.9998998 0.5 0.9998998 9.998e-5 0.4999998 0.9999001 0.9998998 0.9999001 0.9998998 0.5 0.4999998 0.9999001 0.4999998 0.5 9.998e-5 0.5 0.4999998 0.5 0.4999998 9.998e-5 9.998e-5 9.998e-5 0.4999998 0.5 0.4999998 9.998e-5 0.9998998 9.998e-5 0.4999998 0.9999001 0.4999998 0.5 0.9998998 0.5 9.998e-5 0.9999001 9.998e-5 0.5 0.4999998 0.5 9.998e-5 0.5 9.998e-5 9.998e-5 0.4999998 9.998e-5 0.4999998 0.5 0.9998998 0.5 0.9998998 9.998e-5 0.4999998 0.9999001 0.9998998 0.9999001 0.9998998 0.5 9.998e-5 0.9999001 0.4999998 0.9999001 0.4999998 0.5 9.998e-5 0.5 0.4999998 0.5 0.4999998 9.998e-5 0.4999998 9.998e-5 0.9998998 9.998e-5 0.9998998 0.5 0.4999998 0.5 0.9998998 0.5 0.9998998 0.9999001 9.998e-5 0.9999001 9.998e-5 0.5 0.4999998 0.5 9.998e-5 0.5 9.998e-5 9.998e-5 0.4999998 9.998e-5 0.4999998 0.5 0.9998998 0.5 0.9998998 9.998e-5 0.4999998 0.9999001 0.9998998 0.9999001 0.9998998 0.5 0.4999998 0.9999001 0.4999998 0.5 9.998e-5 0.5 0.4999998 0.5 0.4999998 9.998e-5 9.998e-5 9.998e-5 0.4999998 9.998e-5 0.9998998 9.998e-5 0.9998998 0.5 0.4999998 0.5 0.9998998 0.5 0.9998998 0.9999001 9.998e-5 0.5 0.4999998 0.5 0.4999998 0.9999001 9.998e-5 9.998e-5 0.4999998 9.998e-5 0.4999998 0.5 0.9998998 0.5 0.9998998 9.998e-5 0.4999998 9.998e-5 0.9998998 0.9999001 0.9998998 0.5 0.4999998 0.5 0.4999998 0.9999001 0.4999998 0.5 9.998e-5 0.5 0.4999998 0.5 0.4999998 9.998e-5 9.998e-5 9.998e-5 0.4999998 9.998e-5 0.9998998 9.998e-5 0.9998998 0.5 0.4999998 0.5 0.9998998 0.5 0.9998998 0.9999001 9.998e-5 0.5 0.4999998 0.5 0.4999998 0.9999001 9.998e-5 0.5 9.998e-5 9.998e-5 0.4999998 9.998e-5 0.9998998 0.5 0.9998998 9.998e-5 0.4999998 9.998e-5 0.4999998 0.9999001 0.9998998 0.9999001 0.9998998 0.5 0.4999998 0.9999001 0.4999998 0.5 9.998e-5 0.5 0.4999998 0.5 0.4999998 9.998e-5 9.998e-5 9.998e-5</float_array>
          <technique_common>
            <accessor source="#Circle_007-mesh-map-0-array" count="480" stride="2">
              <param name="S" type="float"/>
              <param name="T" type="float"/>
            </accessor>
          </technique_common>
        </source>
        <vertices id="Circle_007-mesh-vertices">
          <input semantic="POSITION" source="#Circle_007-mesh-positions"/>
        </vertices>
        <triangles count="160">
          <input semantic="VERTEX" source="#Circle_007-mesh-vertices" offset="0"/>
          <input semantic="NORMAL" source="#Circle_007-mesh-normals" offset="1"/>
          <input semantic="TEXCOORD" source="#Circle_007-mesh-map-0" offset="2" set="0"/>
          <p>8 0 0 3 1 1 6 2 2 5 3 3 6 2 4 2 4 5 0 5 6 8 0 7 5 3 8 7 6 9 4 7 10 8 0 11 17 8 12 12 9 13 13 10 14 14 11 15 15 12 16 17 8 17 9 13 18 17 8 19 16 14 20 16 14 21 13 10 22 10 15 23 22 16 24 24 17 25 26 18 26 26 18 27 20 19 28 23 20 29 18 21 30 26 18 31 23 20 32 25 22 33 22 16 34 26 18 35 35 23 36 30 24 37 31 25 38 32 26 39 33 27 40 35 23 41 32 26 42 34 28 43 27 29 44 35 23 45 28 30 46 34 28 47 44 31 48 39 32 49 42 33 50 41 34 51 42 33 52 38 35 53 36 36 54 44 31 55 41 34 56 43 37 57 40 38 58 44 31 59 53 39 60 48 40 61 49 41 62 50 42 63 51 43 64 53 39 65 45 44 66 53 39 67 52 45 68 52 45 69 49 41 70 46 46 71 58 47 72 60 48 73 62 49 74 62 49 75 56 50 76 59 51 77 54 52 78 62 49 79 59 51 80 61 53 81 58 47 82 62 49 83 71 54 84 66 55 85 67 56 86 68 57 87 69 58 88 71 54 89 68 57 90 70 59 91 63 60 92 71 54 93 64 61 94 70 59 95 80 62 96 75 63 97 78 64 98 77 65 99 78 64 100 74 66 101 72 67 102 80 62 103 77 65 104 79 68 105 76 69 106 80 62 107 89 70 108 84 71 109 85 72 110 86 73 111 87 74 112 89 70 113 81 75 114 89 70 115 88 76 116 88 76 117 85 72 118 82 77 119 94 78 120 96 79 121 98 80 122 98 80 123 92 81 124 95 82 125 90 83 126 98 80 127 95 82 128 97 84 129 94 78 130 98 80 131 107 85 132 102 86 133 103 87 134 104 88 135 105 89 136 107 85 137 104 88 138 106 90 139 99 91 140 107 85 141 100 92 142 106 90 143 116 93 144 111 94 145 114 95 146 113 96 147 114 95 148 110 97 149 108 98 150 116 93 151 113 96 152 115 99 153 112 100 154 116 93 155 125 101 156 120 102 157 121 103 158 122 104 159 123 105 160 125 101 161 117 106 162 125 101 163 124 107 164 124 107 165 121 103 166 118 108 167 130 109 168 132 110 169 134 111 170 134 111 171 128 112 172 131 113 173 126 114 174 134 111 175 131 113 176 133 115 177 130 109 178 134 111 179 143 116 180 138 117 181 139 118 182 140 119 183 141 120 184 143 116 185 140 119 186 142 121 187 135 122 188 143 116 189 136 123 190 142 121 191 148 124 192 150 125 193 152 126 194 152 126 195 146 127 196 149 128 197 151 129 198 149 128 199 144 130 200 145 131 201 152 126 202 151 129 203 159 132 204 157 133 205 161 134 206 155 135 207 161 134 208 158 136 209 158 136 210 160 137 211 153 138 212 161 134 213 154 139 214 160 137 215 166 140 216 168 141 217 170 142 218 170 142 219 164 143 220 167 144 221 169 145 222 167 144 223 162 146 224 169 145 225 166 140 226 170 142 227 177 147 228 175 148 229 179 149 230 176 150 231 177 147 232 179 149 233 176 150 234 178 151 235 171 152 236 179 149 237 172 153 238 178 151 239 8 0 240 4 7 241 3 1 242 5 3 243 8 0 244 6 2 245 0 5 246 7 6 247 8 0 248 7 6 249 1 154 250 4 7 251 17 8 252 15 12 253 12 9 254 14 11 255 11 155 256 15 12 257 9 13 258 14 11 259 17 8 260 16 14 261 17 8 262 13 10 263 22 16 264 21 156 265 24 17 266 26 18 267 24 17 268 20 19 269 18 21 270 25 22 271 26 18 272 25 22 273 19 157 274 22 16 275 35 23 276 33 27 277 30 24 278 32 26 279 29 158 280 33 27 281 32 26 282 35 23 283 34 28 284 35 23 285 31 25 286 28 30 287 44 31 288 40 38 289 39 32 290 41 34 291 44 31 292 42 33 293 36 36 294 43 37 295 44 31 296 43 37 297 37 159 298 40 38 299 53 39 300 51 43 301 48 40 302 50 42 303 47 160 304 51 43 305 45 44 306 50 42 307 53 39 308 52 45 309 53 39 310 49 41 311 58 47 312 57 161 313 60 48 314 62 49 315 60 48 316 56 50 317 54 52 318 61 53 319 62 49 320 61 53 321 55 162 322 58 47 323 71 54 324 69 58 325 66 55 326 68 57 327 65 163 328 69 58 329 68 57 330 71 54 331 70 59 332 71 54 333 67 56 334 64 61 335 80 62 336 76 69 337 75 63 338 77 65 339 80 62 340 78 64 341 72 67 342 79 68 343 80 62 344 79 68 345 73 164 346 76 69 347 89 70 348 87 74 349 84 71 350 86 73 351 83 165 352 87 74 353 81 75 354 86 73 355 89 70 356 88 76 357 89 70 358 85 72 359 94 78 360 93 166 361 96 79 362 98 80 363 96 79 364 92 81 365 90 83 366 97 84 367 98 80 368 97 84 369 91 167 370 94 78 371 107 85 372 105 89 373 102 86 374 104 88 375 101 168 376 105 89 377 104 88 378 107 85 379 106 90 380 107 85 381 103 87 382 100 92 383 116 93 384 112 100 385 111 94 386 113 96 387 116 93 388 114 95 389 108 98 390 115 99 391 116 93 392 115 99 393 109 169 394 112 100 395 125 101 396 123 105 397 120 102 398 122 104 399 119 170 400 123 105 401 117 106 402 122 104 403 125 101 404 124 107 405 125 101 406 121 103 407 130 109 408 129 171 409 132 110 410 134 111 411 132 110 412 128 112 413 126 114 414 133 115 415 134 111 416 133 115 417 127 172 418 130 109 419 143 116 420 141 120 421 138 117 422 140 119 423 137 173 424 141 120 425 140 119 426 143 116 427 142 121 428 143 116 429 139 118 430 136 123 431 148 124 432 147 174 433 150 125 434 152 126 435 150 125 436 146 127 437 151 129 438 152 126 439 149 128 440 145 131 441 148 124 442 152 126 443 159 132 444 156 175 445 157 133 446 155 135 447 159 132 448 161 134 449 158 136 450 161 134 451 160 137 452 161 134 453 157 133 454 154 139 455 166 140 456 165 176 457 168 141 458 170 142 459 168 141 460 164 143 461 169 145 462 170 142 463 167 144 464 169 145 465 163 177 466 166 140 467 177 147 468 174 178 469 175 148 470 176 150 471 173 179 472 177 147 473 176 150 474 179 149 475 178 151 476 179 149 477 175 148 478 172 153 479</p>
        </triangles>
      </mesh>
    </geometry>
  </library_geometries>
  <library_controllers/>
  <library_visual_scenes>
    <visual_scene id="Scene" name="Scene">
      <node id="Circle_007" name="Circle_007" type="NODE">
        <matrix sid="transform">1 0 0 0 0 1 0 0 0 0 1 0 0 0 0 1</matrix>
        <instance_geometry url="#Circle_007-mesh" name="Circle_007"/>
      </node>
    </visual_scene>
  </library_visual_scenes>
  <scene>
    <instance_visual_scene url="#Scene"/>
  </scene>
</COLLADA>