{
  "luis_schema_version": "4.0.0",
  "versionId": "1.0",
  "name": "Skill_Croma",
  "desc": "",
  "culture": "en-us",
  "tokenizerVersion": "1.0.0",
  "intents": [
    {
      "name": "CromaDidNotEarnPoints"
    },
    {
      "name": "CromaEarnedLessPoints"
    },
    {
      "name": "CromaLockedPoints"
    },
    {
      "name": "CromaMissingPoints"
    },
    {
      "name": "CromaRefund"
    },
    {
      "name": "DoNotRemember"
    },
    {
      "name": "ExtractCromaStoreLocation"
    },
    {
      "name": "None"
    },
    {
      "name": "OrderNotDisplayed"
    }
  ],
  "entities": [],
  "composites": [],
  "closedLists": [
    {
      "name": "Brand",
      "subLists": [
        {
          "canonicalForm": "Croma",
          "list": [
            "Chroma",
            "Chrom",
            "Crom"
          ]
        },
        {
          "canonicalForm": "CliQ",
          "list": [
            "tata cliq"
          ]
        },
        {
          "canonicalForm": "BigBasket",
          "list": [
            "BB"
          ]
        },
        {
          "canonicalForm": "Taj",
          "list": []
        },
        {
          "canonicalForm": "Qmin",
          "list": []
        },
        {
          "canonicalForm": "Air Asia",
          "list": [
            "airasia"
          ]
        },
        {
          "canonicalForm": "U Points",
          "list": []
        },
        {
          "canonicalForm": "CliQ Luxury",
          "list": [
            "tata cliq luxury",
            "luxury cliq"
          ]
        }
      ],
      "roles": []
    },
    {
      "name": "CromaStoreLocation",
      "subLists": [
        {
          "canonicalForm": "neptune mall",
          "list": [
            "indraprastha equinox",
            "ecil"
          ]
        }
      ],
      "roles": []
    }
  ],
  "patternAnyEntities": [],
  "regex_entities": [],
  "prebuiltEntities": [
    {
      "name": "datetimeV2",
      "roles": []
    }
  ],
  "model_features": [],
  "regex_features": [],
  "patterns": [
    {
      "pattern": "croma near {CromaStoreLocation}",
      "intent": "ExtractCromaStoreLocation"
    }
  ],
  "utterances": [
    {
      "text": "any reason, why i can not use my points ?",
      "intent": "CromaLockedPoints",
      "entities": []
    },
    {
      "text": "can i get the money in my big basket wallet transferred to my bank account?",
      "intent": "CromaRefund",
      "entities": []
    },
    {
      "text": "can you please check why my points are locked ?",
      "intent": "CromaLockedPoints",
      "entities": []
    },
    {
      "text": "can't see some of my points ?",
      "intent": "CromaDidNotEarnPoints",
      "entities": []
    },
    {
      "text": "cant see my order here",
      "intent": "OrderNotDisplayed",
      "entities": []
    },
    {
      "text": "croma near ecil",
      "intent": "ExtractCromaStoreLocation",
      "entities": []
    },
    {
      "text": "croma near indraprastha equinox",
      "intent": "ExtractCromaStoreLocation",
      "entities": []
    },
    {
      "text": "croma near neptune mall",
      "intent": "ExtractCromaStoreLocation",
      "entities": []
    },
    {
      "text": "croma points not usable",
      "intent": "CromaLockedPoints",
      "entities": []
    },
    {
      "text": "did not earn adequate points",
      "intent": "CromaEarnedLessPoints",
      "entities": []
    },
    {
      "text": "did not earn as many points as expected",
      "intent": "CromaEarnedLessPoints",
      "entities": []
    },
    {
      "text": "did not earn enough points",
      "intent": "CromaEarnedLessPoints",
      "entities": []
    },
    {
      "text": "did not earn points",
      "intent": "CromaDidNotEarnPoints",
      "entities": []
    },
    {
      "text": "did not earn points for my order",
      "intent": "CromaDidNotEarnPoints",
      "entities": []
    },
    {
      "text": "did not get loyalty points",
      "intent": "CromaDidNotEarnPoints",
      "entities": []
    },
    {
      "text": "did not get my croma loyalty points",
      "intent": "CromaDidNotEarnPoints",
      "entities": []
    },
    {
      "text": "did not get my croma point",
      "intent": "CromaDidNotEarnPoints",
      "entities": []
    },
    {
      "text": "did not get points",
      "intent": "CromaDidNotEarnPoints",
      "entities": []
    },
    {
      "text": "didn't earn points for order placed 5 days ago",
      "intent": "CromaDidNotEarnPoints",
      "entities": []
    },
    {
      "text": "don't remember",
      "intent": "DoNotRemember",
      "entities": []
    },
    {
      "text": "don't remember the date",
      "intent": "DoNotRemember",
      "entities": []
    },
    {
      "text": "don't see points for order placed 2 weeks ago",
      "intent": "CromaMissingPoints",
      "entities": []
    },
    {
      "text": "don't see points on croma",
      "intent": "CromaMissingPoints",
      "entities": []
    },
    {
      "text": "dont think my order is there",
      "intent": "OrderNotDisplayed",
      "entities": []
    },
    {
      "text": "earned fewer points than expected",
      "intent": "CromaEarnedLessPoints",
      "entities": []
    },
    {
      "text": "earned less croma loyalty points",
      "intent": "CromaEarnedLessPoints",
      "entities": []
    },
    {
      "text": "earned less point",
      "intent": "CromaEarnedLessPoints",
      "entities": []
    },
    {
      "text": "earned less points",
      "intent": "CromaEarnedLessPoints",
      "entities": []
    },
    {
      "text": "few point less",
      "intent": "CromaEarnedLessPoints",
      "entities": []
    },
    {
      "text": "fewer points than expected",
      "intent": "CromaEarnedLessPoints",
      "entities": []
    },
    {
      "text": "fewer points than promised",
      "intent": "CromaEarnedLessPoints",
      "entities": []
    },
    {
      "text": "forgot the date",
      "intent": "DoNotRemember",
      "entities": []
    },
    {
      "text": "help with my locked points",
      "intent": "CromaLockedPoints",
      "entities": []
    },
    {
      "text": "hey, where can i find my loyalty points from recent purchase. i can not see them",
      "intent": "CromaDidNotEarnPoints",
      "entities": []
    },
    {
      "text": "i am having trouble using my points today !",
      "intent": "CromaLockedPoints",
      "entities": []
    },
    {
      "text": "i am not sure",
      "intent": "DoNotRemember",
      "entities": []
    },
    {
      "text": "i am trying to redeem loyalty points and not able to use",
      "intent": "CromaLockedPoints",
      "entities": []
    },
    {
      "text": "i am unhappy about my missing points",
      "intent": "CromaDidNotEarnPoints",
      "entities": []
    },
    {
      "text": "i bought an air conditioner last month at croma. but when i checked today, i could not see any loyalty points in my account.",
      "intent": "CromaDidNotEarnPoints",
      "entities": []
    },
    {
      "text": "i bought an iphone and samsung tv last month. i do not see points for these purchase.",
      "intent": "CromaDidNotEarnPoints",
      "entities": []
    },
    {
      "text": "i bought an iphone and samsung tv last month. i see that only iphone loyalty points are credited but not on samsung tv.",
      "intent": "CromaDidNotEarnPoints",
      "entities": []
    },
    {
      "text": "i bought few things at croma recently and found out that some points are still locked, can you check",
      "intent": "CromaLockedPoints",
      "entities": []
    },
    {
      "text": "i bought some things from croma but my loyalty points for those purchases are missing",
      "intent": "CromaDidNotEarnPoints",
      "entities": []
    },
    {
      "text": "i cannot redeem my points",
      "intent": "CromaLockedPoints",
      "entities": []
    },
    {
      "text": "i cannot use my points",
      "intent": "CromaLockedPoints",
      "entities": []
    },
    {
      "text": "i checked my loyalty statement today and noticed missing points",
      "intent": "CromaDidNotEarnPoints",
      "entities": []
    },
    {
      "text": "i did not earn points for an order that i placed 2 days ago",
      "intent": "CromaDidNotEarnPoints",
      "entities": []
    },
    {
      "text": "i did not get points at all for the order that i placed 2 weeks ago",
      "intent": "CromaDidNotEarnPoints",
      "entities": []
    },
    {
      "text": "i do not have the invoice number",
      "intent": "DoNotRemember",
      "entities": []
    },
    {
      "text": "i don' t recall",
      "intent": "DoNotRemember",
      "entities": []
    },
    {
      "text": "i don't have it",
      "intent": "DoNotRemember",
      "entities": []
    },
    {
      "text": "i don't know",
      "intent": "DoNotRemember",
      "entities": []
    },
    {
      "text": "i don't see my points at all when i tried to order",
      "intent": "CromaDidNotEarnPoints",
      "entities": []
    },
    {
      "text": "i donot have order number",
      "intent": "DoNotRemember",
      "entities": []
    },
    {
      "text": "i dont have both order number and invoice number",
      "intent": "DoNotRemember",
      "entities": []
    },
    {
      "text": "i dont have the order number",
      "intent": "DoNotRemember",
      "entities": []
    },
    {
      "text": "i earned less croma points",
      "intent": "CromaEarnedLessPoints",
      "entities": []
    },
    {
      "text": "i earned less points for an order that i placed 2 days ago",
      "intent": "CromaEarnedLessPoints",
      "entities": []
    },
    {
      "text": "i earned less points for my order",
      "intent": "CromaEarnedLessPoints",
      "entities": []
    },
    {
      "text": "i have forgotten",
      "intent": "DoNotRemember",
      "entities": []
    },
    {
      "text": "i have issues with my points",
      "intent": "CromaMissingPoints",
      "entities": []
    },
    {
      "text": "i have missed points",
      "intent": "CromaDidNotEarnPoints",
      "entities": []
    },
    {
      "text": "i have missing points in my account",
      "intent": "CromaMissingPoints",
      "entities": []
    },
    {
      "text": "i have not received refund for my order yet",
      "intent": "CromaRefund",
      "entities": []
    },
    {
      "text": "i haven't received any loyalty points for some of my purchases",
      "intent": "CromaDidNotEarnPoints",
      "entities": []
    },
    {
      "text": "i haven't received any loyalty points for the last purchase.",
      "intent": "CromaDidNotEarnPoints",
      "entities": []
    },
    {
      "text": "i paid for the order by my hdfc account, can you send refund to my icici account?",
      "intent": "CromaRefund",
      "entities": []
    },
    {
      "text": "i paid for the repair of my product to the engineer, you were supposed to refund back that money, when will i get that money back?",
      "intent": "CromaRefund",
      "entities": []
    },
    {
      "text": "i purchased at croma store, to surprised, i have not earned any points",
      "intent": "CromaDidNotEarnPoints",
      "entities": []
    },
    {
      "text": "i purchased some items from the croma store, but i am surprised that my points did not move up",
      "intent": "CromaDidNotEarnPoints",
      "entities": []
    },
    {
      "text": "i returned a damaged item that i received, when will i get my refund for the same",
      "intent": "CromaRefund",
      "entities": []
    },
    {
      "text": "i returned an item and still waiting for the refund",
      "intent": "CromaRefund",
      "entities": []
    },
    {
      "text": "i think some of my points have been locked, can you check ?",
      "intent": "CromaLockedPoints",
      "entities": []
    },
    {
      "text": "i thought i had enough points to buy a fridge, there is something wrong while redeeming points",
      "intent": "CromaLockedPoints",
      "entities": []
    },
    {
      "text": "i tried to redeem my points and its not working",
      "intent": "CromaLockedPoints",
      "entities": []
    },
    {
      "text": "i walked into croma store and purchased some items, i am surprised, i did not get any points",
      "intent": "CromaDidNotEarnPoints",
      "entities": []
    },
    {
      "text": "i want my points to be refunded to my bank account, as i have returned the product.",
      "intent": "CromaRefund",
      "entities": []
    },
    {
      "text": "i was supposed to receive refund for 1 item from my big basket order which was of poor quality.",
      "intent": "CromaRefund",
      "entities": []
    },
    {
      "text": "i was trying to redeem my points and noticed some points are locked",
      "intent": "CromaLockedPoints",
      "entities": []
    },
    {
      "text": "issues with loyalty points",
      "intent": "CromaMissingPoints",
      "entities": []
    },
    {
      "text": "issues with my loyalty points",
      "intent": "CromaMissingPoints",
      "entities": []
    },
    {
      "text": "it doesnt have my order",
      "intent": "OrderNotDisplayed",
      "entities": []
    },
    {
      "text": "last month i bought a fridge at croma and still see that my points are frozen!",
      "intent": "CromaLockedPoints",
      "entities": []
    },
    {
      "text": "last month i purchased a samsung tv at croma and still do not see my loyal points in the account",
      "intent": "CromaDidNotEarnPoints",
      "entities": []
    },
    {
      "text": "less point",
      "intent": "CromaEarnedLessPoints",
      "entities": []
    },
    {
      "text": "loyalty points are locked for a recent order",
      "intent": "CromaLockedPoints",
      "entities": []
    },
    {
      "text": "missing some points",
      "intent": "CromaMissingPoints",
      "entities": []
    },
    {
      "text": "my cliq points are frozen",
      "intent": "CromaLockedPoints",
      "entities": []
    },
    {
      "text": "my croma points are locked",
      "intent": "CromaLockedPoints",
      "entities": []
    },
    {
      "text": "my loyalty points from recent purchase does not appear to be credited into my account",
      "intent": "CromaDidNotEarnPoints",
      "entities": []
    },
    {
      "text": "my order is not among these",
      "intent": "OrderNotDisplayed",
      "entities": []
    },
    {
      "text": "my order is not displayed here",
      "intent": "OrderNotDisplayed",
      "entities": []
    },
    {
      "text": "my order is not in that list",
      "intent": "OrderNotDisplayed",
      "entities": []
    },
    {
      "text": "my points are locked",
      "intent": "CromaLockedPoints",
      "entities": []
    },
    {
      "text": "my points are missing",
      "intent": "CromaMissingPoints",
      "entities": []
    },
    {
      "text": "my points are not available",
      "intent": "CromaMissingPoints",
      "entities": []
    },
    {
      "text": "my points are not showing from yesterday's iphone purchase at croma",
      "intent": "CromaDidNotEarnPoints",
      "entities": []
    },
    {
      "text": "my recent order receipt shows points for my purchase, but i can not use them, why",
      "intent": "CromaLockedPoints",
      "entities": []
    },
    {
      "text": "my return has been processed but i am yet to receive the refund",
      "intent": "CromaRefund",
      "entities": []
    },
    {
      "text": "no i dont have the invoice number",
      "intent": "DoNotRemember",
      "entities": []
    },
    {
      "text": "not enough point",
      "intent": "CromaEarnedLessPoints",
      "entities": []
    },
    {
      "text": "points are frozen",
      "intent": "CromaLockedPoints",
      "entities": []
    },
    {
      "text": "points are locked though return period has passed",
      "intent": "CromaLockedPoints",
      "entities": []
    },
    {
      "text": "points are missing",
      "intent": "CromaMissingPoints",
      "entities": []
    },
    {
      "text": "points earned was less",
      "intent": "CromaEarnedLessPoints",
      "entities": []
    },
    {
      "text": "points gotten are less",
      "intent": "CromaEarnedLessPoints",
      "entities": []
    },
    {
      "text": "points have not gotten credited at all",
      "intent": "CromaDidNotEarnPoints",
      "entities": []
    },
    {
      "text": "points locked for order places 1 week ago",
      "intent": "CromaLockedPoints",
      "entities": []
    },
    {
      "text": "points not given for my order",
      "intent": "CromaDidNotEarnPoints",
      "entities": []
    },
    {
      "text": "some points are missing",
      "intent": "CromaMissingPoints",
      "entities": []
    },
    {
      "text": "tell me the status of my refund",
      "intent": "CromaRefund",
      "entities": []
    },
    {
      "text": "what happened to my refund, i was supposed to receive it 1 week back",
      "intent": "CromaRefund",
      "entities": []
    },
    {
      "text": "when will i get refund for the item that i have returned?",
      "intent": "CromaRefund",
      "entities": []
    },
    {
      "text": "where are my points",
      "intent": "CromaMissingPoints",
      "entities": []
    },
    {
      "text": "while reviewing my loyalty membership points, noticed some points against few croma orders shown not available for use",
      "intent": "CromaLockedPoints",
      "entities": []
    },
    {
      "text": "why are my croma points locked from my recent orders ?",
      "intent": "CromaLockedPoints",
      "entities": []
    },
    {
      "text": "why don\u2019t i see points from my purchases at croma ?",
      "intent": "CromaDidNotEarnPoints",
      "entities": []
    },
    {
      "text": "why have you locked some of my points ?",
      "intent": "CromaLockedPoints",
      "entities": []
    },
    {
      "text": "why haven't i given points for all my purchases ?",
      "intent": "CromaDidNotEarnPoints",
      "entities": []
    },
    {
      "text": "why my refund has not been processed yet",
      "intent": "CromaRefund",
      "entities": []
    },
    {
      "text": "why there is so much delay in my refund?",
      "intent": "CromaRefund",
      "entities": []
    }
  ],
  "settings": []
}