{"numProblema":1,"enunciado":"Fes un programa que ens ajudi a calcular les dimensions d'una habitació.\nLlegeix l'amplada i la llargada en metres (enters) i mostra'n l'àrea.","inputPub":["Per l’entrada sempre rebreu dos nombres enters que representen amplada i llargada.","3 5","12 12"],"outputPub":["Per la sortida sempre haureu d’imprimir un altre enter amb l’àrea de l’habitació que heu rebut.","15","144"],"inputPriv":["26 20","24.5 11.3","13 6"],"outputPriv":["520","276.85","78"]}
{"numProblema":2,"enunciado":"Llegeix el diàmetre d'una pizza rodona i imprimeix la seva superfície.\nPots usar Math.PI per escriure el valor de Pi.","inputPub":["Per l’entrada rebreu un nombre decimal que representa el diàmetre d’una pizza.","38","55"],"outputPub":["Per la sortida sempre haureu d’imprimir un altre decimal amb la superfície de la pizza.","1133.54","2375.83"],"inputPriv":["22.8","11.1","45.6"],"outputPriv":["408.28","96.76","1663.12"]}
{"numProblema":3,"enunciado":"Feu un programa que rebi una temperatura en graus Celsius i la converteixi en graus Fahrenheit", "inputPub":["Per l’entrada rebreu un nombre decimal que representa una temperatura en graus Celsius.","33.1","-3.2"], "outputPub":["Per la sortida sempre haureu d’imprimir un altre decimal amb el valor de la temperatura en graus Fahrenheit","91.58","26.2"],"inputPriv": ["9.8","-7.4","40.1"],"outputPriv":["49.64", "18.68", "104.14"]}
{"numProblema":4,"enunciado":"L'usuari escriu 4 enters i s'imprimeix el valor de sumar el primer amb el segon,\n multiplicat per el mòdul del tercer amb el quart.", "inputPub":["Per l’entrada rebreu 4 nombres enters introduïts per l’usuari.", "2 5 10 4", "23 31 156 5"], "outputPub":["La sortida ha de ser un enter que representa el resultat de la següent operació (a + b) * (c % d).", "14", "54"],"inputPriv": ["25 45 56 12", "23 258 12 25", "-5 2 -78 32"],"outputPriv":["560","3372", "42"]}
{"numProblema":5,"enunciado":"En una escola tenim tres classes i volem saber quin és el nombre de taules que necessitarem tenir en total.\nDependrà del nombre d'alumnes per aula. Cal tenir en compte que a cada taula hi caben 2 alumnes.", "inputPub":["Per l’entrada rebreu 3 enters que representen el nombre d’alumnes que hi ha a cada classe.", "2 5 10", "23 31 156"], "outputPub":["La sortida ha de ser un enter que representa el resultat de la següent operació (a + b) * (c % d).", "22 25 26","31 29 19"],"inputPriv": ["25 11 29", "1 2 5", "25 2 1"],"outputPriv":["34", "5", "15"]}
{"numProblema":6,"enunciado":"Fes un programa que compari pizzes rodones amb pizzes rectangulars, volem saber, en cada cas, quina de les dues és més gran.", "inputPub":["Per l’entrada rebreu tres nombres enters, on el primer serà el diàmetre de la pizza rodona\n i els següents dos els costats de la pizza rectangular.", "20 12 6","20 12 10"], "outputPub":["Per la sortida haureu d’imprimir quina de les dues pizzes és més gran i la seva àrea.", "Pizza rodona: 98.696","Pizza rectangular: 120"],"inputPriv": ["15 8 9", "8 12 4", "9 10 8"],"outputPriv":["Pizza rodona: 176.71", "Pizza rodona: 50.26", "Pizza rectangle: 80.0"]}
{"numProblema":7,"enunciado":"A un treballador li paguen per hores, a partir de 40 hores de treball la tarifa per hora s'incrementa en un 50%.\nEscriu un algorisme que demani les hores treballades i mostri com a resultat el salari del treballador,\ntenint en compte que la tarifa per hora és de 40 €/h.", "inputPub":["Per l’entrada rebreu el nombre d’hores que ha treballat en una setmana, en format enter.", "40", "55"], "outputPub":["La sortida ha de ser un enter que representi el salari que ha de rebre el treballador per aquella setmana de feina.", "1600","2500"],"inputPriv": ["17.5", "35", "48"],"outputPriv":["700", "1400", "2080"]}
{"numProblema":8,"enunciado":"Fes un programa que, donat un número de dni, et calculi la lletra que li correspon.", "inputPub":["Per l’entrada rebreu un nombre enter, que representa un número de dni, és a dir, un nombre de 8 xifres exactes.", "65004204", "65004203"], "outputPub":["Per la sortida haureu d’imprimir el número del dni amb la seva lletra corresponent.", "65004204V","65004203Q"],"inputPriv": ["25648215", "55555555", "12345678"],"outputPriv":["25648215H", "55555555K", "12345678Z"]}
{"numProblema":9,"enunciado":"Fes un programa que, donat tres nombres enters, indiqui si la seqüència és ascendent, descendent o cap de les dues.", "inputPub":["Per l’entrada rebreu tres nombres enters.", "1 2 3", "9999 1 3245"], "outputPub":["Per la sortida haureu d’imprimir si la seqüència és ascendent, descendent o cap de les dues.", "Ascendent","Cap de les dues"],"inputPriv": ["25 6 2", "35 42 31", "4 5 2588"],"outputPriv":["Descendent", "Cap de les dues", "Ascendent"]}
{"numProblema":10,"enunciado":"Fes un programa que, donats dos nombres enters i un símbol d’operació, executi l’operació i retorni el resultat.", "inputPub":["Per l’entrada rebreu dos nombres enters i, a continuació, un caràcter amb un dels següents símbols: + - * / %", "2 2 +", "2 2 %"], "outputPub":["Per la sortida haureu d’imprimir el nombre enter resultant de l’operació.", "4", "0"],"inputPriv": ["5 9 /", "7 8 *", "87 92 -"],"outputPriv":["0", "56", "-5"]}
{"numProblema":11,"enunciado":"Escriu un programa que donat un nombre enter s’imprimeixi la suma de tots els enters fins a arribar a aquest.", "inputPub":["Per l’entrada rebreu un nombre enter.", "3", "5"], "outputPub":["Heu d’imprimir un nombre enter que representi la suma de tots els nombres fins a arribar al d’entrada (inclòs).", "6","15"],"inputPriv": ["25", "37", "1248"],"outputPriv":["325", "703", "779376"]}
{"numProblema":12,"enunciado":"Escriu un programa que rebi un nombre enter n i imprimeixi els n primers números de la seqüència de Fibonacci.\nAquesta seqüència compleix aquesta condició:\nF0 = 0,F1 = 1,Fn = Fn−1 + Fn−2", "inputPub":["Per l’entrada rebreu un enter positiu.", "6", "12"], "outputPub":["Per la sortida s’ha d’imprimir els n primers nombres de la seqüència de Fibonacci.", "0 1 1 2 3 5","0 1 1 2 3 5 8 13 21 34 55 89"],"inputPriv": ["23", "8", "5"],"outputPriv":["0 1 1 2 3 5 8 13 21 34 55 89 144 233 377 610 987 1597 2584 4181 6765 10946 17711", "0 1 1 2 3 5 8 13", "0 1 1 2 3"]}
{"numProblema":13,"enunciado":"Escriu un programa que donat dos nombres enters imprimeixi el resultat d’elevar el primer pel segon.", "inputPub":["Per l’entrada rebreu dos nombres enters.", "2 3", "2 32"], "outputPub":["La sortida ha de ser el resultat d’elevar el primer pel segon.", "8","4294967296"],"inputPriv": ["4 5", "32", "-8 5"],"outputPriv":["1024", "1099511627776", "-32768"]}
{"numProblema":14,"enunciado":"Escriu un programa que donat un nombre enter, indiqui si aquest és primer o no.", "inputPub":["Per l’entrada rebreu un nombre enter.","11","128"], "outputPub":["La sortida ha d’imprimir si el nombre és primer o no.","Primer","No primer"],"inputPriv": ["425", "367", "666"],"outputPriv":["NO PRIMER", "PRIMER", "NO PRIMER"]}
{"numProblema":15,"enunciado":"Feu un programa que rebi una llista no buida d’enters i calculi la suma de tots els valors.", "inputPub":["L’entrada consisteix en una seqüència no buida d’enters.", "1 7 3 2 4 7 5 8 7", "-3 10 0 -2 8"], "outputPub":["El resultat de la suma de tots els enters.", "44","13"],"inputPriv": ["-85 12 14 -3 -5 1 4", "45 58 -21 47 23 65 -8 -74 4", "8 5 3 2 1 -7 -5 -9 -2 -1 14 2 -25"],"outputPriv":["-62", "139", "-14"]}
{"numProblema":16,"enunciado":"Feu un programa que calculi la mitjana de tots els valors inclosos en una llista de enters.", "inputPub":["L’entrada consisteix en una llista d’enters.", "1 7 3 2 4 7 5 8 7", "-3 10 0 -2 8"], "outputPub":["Escriviu el resultat de la mitjana de tots els enters amb decimals.", "4.888888888888889","2.6"],"inputPriv": ["1 5 2 3 6 9 8 7", "25 63 251 452 52", "-8 -2 -3 -8 -52 -41 -2 5 9 3 71"],"outputPriv":["5.125", "168.6", "-2.5454545454545454"]}
{"numProblema":17,"enunciado":"Feu un programa que llegeixi una seqüència de caràcters, cadascun dels quals codificant un moviment\n(‘n’ per nord, ‘s’ per sud, ‘e’ per est, i ‘o’ per oest),\n i que calculi la posició final d’un objecte que\ninicialment es trobés a la posició (0, 0). Suposeu que la primera component\n es correspon a la direcció est-oest,\n que anar cap a l’est significa sumar 1 a aquesta component, i que anar\ncap al sud significa sumar 1 a la segona component.\n Quan es rebi una ‘z’ es finalitzarà el moviment.", "inputPub":["Per l’entrada rebreu una sèrie de caràcters ‘n’, ‘s’, ‘e’ o ‘o’\nindicant les coordenades de moviment i la seqüència acabarà amb una ‘z’.", "n n n n z", "s s e o o o o n z"], "outputPub":["Cal escriure la posició final d’un objecte que inicialment es trobés a la posició (0, 0).", "(0, -4)","(-3, 1)"],"inputPriv": ["s s s n e s n o o e n z", "n n n n n n n n n n n n n n e e e e e s s s n s e o o o z", "n o n o n o n o n o s e s e s e s e s e z"],"outputPriv":["(-2, 2)", "(-3, -4)", "(-5, 6)"]}
{"numProblema":18,"enunciado":"Feu un programa que rebi per paràmetre una seqüència no buida d’enters i mostri el valor que falta a la seqüència.", "inputPub":["L’entrada consisteix en una seqüència no buida i ordenada d’enters.", "1 2 3 4 5 6 7 9 10 11", "4 5 7 8 9"], "outputPub":["Per la sortida heu d’imprimir el valor de la seqüència que falta.", "8","6"],"inputPriv": ["6 7 8 9 10 12 13", "-2 -1 0 1 2 4", "0 1 2 3 5"],"outputPriv":["11", "3", "4"]}
{"numProblema":19,"enunciado":"Feu un programa que, donada una seqüència de naturals rebuda per paràmetre,\n indiqui si n’hi ha algun que sigui igual a la\nsuma de tots els altres.", "inputPub":["L’entrada consisteix en una seqüència no buida d’enters.", "1 0 5 3 1 0", "1 0 3 3 1 0 2"], "outputPub":["Per la sortida digueu si té algun nombre igual a la suma dels altres.", "SI", "NO"],"inputPriv": ["4 5 20 8 3", "1 5 28 6 20 0", "4 6 3 11 2 0 4 7 5 6 8 9 32"],"outputPriv":["SI", "NO", "NO"]}
{"numProblema":20,"enunciado":"Feu un programa que llegeixi una seqüència d’enters i com a resultat\nretorni la seqüència eliminant totes les repeticions que puguin haver-hi.", "inputPub":["L'entrada consisteix en nombres enters que formen la seqüència.", "23 23 4 4 67 78 89 78 89 4", "1 -23 -45 -67 -67 -45 23 1"], "outputPub":["Cal imprimir la seqüència rebuda eliminant totes les repeticions.", "23 4 67 78 89","1 -23 -45 -67 23"],"inputPriv": ["8 8 8 8 8 8 8 8 8 8 8", "7 4 2 2 1 5 6 -8 1 2 6 -2", "1 2 3 4 5 5 6 5 2 1"],"outputPriv":["8", "7 4 2 1 5 6 -8 -2", "1 2 3 4 5 6"]}