module gitlab.com/joel-muehlena-website/api/blog/category

go 1.18

replace gitlab.com/joelMuehlena/go-ms-toolkit => /home/joel/go/src/gitlab.com/joelMuehlena/go-ms-toolkit

require gitlab.com/joelMuehlena/go-ms-toolkit v0.0.0

require (
	github.com/gin-contrib/sse v0.1.0 // indirect
	github.com/gin-contrib/zap v0.0.2 // indirect
	github.com/gin-gonic/gin v1.8.1 // indirect
	github.com/go-playground/locales v0.14.0 // indirect
	github.com/go-playground/universal-translator v0.18.0 // indirect
	github.com/go-playground/validator/v10 v10.11.0 // indirect
	github.com/goccy/go-json v0.9.7 // indirect
	github.com/json-iterator/go v1.1.12 // indirect
	github.com/leodido/go-urn v1.2.1 // indirect
	github.com/matoous/go-nanoid/v2 v2.0.0 // indirect
	github.com/mattn/go-isatty v0.0.14 // indirect
	github.com/modern-go/concurrent v0.0.0-20180306012644-bacd9c7ef1dd // indirect
	github.com/modern-go/reflect2 v1.0.2 // indirect
	github.com/pelletier/go-toml/v2 v2.0.2 // indirect
	github.com/ugorji/go/codec v1.2.7 // indirect
	go.uber.org/atomic v1.9.0 // indirect
	go.uber.org/multierr v1.8.0 // indirect
	go.uber.org/zap v1.21.0 // indirect
	golang.org/x/crypto v0.0.0-20220622213112-05595931fe9d // indirect
	golang.org/x/net v0.0.0-20220622184535-263ec571b305 // indirect
	golang.org/x/sys v0.0.0-20220622161953-175b2fd9d664 // indirect
	golang.org/x/text v0.3.7 // indirect
	google.golang.org/protobuf v1.28.0 // indirect
	gopkg.in/yaml.v2 v2.4.0 // indirect
)
