module gitlab.com/joel-muehlena-website/api/api-gateway

go 1.17

require (
	github.com/confluentinc/confluent-kafka-go v1.6.1
	github.com/dgrijalva/jwt-go v3.2.0+incompatible
	github.com/gin-contrib/cors v1.3.1
	github.com/gin-gonic/gin v1.6.3
	github.com/go-playground/validator/v10 v10.4.1 // indirect
	github.com/golang/protobuf v1.5.2 // indirect
	github.com/google/uuid v1.2.0
	github.com/json-iterator/go v1.1.10 // indirect
	github.com/leodido/go-urn v1.2.1 // indirect
	github.com/modern-go/concurrent v0.0.0-20180306012644-bacd9c7ef1dd // indirect
	github.com/modern-go/reflect2 v1.0.1 // indirect
	gitlab.com/joel-muehlena-website/utility/jm-config-server-addon-go v0.1.3
	golang.org/x/crypto v0.0.0-20210322153248-0c34fe9e7dc2 // indirect
	golang.org/x/sys v0.0.0-20210331175145-43e1dd70ce54 // indirect
	gopkg.in/yaml.v2 v2.4.0
)

require (
	github.com/gin-contrib/sse v0.1.0 // indirect
	github.com/go-playground/locales v0.13.0 // indirect
	github.com/go-playground/universal-translator v0.17.0 // indirect
	github.com/gorilla/mux v1.8.0 // indirect
	github.com/mattn/go-isatty v0.0.12 // indirect
	github.com/rs/cors v1.8.2 // indirect
	github.com/ugorji/go/codec v1.2.5 // indirect
	google.golang.org/protobuf v1.26.0 // indirect
)
