{
  "tagPath": "",
  "metadataPath": "",
  "allExceptMdPath": "",
  "tagFile": "tags.json",
  "metadataFile": "metadata.json",
  "allExceptMdFile": "allExceptMd.json",
  "writingFrequency": "15",
  "writeFilesOnLaunch": true,
  "consoleLog": false
}