{
  "splitDirection": "vertical",
  "typedLinkPrefix": "-",
  "useImgServer": false,
  "imgServerPort": 3837,
  "debug": false,
  "globalStyleGroups": [
    {
      "filter": "class:dangling",
      "color": "rgb(181, 181, 181)",
      "shape": "tag",
      "icon": {
        "name": "No icon",
        "path": "",
        "color": "white"
      },
      "showInPane": false,
      "show": true,
      "size": 1
    },
    {
      "filter": "class:file -class:image",
      "color": "rgb(130, 130, 130)",
      "shape": "ellipse",
      "icon": {
        "name": "No icon",
        "path": "",
        "color": "white"
      },
      "showInPane": false,
      "show": true,
      "size": 1
    },
    {
      "filter": "task:true",
      "color": "black",
      "shape": "star",
      "icon": {
        "name": "Code Tags Check",
        "path": "M6.59,3.41L2,8L6.59,12.6L8,11.18L4.82,8L8,4.82L6.59,3.41M12.41,3.41L11,4.82L14.18,8L11,11.18L12.41,12.6L17,8L12.41,3.41M21.59,11.59L13.5,19.68L9.83,16L8.42,17.41L13.5,22.5L23,13L21.59,11.59Z",
        "color": "white"
      },
      "showInPane": true,
      "show": true,
      "size": 1.58543191964286
    }
  ],
  "globalGraphRibbon": true,
  "graphSettings": {
    "animateLayout": true,
    "autoAddNodes": true,
    "autoExpand": false,
    "autoZoom": false,
    "coreStore": "Obsidian",
    "expandInitial": true,
    "fdgdLayout": "d3-force",
    "filter": "",
    "height": "100%",
    "hoverEdges": false,
    "layout": "force-directed",
    "limit": 10000,
    "mergeEdges": true,
    "metaKeyHover": false,
    "mode": "workspace",
    "navigator": true,
    "openWithShift": false,
    "readContent": true,
    "styleGroups": [],
    "toolbar": true,
    "width": "100%",
    "zoomSpeed": 1
  },
  "embedSettings": {
    "animateLayout": true,
    "autoAddNodes": false,
    "autoExpand": false,
    "autoZoom": false,
    "coreStore": "Obsidian",
    "expandInitial": true,
    "fdgdLayout": "cola",
    "filter": "",
    "height": "400px",
    "hoverEdges": false,
    "layout": "force-directed",
    "limit": 1000,
    "mergeEdges": true,
    "metaKeyHover": false,
    "mode": "local",
    "navigator": false,
    "openWithShift": false,
    "readContent": true,
    "styleGroups": [],
    "toolbar": false,
    "width": "100%",
    "zoomSpeed": 1
  },
  "globalGraphSettings": {
    "animateLayout": true,
    "autoAddNodes": true,
    "autoExpand": false,
    "autoZoom": false,
    "coreStore": "Obsidian",
    "expandInitial": false,
    "fdgdLayout": "cola",
    "filter": "-class:dangling -class:file",
    "height": "100%",
    "width": "100%",
    "limit": 10000,
    "hoverEdges": false,
    "layout": "force-directed",
    "mergeEdges": true,
    "metaKeyHover": false,
    "mode": "workspace",
    "navigator": true,
    "openWithShift": false,
    "readContent": false,
    "styleGroups": [],
    "toolbar": true,
    "zoomSpeed": 1
  }
}