{
  "CN_path": "Central Node.md",
  "exluded_folders": [],
  "exluded_filename_components": [],
  "settings_version": "0.1.16",
  "plugin_version": "0.1.18",
  "do_show_update_notice": false,
  "auto_update_on_file_change": true,
  "do_remember_expanded": false,
  "MOC_path_starts_at_CN": true,
  "file_descendants_expanded": {}
}