<?xml version="1.0" encoding="UTF-8"?>
<svg xmlns="http://www.w3.org/2000/svg" xmlns:xlink="http://www.w3.org/1999/xlink"
     width="450" height="450" viewBox="0 -450 450 450">
<defs>
</defs>
<rect x="45" y="-90" width="45" height="45" fill="#f9c970" strokewidth="0" />
<rect x="90" y="-90" width="45" height="45" fill="#aa7106" strokewidth="0" />
<rect x="135" y="-90" width="45" height="45" fill="#f9c970" strokewidth="0" />
<rect x="180" y="-90" width="45" height="45" fill="#aa7106" strokewidth="0" />
<rect x="225" y="-90" width="45" height="45" fill="#f9c970" strokewidth="0" />
<rect x="270" y="-90" width="45" height="45" fill="#aa7106" strokewidth="0" />
<rect x="315" y="-90" width="45" height="45" fill="#f9c970" strokewidth="0" />
<rect x="360" y="-90" width="45" height="45" fill="#aa7106" strokewidth="0" />
<rect x="45" y="-135" width="45" height="45" fill="#aa7106" strokewidth="0" />
<rect x="90" y="-135" width="45" height="45" fill="#f9c970" strokewidth="0" />
<rect x="135" y="-135" width="45" height="45" fill="#aa7106" strokewidth="0" />
<rect x="180" y="-135" width="45" height="45" fill="#f9c970" strokewidth="0" />
<rect x="225" y="-135" width="45" height="45" fill="#aa7106" strokewidth="0" />
<rect x="270" y="-135" width="45" height="45" fill="#f9c970" strokewidth="0" />
<rect x="315" y="-135" width="45" height="45" fill="#aa7106" strokewidth="0" />
<rect x="360" y="-135" width="45" height="45" fill="#f9c970" strokewidth="0" />
<rect x="45" y="-180" width="45" height="45" fill="#f9c970" strokewidth="0" />
<rect x="90" y="-180" width="45" height="45" fill="#aa7106" strokewidth="0" />
<rect x="135" y="-180" width="45" height="45" fill="#f9c970" strokewidth="0" />
<rect x="180" y="-180" width="45" height="45" fill="#aa7106" strokewidth="0" />
<rect x="225" y="-180" width="45" height="45" fill="#f9c970" strokewidth="0" />
<rect x="270" y="-180" width="45" height="45" fill="#aa7106" strokewidth="0" />
<rect x="315" y="-180" width="45" height="45" fill="#f9c970" strokewidth="0" />
<rect x="360" y="-180" width="45" height="45" fill="#aa7106" strokewidth="0" />
<rect x="45" y="-225" width="45" height="45" fill="#aa7106" strokewidth="0" />
<rect x="90" y="-225" width="45" height="45" fill="#f9c970" strokewidth="0" />
<rect x="135" y="-225" width="45" height="45" fill="#aa7106" strokewidth="0" />
<rect x="180" y="-225" width="45" height="45" fill="#f9c970" strokewidth="0" />
<rect x="225" y="-225" width="45" height="45" fill="#aa7106" strokewidth="0" />
<rect x="270" y="-225" width="45" height="45" fill="#f9c970" strokewidth="0" />
<rect x="315" y="-225" width="45" height="45" fill="#aa7106" strokewidth="0" />
<rect x="360" y="-225" width="45" height="45" fill="#f9c970" strokewidth="0" />
<rect x="45" y="-270" width="45" height="45" fill="#f9c970" strokewidth="0" />
<rect x="90" y="-270" width="45" height="45" fill="#aa7106" strokewidth="0" />
<rect x="135" y="-270" width="45" height="45" fill="#f9c970" strokewidth="0" />
<rect x="180" y="-270" width="45" height="45" fill="#aa7106" strokewidth="0" />
<rect x="225" y="-270" width="45" height="45" fill="#f9c970" strokewidth="0" />
<rect x="270" y="-270" width="45" height="45" fill="#aa7106" strokewidth="0" />
<rect x="315" y="-270" width="45" height="45" fill="#f9c970" strokewidth="0" />
<rect x="360" y="-270" width="45" height="45" fill="#aa7106" strokewidth="0" />
<rect x="45" y="-315" width="45" height="45" fill="#aa7106" strokewidth="0" />
<rect x="90" y="-315" width="45" height="45" fill="#f9c970" strokewidth="0" />
<rect x="135" y="-315" width="45" height="45" fill="#aa7106" strokewidth="0" />
<rect x="180" y="-315" width="45" height="45" fill="#f9c970" strokewidth="0" />
<rect x="225" y="-315" width="45" height="45" fill="#aa7106" strokewidth="0" />
<rect x="270" y="-315" width="45" height="45" fill="#f9c970" strokewidth="0" />
<rect x="315" y="-315" width="45" height="45" fill="#aa7106" strokewidth="0" />
<rect x="360" y="-315" width="45" height="45" fill="#f9c970" strokewidth="0" />
<rect x="45" y="-360" width="45" height="45" fill="#f9c970" strokewidth="0" />
<rect x="90" y="-360" width="45" height="45" fill="#aa7106" strokewidth="0" />
<rect x="135" y="-360" width="45" height="45" fill="#f9c970" strokewidth="0" />
<rect x="180" y="-360" width="45" height="45" fill="#aa7106" strokewidth="0" />
<rect x="225" y="-360" width="45" height="45" fill="#f9c970" strokewidth="0" />
<rect x="270" y="-360" width="45" height="45" fill="#aa7106" strokewidth="0" />
<rect x="315" y="-360" width="45" height="45" fill="#f9c970" strokewidth="0" />
<rect x="360" y="-360" width="45" height="45" fill="#aa7106" strokewidth="0" />
<rect x="45" y="-405" width="45" height="45" fill="#aa7106" strokewidth="0" />
<rect x="90" y="-405" width="45" height="45" fill="#f9c970" strokewidth="0" />
<rect x="135" y="-405" width="45" height="45" fill="#aa7106" strokewidth="0" />
<rect x="180" y="-405" width="45" height="45" fill="#f9c970" strokewidth="0" />
<rect x="225" y="-405" width="45" height="45" fill="#aa7106" strokewidth="0" />
<rect x="270" y="-405" width="45" height="45" fill="#f9c970" strokewidth="0" />
<rect x="315" y="-405" width="45" height="45" fill="#aa7106" strokewidth="0" />
<rect x="360" y="-405" width="45" height="45" fill="#f9c970" strokewidth="0" />
</svg>