{
  "display_name": "OCaml",
  "language": "OCaml",
  "argv": [
    "/bin/sh",
    "-c",
    "export OPAM_SWITCH_PREFIX='/home/caml/.opam/default' && export CAML_LD_LIBRARY_PATH='/home/caml/.opam/default/lib/stublibs:/usr/local/lib/ocaml/4.13.1/stublibs:/usr/lib/ocaml/stublibs' && export OCAML_TOPLEVEL_PATH='/home/caml/.opam/default/lib/toplevel' && export MANPATH=':/home/caml/.opam/default/man' && export PATH='/home/caml/.opam/default/bin:/usr/local/sbin:/usr/local/bin:/usr/sbin:/usr/bin:/sbin:/bin' && /home/caml/.opam/default/bin/ocaml-jupyter-kernel \"$@\"",
    "ocaml-jupyter-kernel",
    "-init", "/home/caml/.ocamlinit",
    "--merlin", "/home/caml/.opam/default/bin/ocamlmerlin",
    "--verbosity", "app",
    "--connection-file", "{connection_file}"
  ]
}
