%YAML 1.1
%TAG !u! tag:unity3d.com,2011:
--- !u!1 &2211756449671838489
GameObject:
  m_ObjectHideFlags: 0
  m_CorrespondingSourceObject: {fileID: 0}
  m_PrefabInstance: {fileID: 0}
  m_PrefabAsset: {fileID: 0}
  serializedVersion: 6
  m_Component:
  - component: {fileID: 2211756449671838488}
  - component: {fileID: 2211756449671838495}
  m_Layer: 0
  m_Name: WaveFunctionCollapse
  m_TagString: Untagged
  m_Icon: {fileID: 0}
  m_NavMeshLayer: 0
  m_StaticEditorFlags: 0
  m_IsActive: 1
--- !u!4 &2211756449671838488
Transform:
  m_ObjectHideFlags: 0
  m_CorrespondingSourceObject: {fileID: 0}
  m_PrefabInstance: {fileID: 0}
  m_PrefabAsset: {fileID: 0}
  m_GameObject: {fileID: 2211756449671838489}
  m_LocalRotation: {x: 0, y: 0, z: 0, w: 1}
  m_LocalPosition: {x: 0, y: 0, z: 0}
  m_LocalScale: {x: 1, y: 1, z: 1}
  m_ConstrainProportionsScale: 0
  m_Children: []
  m_Father: {fileID: 0}
  m_RootOrder: 0
  m_LocalEulerAnglesHint: {x: 0, y: 0, z: 0}
--- !u!114 &2211756449671838495
MonoBehaviour:
  m_ObjectHideFlags: 0
  m_CorrespondingSourceObject: {fileID: 0}
  m_PrefabInstance: {fileID: 0}
  m_PrefabAsset: {fileID: 0}
  m_GameObject: {fileID: 2211756449671838489}
  m_Enabled: 1
  m_EditorHideFlags: 0
  m_Script: {fileID: 11500000, guid: c723bdb49ef3ab4458b002084bf3a55a, type: 3}
  m_Name: 
  m_EditorClassIdentifier: 
  tiles:
  - {fileID: 856369185630325926, guid: 56b1bfd60b3b5ad42bcd3bda5e5dc151, type: 3}
  - {fileID: 9000729855363809476, guid: 03b1344d7866db6439daf1e5427c86ec, type: 3}
  - {fileID: 8116339731029587158, guid: 10e42fd3459a2834ea3b86bfda52fbe2, type: 3}
  - {fileID: 3943211783278460588, guid: e913fc10d8518fb43ba1be97574baed4, type: 3}
  - {fileID: 3315919158924790517, guid: 7636fba9a146330449fc0b5a7db18bed, type: 3}
  - {fileID: 3075336803131473414, guid: 71b3c0240bf242f428a848d15cedb674, type: 3}
  - {fileID: 7142218940262175634, guid: 862b86887968e8546a53587562252dd9, type: 3}
  - {fileID: 4496542767535946144, guid: ec37c803457a5c34aafc1024d4f4a234, type: 3}
  - {fileID: 7673970934083827969, guid: 3204a381e4d8ebe4da4bb9582651b336, type: 3}
  - {fileID: 278685728001763651, guid: 5b0fe9305ec2e36468747669a2c4fb6e, type: 3}
  rows: 8
  columns: 8
  maxRetries: 50
