2021-06-02T14:56:05.928-0300	INFO	instance/beat.go:665	Home path: [/Users/joao.zaniolo/www/p2p/troubleshooting-essentials/metricbeat-7.13.1-darwin-x86_64] Config path: [/Users/joao.zaniolo/www/p2p/troubleshooting-essentials/metricbeat-7.13.1-darwin-x86_64] Data path: [/Users/joao.zaniolo/www/p2p/troubleshooting-essentials/metricbeat-7.13.1-darwin-x86_64/data] Logs path: [/Users/joao.zaniolo/www/p2p/troubleshooting-essentials/metricbeat-7.13.1-darwin-x86_64/logs]
2021-06-02T14:56:05.931-0300	INFO	instance/beat.go:673	Beat ID: 5f715957-46ad-4a1c-879a-fd10b0cf43f9
2021-06-02T14:56:05.933-0300	INFO	[beat]	instance/beat.go:1014	Beat info	{"system_info": {"beat": {"path": {"config": "/Users/joao.zaniolo/www/p2p/troubleshooting-essentials/metricbeat-7.13.1-darwin-x86_64", "data": "/Users/joao.zaniolo/www/p2p/troubleshooting-essentials/metricbeat-7.13.1-darwin-x86_64/data", "home": "/Users/joao.zaniolo/www/p2p/troubleshooting-essentials/metricbeat-7.13.1-darwin-x86_64", "logs": "/Users/joao.zaniolo/www/p2p/troubleshooting-essentials/metricbeat-7.13.1-darwin-x86_64/logs"}, "type": "metricbeat", "uuid": "5f715957-46ad-4a1c-879a-fd10b0cf43f9"}}}
2021-06-02T14:56:05.934-0300	INFO	[beat]	instance/beat.go:1023	Build info	{"system_info": {"build": {"commit": "2d80f6e99f41b65a270d61706fa98d13cfbda18d", "libbeat": "7.13.1", "time": "2021-05-28T17:55:51.000Z", "version": "7.13.1"}}}
2021-06-02T14:56:05.934-0300	INFO	[beat]	instance/beat.go:1026	Go runtime info	{"system_info": {"go": {"os":"darwin","arch":"amd64","max_procs":8,"version":"go1.15.12"}}}
2021-06-02T14:56:05.935-0300	INFO	[beat]	instance/beat.go:1030	Host info	{"system_info": {"host": {"architecture":"x86_64","boot_time":"2021-06-01T10:40:23.576271-03:00","name":"AC-LPT-00575.local","ip":["127.0.0.1/8","::1/128","fe80::1/64","fe80::aede:48ff:fe00:1122/64","fe80::1897:fb76:995c:cbac/64","192.168.15.83/24","fe80::64fe:5cff:fe6a:b006/64","fe80::64fe:5cff:fe6a:b006/64","fe80::4c4b:10f8:2798:cc/64","fe80::dbde:b00e:d3be:7b09/64"],"kernel_version":"20.4.0","mac":["ac:de:48:00:11:22","b2:9c:4a:d1:36:9e","90:9c:4a:d1:36:9e","ee:49:81:c4:00:01","ee:49:81:c4:00:00","ee:49:81:c4:00:04","ee:49:81:c4:00:05","ee:49:81:c4:00:04","66:fe:5c:6a:b0:06","66:fe:5c:6a:b0:06","00:e0:4c:68:e0:a4"],"os":{"type":"macos","family":"darwin","platform":"darwin","name":"Mac OS X","version":"10.16","major":10,"minor":16,"patch":0,"build":"20E232"},"timezone":"-03","timezone_offset_sec":-10800,"id":"CD69EFA6-3991-51D9-8DEB-310830780502"}}}
2021-06-02T14:56:05.936-0300	INFO	[beat]	instance/beat.go:1059	Process info	{"system_info": {"process": {"cwd": "/Users/joao.zaniolo/www/p2p/troubleshooting-essentials/metricbeat-7.13.1-darwin-x86_64", "exe": "./metricbeat", "name": "metricbeat", "pid": 14692, "ppid": 14355, "start_time": "2021-06-02T14:56:05.807-0300"}}}
2021-06-02T14:56:05.936-0300	INFO	instance/beat.go:309	Setup Beat: metricbeat; Version: 7.13.1
2021-06-02T14:56:05.936-0300	INFO	[index-management]	idxmgmt/std.go:184	Set output.elasticsearch.index to 'metricbeat-7.13.1' as ILM is enabled.
2021-06-02T14:56:05.937-0300	INFO	eslegclient/connection.go:99	elasticsearch url: https://1145c7895e0045359a3a3005e43598c1.us-west1.gcp.cloud.es.io:443
2021-06-02T14:56:05.938-0300	INFO	[publisher]	pipeline/module.go:113	Beat name: AC-LPT-00575.local
2021-06-02T14:56:06.100-0300	INFO	eslegclient/connection.go:99	elasticsearch url: https://1145c7895e0045359a3a3005e43598c1.us-west1.gcp.cloud.es.io:443
2021-06-02T14:56:08.217-0300	INFO	[esclientleg]	eslegclient/connection.go:314	Attempting to connect to Elasticsearch version 7.13.1
2021-06-02T14:56:08.415-0300	INFO	[index-management]	idxmgmt/std.go:261	Auto ILM enable success.
2021-06-02T14:56:08.882-0300	INFO	[index-management.ilm]	ilm/std.go:170	ILM policy metricbeat successfully created.
2021-06-02T14:56:08.882-0300	INFO	[index-management]	idxmgmt/std.go:401	Set setup.template.name to '{metricbeat-7.13.1 {now/d}-000001}' as ILM is enabled.
2021-06-02T14:56:08.882-0300	INFO	[index-management]	idxmgmt/std.go:406	Set setup.template.pattern to 'metricbeat-7.13.1-*' as ILM is enabled.
2021-06-02T14:56:08.882-0300	INFO	[index-management]	idxmgmt/std.go:440	Set settings.index.lifecycle.rollover_alias in template to {metricbeat-7.13.1 {now/d}-000001} as ILM is enabled.
2021-06-02T14:56:08.883-0300	INFO	[index-management]	idxmgmt/std.go:444	Set settings.index.lifecycle.name in template to {metricbeat {"policy":{"phases":{"hot":{"actions":{"rollover":{"max_age":"30d","max_size":"50gb"}}}}}}} as ILM is enabled.
2021-06-02T14:56:08.935-0300	INFO	[add_cloud_metadata]	add_cloud_metadata/add_cloud_metadata.go:101	add_cloud_metadata: hosting provider type not detected.
2021-06-02T14:56:09.072-0300	INFO	template/load.go:228	Existing template will be overwritten, as overwrite is enabled.
2021-06-02T14:56:09.300-0300	INFO	template/load.go:131	Try loading template metricbeat-7.13.1 to Elasticsearch
2021-06-02T14:56:10.400-0300	INFO	template/load.go:123	template with name 'metricbeat-7.13.1' loaded.
2021-06-02T14:56:10.400-0300	INFO	[index-management]	idxmgmt/std.go:297	Loaded index template.
2021-06-02T14:56:11.343-0300	INFO	[index-management.ilm]	ilm/std.go:135	Index Alias metricbeat-7.13.1 successfully created.
2021-06-02T14:56:11.344-0300	INFO	kibana/client.go:119	Kibana url: https://26651884968948469a822287169be8cf.us-west1.gcp.cloud.es.io:443
2021-06-02T14:56:13.381-0300	INFO	kibana/client.go:119	Kibana url: https://26651884968948469a822287169be8cf.us-west1.gcp.cloud.es.io:443
2021-06-02T14:57:59.178-0300	INFO	instance/beat.go:848	Kibana dashboards successfully loaded.
