{
  "testFiles": "**/*.feature",
  "chromeWebSecurity": false,
  "requestTimeout": 9000,
  "responseTimeout": 9000,
  "projectId": "44e2xu",
  "viewportWidth": 1600,
  "viewportHeight": 900,
  "env": {
    "SEARCH": "http://localhost:8080/api/v1/car-dados/search",
    "REPORT": "http://localhost:8080/api/v1/car-dados/report"
  }
}
