{
  "uuid": "d8726613-af55-4d0f-8d60-b92737cec611",
  "lastMigration": 20,
  "name": "Cardados",
  "endpointPrefix": "",
  "latency": 0,
  "port": 9004,
  "hostname": "0.0.0.0",
  "routes": [
    {
      "uuid": "050c9e8a-5c37-4026-baa0-552c42fd202e",
      "documentation": "",
      "method": "get",
      "endpoint": "Wssisconsulta/consultaJSON.asmx/Consulta",
      "responses": [
        {
          "uuid": "d41525fc-4374-4aac-a624-9c1d0029453e",
          "body": "<?xml version=\"1.0\" encoding=\"utf-8\"?>\r\n<string xmlns=\"http://tempuri.org/\">{\r\n    \"Retorno\": {\r\n        \"RETORNO\": {\r\n            \"idPesquisa\": \"2955013\",\r\n            \"Mensagem\": \"Pronta\",\r\n            \"Resultado\": \"Ok\",\r\n            \"RetornoCompleto\": \"1\",\r\n            \"IdentCliente\": \"=\",\r\n            \"ArquivoPesquisa\": \"https://html-consultas.s3.amazonaws.com/2162D808304928B1658325040ISJ5514JUU382ONZFPJIOTU30.html\"\r\n        },\r\n        \"QUADRORESUMO\": {\r\n            \"Situacao\": \"CIRCULAçãO\",\r\n            \"Debitos\": \"SIM\",\r\n            \"Restricoes\": \"NÃO\",\r\n            \"Leilao1\": \"NÃO\",\r\n            \"Leilao2\": \"NÃO\",\r\n            \"VendaDireta\": \"NÃO\",\r\n            \"Remarketing\": \"NÃO\",\r\n            \"Sinistro\": \"NÃO\",\r\n            \"IndicioDeSinistro1\": \"NÃO\",\r\n            \"IndicioDeSinistro2\": \"NÃO\",\r\n            \"TotalDeDebitos\": \"SIM\"\r\n        },\r\n        \"QUADRODEBITOS\": {\r\n            \"IPVA\": \"R$ 0,00\",\r\n            \"Licenciamento\": \"R$ 0,00\",\r\n            \"Multas\": \"R$ 3.897,35\",\r\n            \"DPVAT\": \"R$ 0,00\",\r\n            \"TotalDeDividas\": \"R$ 0,00\"\r\n        },\r\n        \"BASENACIONAL\": {\r\n            \"existe_erro\": \"0\",\r\n            \"Mensagem\": \"Parâmetro informado foi localizado.\",\r\n            \"placa\": \"QJV8777\",\r\n            \"chassi\": \"YV1XZACADK2072222\",\r\n            \"Renavam\": \"1167878512\",\r\n            \"Situacao\": \"CIRCULAçãO\",\r\n            \"ChassiRemarcado\": \"Não informado\",\r\n            \"UltimaAtualizacao\": \"24/06/2022\",\r\n            \"Municipio\": \"JOINVILLE\",\r\n            \"UF\": \"SC\",\r\n            \"Procedencia\": \"Importado\",\r\n            \"Tipo\": \"Utilitario\",\r\n            \"Especie\": \"MISTO\",\r\n            \"TipoMontagem\": \"Não informado\",\r\n            \"Marca\": \"I/VOLVO XC40 T4\",\r\n            \"MarcaModelo\": \"I/VOLVO XC40 T4\",\r\n            \"Anomod\": \"2019\",\r\n            \"Anofab\": \"2018\",\r\n            \"CapPassag\": \"5\",\r\n            \"Cor\": \"Branca\",\r\n            \"Potencia\": \"190\",\r\n            \"Cilindradas\": \"1969\",\r\n            \"Carroceria\": \"Não aplicável\",\r\n            \"Combustivel\": \"Gasolina\",\r\n            \"NMotor\": \"B4204T472730028\",\r\n            \"NCambio\": \"Não informado\",\r\n            \"MultaRENAINF\": \"Não Informado\",\r\n            \"ComunicadodeVenda\": \"Não Informado\",\r\n            \"PendenciaEmissaoDocumento\": \"Não Informado\",\r\n            \"RestricaoRENAJUD\": \"Não Informado\",\r\n            \"EmplacamentoEletronico\": \"Não Informado\",\r\n            \"RestricaoRFB\": \"Não Informado\",\r\n            \"PlacaMercosul\": \"Não Informado\",\r\n            \"TipoDocumentoProprietario\": \"CNPJ\",\r\n            \"NDocumentoProprietario\": \"11081531000172\",\r\n            \"TipoDocumentoFaturamento\": \"Não Informado\",\r\n            \"NDocumentoFaturamento\": \"Não Informado\",\r\n            \"UfFaturamento\": \"Não Informado\",\r\n            \"Categoria\": \"Não informado\",\r\n            \"DataAtualizacao\": \"Não Informado\",\r\n            \"NCarroceria\": \"NÃO INFORMADO\",\r\n            \"CMT\": \"4\",\r\n            \"PBT\": \"2\",\r\n            \"CapacidadedeCarga\": \"NÃO INFORMADO\",\r\n            \"Eixos\": \"2\",\r\n            \"NEixoAuxiliar\": \"NÃO INFORMADO\",\r\n            \"NEixoTraseiro\": \"NÃO INFORMADO\",\r\n            \"Restricao01\": \"Nada consta\",\r\n            \"Restricao02\": \"Nada consta\",\r\n            \"Restricao03\": \"Nada consta\",\r\n            \"Restricao04\": \"Nada consta\",\r\n            \"RFativo\": \"VEICULO NÃO POSSUI ROUBO/FURTO ATIVO.\"\r\n        },\r\n        \"HISTORICOROUBOFURTO\": {\r\n            \"existe_erro\": \"0\",\r\n            \"Consta\": \"0\",\r\n            \"Mensagem\": \"VEÍCULO NÃO POSSUÍ HISTÓRICO DE ROUBO E FURTO\"\r\n        },\r\n        \"BASEESTADUAL\": {\r\n            \"existe_erro\": \"0\",\r\n            \"Consta\": \"1\",\r\n            \"Placa\": \"QJV8777\",\r\n            \"Procedencia\": \"IMPORTADA\",\r\n            \"Chassi\": \"YV1XZACADK2072222\",\r\n            \"Motor\": \"B4204T472730028\",\r\n            \"Renavam\": \"1167878512\",\r\n            \"Cor\": \"BRANCA\",\r\n            \"Anodefabricacao\": \"2018\",\r\n            \"Anodomodelo\": \"2019\",\r\n            \"Municipio\": \"JOINVILLE-SC\",\r\n            \"Qtdpassageiros\": \"5\",\r\n            \"Capacidadecarga\": \"51\",\r\n            \"Especie\": \"MISTO\",\r\n            \"Carroceria\": \"Não Informado\",\r\n            \"Cambio\": \"Não Informado\",\r\n            \"Eixos\": \"2\",\r\n            \"Cilindradas\": \"Não Informado\",\r\n            \"Remarcacaochassi\": \"NORMAL\",\r\n            \"Categoria\": \"PARTICULAR\",\r\n            \"Tipo\": \"UTILITARIO\",\r\n            \"Cmt\": \"426\",\r\n            \"Combustivel\": \"GASOLINA\",\r\n            \"DocumentoProprietario\": \"Não informado\",\r\n            \"Marcamodelo\": \"VOLVO/XC40 T4\",\r\n            \"PBT\": \"216\",\r\n            \"Potencia\": \"190\",\r\n            \"Situacao\": \"CIRCULACAO\",\r\n            \"DtLmtRestTrib\": \"Não informado\",\r\n            \"RestricoesBaseEstadual\": {\r\n                \"RestricaoAdministrativa\": \"NADA CONSTA\",\r\n                \"BloqueioGuincho\": \"NÃO INFORMADO\",\r\n                \"Furto\": \"NÃO INFORMADO\",\r\n                \"InspecaoAmbiental\": \"NÃO INFORMADO\",\r\n                \"RestricaoJudicial\": \"NADA CONSTA\",\r\n                \"Renajud\": \"NADA CONSTA\",\r\n                \"RestricaoTributaria\": \"NADA CONSTA\",\r\n                \"RestricaoFinanceira\": \"Nada consta\",\r\n                \"OutrasRestricoes\": \"Nada consta\"\r\n            },\r\n            \"DebitosBaseEstadual\": {\r\n                \"Dpvat\": \"0,00\",\r\n                \"Ipva\": \"0,00\",\r\n                \"Licenciamento\": \"0,00\",\r\n                \"Multas\": \"683.95\",\r\n                \"Cetesb\": \"\",\r\n                \"Der\": \"\",\r\n                \"Dersa\": \"\",\r\n                \"Detran\": \"\",\r\n                \"Municipais\": \"\",\r\n                \"PolRodFederal\": \"0,00\",\r\n                \"Renainf\": \"0,00\"\r\n            },\r\n            \"PROPRIETARIOS\": {\r\n                \"Anterior\": \"Não Informado\",\r\n                \"Atual\": \"INSTITUTO LATINO AMERICANO DE DESENV EDU\"\r\n            }\r\n        },\r\n        \"GRAVAMECOMPLETO\": {\r\n            \"existe_erro\": \"0\",\r\n            \"Consta\": \"0\",\r\n            \"Mensagem\": \"VEÍCULO NUNCA CONSTOU DA BASE DE GRAVAMES\",\r\n            \"GravameCodigo\": \"0\"\r\n        },\r\n        \"DENATRANROBO\": {\r\n            \"Resumo\": {\r\n                \"RouboFurtoAtivo\": \"Não\",\r\n                \"ComunicadoDeVendaAtivo\": \"Não\",\r\n                \"RestricaoJudicial\": \"Não\",\r\n                \"Renajud\": \"Não\",\r\n                \"MultaRenainf\": \"CONSTA\",\r\n                \"Recall\": \"Não\",\r\n                \"RecallCodigo\": \"0\",\r\n                \"Csv\": \"Não\"\r\n            }\r\n        },\r\n        \"RECALL\": {\r\n            \"existe_erro\": \"0\",\r\n            \"Consta\": \"1\",\r\n            \"Recall\": \"Não\",\r\n            \"RecallCodigo\": \"0\"\r\n        },\r\n        \"Decodificador\": {\r\n            \"Existe_erro\": \"0\",\r\n            \"Chassi\": \"YV1XZACADK2072222\",\r\n            \"Fabricante\": \"VOLVO\",\r\n            \"AnoFabricacao\": \"2018\",\r\n            \"AnoModelo\": \"2019\",\r\n            \"Combustivel\": \"GASOLINA\",\r\n            \"TipoDaCarroceria\": \"SUV\",\r\n            \"RegiaoGeografica\": \"EUROPA\",\r\n            \"Pais\": \"SUECIA\",\r\n            \"LocalDaFabrica\": \"Não informado\",\r\n            \"Marca\": \"VOLVO\",\r\n            \"Modelo\": \"VOLVO/XC40 T4\",\r\n            \"Veiculo\": \"XC40 T4\",\r\n            \"Versao\": \"Volvo XC 40 T-4 2.0 190cv FWD\",\r\n            \"Motor\": \"B4204T472730028\",\r\n            \"QuantidadeDeEixos\": \"NÃO INFORMADO\",\r\n            \"TipoDoMotor\": \"NÃO INFORMADO\",\r\n            \"Tracao\": \"NÃO INFORMADO\",\r\n            \"Transmissao\": \"NÃO INFORMADO\",\r\n            \"Portas\": \"Não informado\",\r\n            \"Classificacao\": \"NÃO INFORMADO\",\r\n            \"Comprimento\": \"NÃO INFORMADO\",\r\n            \"MesDeProducao\": \"NÃO INFORMADO\",\r\n            \"PesoBruto\": \"NÃO INFORMADO\",\r\n            \"TipoDeFreio\": \"NÃO INFORMADO\",\r\n            \"DigitoVerificador\": \"NÃO INFORMADO\",\r\n            \"VerificacaoDoSerial\": \"NÃO INFORMADO\",\r\n            \"DistanciaEntreEixos\": \"NÃO INFORMADO\",\r\n            \"Conclusao\": \"NÃO INFORMADO\",\r\n            \"QuantidadeDeIrregularidades\": \"NÃO INFORMADO\"\r\n        },\r\n        \"TABELAFIPE\": {\r\n            \"Existe_erro\": \"0\",\r\n            \"Registro\": {\r\n                \"Codigo\": \"029128-5\",\r\n                \"Descricao\": \"Volvo XC 40 T-4 2.0 190cv FWD\",\r\n                \"Preco\": \"172,819.00\"\r\n            }\r\n        },\r\n        \"LEILAO1\": {\r\n            \"existe_erro\": \"0\",\r\n            \"Consta\": \"0\",\r\n            \"Mensagem\": \"NENHUM REGISTRO DE LEILÃO\"\r\n        },\r\n        \"LEILAO2\": {\r\n            \"existe_erro\": \"0\",\r\n            \"Consta\": \"0\",\r\n            \"Mensagem\": \"NENHUM REGISTRO DE LEILÃO\"\r\n        },\r\n        \"VENDADIRETA\": {\r\n            \"existe_erro\": \"0\",\r\n            \"Consta\": \"0\",\r\n            \"Mensagem\": \"NENHUM REGISTRO ENCONTRADO\"\r\n        },\r\n        \"OFERTADELEILAO\": {\r\n            \"existe_erro\": \"0\",\r\n            \"Consta\": \"0\",\r\n            \"Mensagem\": \"NENHUM REGISTRO DE OFERTA DE LEILÃO PARA A PLACA \"\r\n        },\r\n        \"APONTAMENTODECOMERCIALIZACAO\": {\r\n            \"Existe_erro\": \"0\",\r\n            \"Mensagem\": \"NADA CONSTA\"\r\n        },\r\n        \"HISTORICOAVARIA\": {\r\n            \"existe_erro\": \"0\",\r\n            \"Mensagem\": \"Não possui histórico de avaria\"\r\n        },\r\n        \"SINISTROINDENIZACAO\": {\r\n            \"existe_erro\": \"0\",\r\n            \"Mensagem\": \"NÃO EXISTE OCORRÊNCIA DE SINISTRO DE INDENIZAÇÃO INTEGRAL PARA A PLACA {$placa}\"\r\n        },\r\n        \"INDICIOSINISTRO1\": {\r\n            \"Existe_erro\": \"0\",\r\n            \"Consta\": \"Não\"\r\n        },\r\n        \"INDICIOSINISTRO2\": {\r\n            \"Existe_erro\": \"0\",\r\n            \"Consta\": \"Não\"\r\n        },\r\n        \"PAINELDEMULTAS\": {\r\n            \"Indisponiveis\": {\r\n                \"Mensagem\": \"Todas as bases foram consultadas\"\r\n            },\r\n            \"PAINEL\": {\r\n                \"Mensagem\": \"CONSTAM REGISTROS DE MULTAS E/OU NOTIFICAÇÕES\",\r\n                \"Multas\": {\r\n                    \"Registro\": [\r\n                        {\r\n                            \"OrgaoAutuador\": \"SAO PAULO\",\r\n                            \"AutoDeInfracao\": \"JQA1383978\",\r\n                            \"Descricao\": \"AVANCAR O SINAL VERMELHO EXC A SINALIZ PERM LIVRE CONV A DIR FISC ELETRONICA\",\r\n                            \"DataHora\": \"26/10/2021 - 00:06\",\r\n                            \"Local\": \"AVENIDA NOVE DE JULHO (CENTRO/BAIRRO) X RUA PAIM\",\r\n                            \"Observacao\": \"RENAINF\",\r\n                            \"Valor\": \"R$ 302,41\"\r\n                        },\r\n                        {\r\n                            \"OrgaoAutuador\": \"SAO PAULO\",\r\n                            \"AutoDeInfracao\": \"HVB3771821\",\r\n                            \"Descricao\": \"TRANSITAR EM VELOCIDADE SUPERIOR A MAXIMA PERMITIDA EM ATE 20%\",\r\n                            \"DataHora\": \"12/10/2021 - 06:21\",\r\n                            \"Local\": \"AV ALCANTARA MACHADO (CENTRO/BAIRRO),A MAIS 18M DA R HIPODROMO\",\r\n                            \"Observacao\": \"RENAINF\",\r\n                            \"Valor\": \"R$ 134,12\"\r\n                        },\r\n                        {\r\n                            \"OrgaoAutuador\": \"SAO PAULO\",\r\n                            \"AutoDeInfracao\": \"HVB3913899\",\r\n                            \"Descricao\": \"TRANSITAR EM VELOCIDADE SUPERIOR A MAXIMA PERMITIDA EM ATE 20%\",\r\n                            \"DataHora\": \"10/11/2021 - 20:18\",\r\n                            \"Local\": \"R MELO FREIRE (BAIRRO/CENTRO), A MAIS404 METROS DO VIADUTO CARLOS FERRACI\",\r\n                            \"Observacao\": \"RENAINF\",\r\n                            \"Valor\": \"R$ 134,12\"\r\n                        },\r\n                        {\r\n                            \"OrgaoAutuador\": \"SAO PAULO\",\r\n                            \"AutoDeInfracao\": \"HVB4046730\",\r\n                            \"Descricao\": \"TRANSITAR EM VELOCIDADE SUPERIOR A MAXIMA PERMITIDA EM ATE 20%\",\r\n                            \"DataHora\": \"08/12/2021 - 08:32\",\r\n                            \"Local\": \"AV ALCANTARA MACHADO (CENTRO/BAIRRO),A MAIS 18M DA R HIPODROMO\",\r\n                            \"Observacao\": \"RENAINF\",\r\n                            \"Valor\": \"R$ 134,12\"\r\n                        },\r\n                        {\r\n                            \"OrgaoAutuador\": \"DER\",\r\n                            \"AutoDeInfracao\": \"1DA4157371\",\r\n                            \"Descricao\": \"Ultrapassar pela contramao linha de divisao de fluxos opostos, continua amarela\",\r\n                            \"DataHora\": \"11/06/2022 - 11h16min\",\r\n                            \"Local\": \"SP 036/000\",\r\n                            \"Observacao\": \"-\",\r\n                            \"Valor\": \"R$ 1.467,35\"\r\n                        },\r\n                        {\r\n                            \"OrgaoAutuador\": \"SAO PAULO\",\r\n                            \"AutoDeInfracao\": \"TPA1607381\",\r\n                            \"Descricao\": \"TRANSITAR NA FAIXA OU VIA EXCLUSIVA REGULAM P/TRANSP PUBL COLETIVO PASSAG\",\r\n                            \"DataHora\": \"19/05/2022 - 15:10\",\r\n                            \"Local\": \"AV ALCANTARA MACHADO 04110\",\r\n                            \"Observacao\": \"-\",\r\n                            \"Valor\": \"R$ 293,47\"\r\n                        },\r\n                        {\r\n                            \"OrgaoAutuador\": \"SAO PAULO\",\r\n                            \"AutoDeInfracao\": \"HRA7469250\",\r\n                            \"Descricao\": \"TRANSITAR EM LOCAL/HORARIO NAO PERMITIDO PELA REGULAMENTACAO - RODIZIO\",\r\n                            \"DataHora\": \"26/05/2022 - 08:03\",\r\n                            \"Local\": \"RUA CATUMBI (CENTRO/BAIRRO), NUMERO 318\",\r\n                            \"Observacao\": \"-\",\r\n                            \"Valor\": \"R$ 130,16\"\r\n                        },\r\n                        {\r\n                            \"OrgaoAutuador\": \"SAO PAULO\",\r\n                            \"AutoDeInfracao\": \"GVB1039090\",\r\n                            \"Descricao\": \"TRANSITAR EM VELOCIDADE SUPERIOR A MAXIMA PERMITIDA EM ATE 20%\",\r\n                            \"DataHora\": \"21/05/2022 - 08:22\",\r\n                            \"Local\": \"AVENIDA OLAVO FONTOURA (SANTANA/MARGINAL), NUMERO 1800\",\r\n                            \"Observacao\": \"-\",\r\n                            \"Valor\": \"R$ 130,16\"\r\n                        }\r\n                    ]\r\n                },\r\n                \"Autuacoes\": {\r\n                    \"Registro\": [\r\n                        {\r\n                            \"OrgaoAutuador\": \"SAO PAULO\",\r\n                            \"AutoDeInfracao\": \"HVB3666666\",\r\n                            \"Descricao\": \"TRANSITAR EM VELOCIDADE SUPERIOR A MAXIMA PERMITIDA EM ATE 20%\",\r\n                            \"DataHora\": \"21/09/2021 - 12:52\",\r\n                            \"Local\": \"AVENIDA ALCANTARA MACHADO (CENTRO/BAIRRO), NUMERO 638\",\r\n                            \"Observacao\": \"-\",\r\n                            \"Valor\": \"R$ 130,16\"\r\n                        },\r\n                        {\r\n                            \"OrgaoAutuador\": \"SAO PAULO\",\r\n                            \"AutoDeInfracao\": \"QVB1805740\",\r\n                            \"Descricao\": \"TRANSITAR EM VELOCIDADE SUPERIOR A MAXIMA PERMITIDA EM ATE 20%\",\r\n                            \"DataHora\": \"24/07/2021 - 10:14\",\r\n                            \"Local\": \"AV D RUTH CARDOSO/AV DAS N UNIDAS (I/CB) PT LOCAL A MAIS 140M AV DOS SEMANEIROS\",\r\n                            \"Observacao\": \"-\",\r\n                            \"Valor\": \"R$ 130,16\"\r\n                        },\r\n                        {\r\n                            \"OrgaoAutuador\": \"SAO PAULO\",\r\n                            \"AutoDeInfracao\": \"HVB3280113\",\r\n                            \"Descricao\": \"TRANSITAR EM VELOCIDADE SUPERIOR A MAXIMA PERMITIDA EM ATE 20%\",\r\n                            \"DataHora\": \"11/07/2021 - 21:42\",\r\n                            \"Local\": \"AVENIDA PAES DE BARROS (CENTRO/BAIRRO), NUMERO 2430\",\r\n                            \"Observacao\": \"-\",\r\n                            \"Valor\": \"R$ 130,16\"\r\n                        },\r\n                        {\r\n                            \"OrgaoAutuador\": \"SAO PAULO\",\r\n                            \"AutoDeInfracao\": \"HVB3277909\",\r\n                            \"Descricao\": \"TRANSITAR EM VELOCIDADE SUPERIOR A MAXIMA PERMITIDA EM ATE 20%\",\r\n                            \"DataHora\": \"11/07/2021 - 14:29\",\r\n                            \"Local\": \"AV RANGEL PESTANA (BAIRRO/CENTRO), A MENOS 22M DA R MARIA MARCOLINA\",\r\n                            \"Observacao\": \"-\",\r\n                            \"Valor\": \"R$ 130,16\"\r\n                        },\r\n                        {\r\n                            \"OrgaoAutuador\": \"SAO PAULO\",\r\n                            \"AutoDeInfracao\": \"HVB1934490\",\r\n                            \"Descricao\": \"TRANSITAR EM VELOCIDADE SUPERIOR A MAXIMA PERMITIDA EM ATE 20%\",\r\n                            \"DataHora\": \"15/11/2020 - 07:55\",\r\n                            \"Local\": \"AV CDE DE FRONTIN (C/B), A MAIS 40M DA R MONS FRANCISCO DE PAULA-FX EXC DE ONIB\",\r\n                            \"Observacao\": \"-\",\r\n                            \"Valor\": \"R$ 130,16\"\r\n                        },\r\n                        {\r\n                            \"OrgaoAutuador\": \"SAO PAULO\",\r\n                            \"AutoDeInfracao\": \"HVB1836817\",\r\n                            \"Descricao\": \"TRANSITAR EM VELOCIDADE SUPERIOR A MAXIMA PERMITIDA EM ATE 20%\",\r\n                            \"DataHora\": \"29/10/2020 - 10:32\",\r\n                            \"Local\": \"AV ALCANTARA MACHADO (CENTRO/BAIRRO),A MAIS 18M DA R HIPODROMO\",\r\n                            \"Observacao\": \"-\",\r\n                            \"Valor\": \"R$ 130,16\"\r\n                        },\r\n                        {\r\n                            \"OrgaoAutuador\": \"SAO PAULO\",\r\n                            \"AutoDeInfracao\": \"HVB1741943\",\r\n                            \"Descricao\": \"TRANSITAR EM VELOCIDADE SUPERIOR A MAXIMA PERMITIDA EM ATE 20%\",\r\n                            \"DataHora\": \"12/10/2020 - 19:45\",\r\n                            \"Local\": \"AVENIDA PAES DE BARROS (CENTRO/BAIRRO), NUMERO 2430\",\r\n                            \"Observacao\": \"-\",\r\n                            \"Valor\": \"R$ 130,16\"\r\n                        },\r\n                        {\r\n                            \"OrgaoAutuador\": \"SAO PAULO\",\r\n                            \"AutoDeInfracao\": \"HRA5753047\",\r\n                            \"Descricao\": \"TRANSITAR EM LOCAL/HORARIO NAO PERMITIDO PELA REGULAMENTACAO - RODIZIO\",\r\n                            \"DataHora\": \"08/10/2020 - 17:21\",\r\n                            \"Local\": \"AVENIDA PAES DE BARROS (CENTRO/BAIRRO), NUMERO 2430\",\r\n                            \"Observacao\": \"-\",\r\n                            \"Valor\": \"R$ 130,16\"\r\n                        },\r\n                        {\r\n                            \"OrgaoAutuador\": \"SAO PAULO\",\r\n                            \"AutoDeInfracao\": \"HVB1552287\",\r\n                            \"Descricao\": \"TRANSITAR EM VELOCIDADE SUPERIOR A MAXIMA PERMITIDA EM ATE 20%\",\r\n                            \"DataHora\": \"12/09/2020 - 14:59\",\r\n                            \"Local\": \"AV ALCANTARA MACHADO (BAIRRO/CENTRO),A MENOS 28 METROS DO VIADUTO GUADALAJARA\",\r\n                            \"Observacao\": \"-\",\r\n                            \"Valor\": \"R$ 130,16\"\r\n                        }\r\n                    ]\r\n                },\r\n                \"TotalDebitos\": \"\\r\\n        R$ 3.897,35    \"\r\n            },\r\n            \"FAZENDA\": {\r\n                \"Mensagem\": \"UF Indisponível\"\r\n            }\r\n        }\r\n    }\r\n}</string>",
          "latency": 0,
          "statusCode": 200,
          "label": "",
          "headers": [],
          "filePath": "",
          "sendFileAsBody": false,
          "rules": [
            {
              "target": "query",
              "modifier": "usuario",
              "value": "1349602",
              "operator": "equals"
            },
            {
              "target": "query",
              "modifier": "senha",
              "value": "562428",
              "operator": "equals"
            },
            {
              "target": "query",
              "modifier": "tipoDePesquisa",
              "value": "166",
              "operator": "equals"
            },
            {
              "target": "query",
              "modifier": "identCliente",
              "value": "%3D",
              "operator": "equals"
            },
            {
              "target": "query",
              "modifier": "identSistema",
              "value": "%3D",
              "operator": "equals"
            },
            {
              "target": "query",
              "modifier": "RetornoJson",
              "value": "1",
              "operator": "equals"
            },
            {
              "target": "query",
              "modifier": "parametros",
              "value": "GDP1002",
              "operator": "equals"
            }
          ],
          "rulesOperator": "AND",
          "disableTemplating": false,
          "fallbackTo404": false,
          "default": true
        },
        {
          "uuid": "920e40d1-dc9a-4192-9a2d-011e6eb126b7",
          "body": "<!DOCTYPE html>\n<!--[if lt IE 7]> <html class=\"no-js ie6 oldie\" lang=\"en-US\"> <![endif]-->\n<!--[if IE 7]>    <html class=\"no-js ie7 oldie\" lang=\"en-US\"> <![endif]-->\n<!--[if IE 8]>    <html class=\"no-js ie8 oldie\" lang=\"en-US\"> <![endif]-->\n<!--[if gt IE 8]><!-->\n<html class=\"no-js\" lang=\"en-US\">\n<!--<![endif]-->\n\n<head>\n\n\n\t<title>ws.sisconsulta.com | 524: A timeout occurred</title>\n\t<meta charset=\"UTF-8\" />\n\t<meta http-equiv=\"Content-Type\" content=\"text/html; charset=UTF-8\" />\n\t<meta http-equiv=\"X-UA-Compatible\" content=\"IE=Edge\" />\n\t<meta name=\"robots\" content=\"noindex, nofollow\" />\n\t<meta name=\"viewport\" content=\"width=device-width,initial-scale=1\" />\n\t<link rel=\"stylesheet\" id=\"cf_styles-css\" href=\"/cdn-cgi/styles/main.css\" />\n\n\n\t<script>\n\t\t(function(){if(document.addEventListener&&window.XMLHttpRequest&&JSON&&JSON.stringify){var e=function(a){var c=document.getElementById(\"error-feedback-survey\"),d=document.getElementById(\"error-feedback-success\"),b=new XMLHttpRequest;a={event:\"feedback clicked\",properties:{errorCode:524,helpful:a,version:1}};b.open(\"POST\",\"https://sparrow.cloudflare.com/api/v1/event\");b.setRequestHeader(\"Content-Type\",\"application/json\");b.setRequestHeader(\"Sparrow-Source-Key\",\"c771f0e4b54944bebf4261d44bd79a1e\");\nb.send(JSON.stringify(a));c.classList.add(\"feedback-hidden\");d.classList.remove(\"feedback-hidden\")};document.addEventListener(\"DOMContentLoaded\",function(){var a=document.getElementById(\"error-feedback\"),c=document.getElementById(\"feedback-button-yes\"),d=document.getElementById(\"feedback-button-no\");\"classList\"in a&&(a.classList.remove(\"feedback-hidden\"),c.addEventListener(\"click\",function(){e(!0)}),d.addEventListener(\"click\",function(){e(!1)}))})}})();\n\t</script>\n\n</head>\n\n<body>\n\t<div id=\"cf-wrapper\">\n\n\n\n\t\t<div id=\"cf-error-details\" class=\"p-0\">\n\t\t\t<header class=\"mx-auto pt-10 lg:pt-6 lg:px-8 w-240 lg:w-full mb-8\">\n\t\t\t\t<h1\n\t\t\t\t\tclass=\"inline-block sm:block sm:mb-2 font-light text-60 lg:text-4xl text-black-dark leading-tight mr-2\">\n\n\t\t\t\t\t<span class=\"cf-error-type\">Error</span>\n\t\t\t\t\t<span class=\"cf-error-code\">524</span>\n\t\t\t\t</h1>\n\t\t\t\t<span class=\"inline-block sm:block font-mono text-15 lg:text-sm lg:leading-relaxed\">Ray ID: 72dc3820ab4f4d15 &bull;</span>\n\t\t\t\t<span class=\"inline-block sm:block font-mono text-15 lg:text-sm lg:leading-relaxed\">2022-07-20 14:01:25 UTC</span>\n\t\t\t\t<h2 class=\"text-gray-600 leading-1.3 text-3xl font-light\">A timeout occurred</h2>\n\t\t\t</header>\n\n\t\t\t<div class=\"my-8 bg-gradient-gray\">\n\t\t\t\t<div class=\"w-240 lg:w-full mx-auto\">\n\t\t\t\t\t<div class=\"clearfix md:px-8\">\n\n\t\t\t\t\t\t<div id=\"cf-browser-status\"\n\t\t\t\t\t\t\tclass=\" relative w-1/3 md:w-full py-15 md:p-0 md:py-8 md:text-left md:border-solid md:border-0 md:border-b md:border-gray-400 overflow-hidden float-left md:float-none text-center\">\n\t\t\t\t\t\t\t<div class=\"relative mb-10 md:m-0\">\n\t\t\t\t\t\t\t\t<span class=\"cf-icon-browser block md:hidden h-20 bg-center bg-no-repeat\"></span>\n\t\t\t\t\t\t\t\t<span class=\"cf-icon-ok w-12 h-12 absolute left-1/2 md:left-auto md:right-0 md:top-0 -ml-6 -bottom-4\"></span>\n\t\t\t\t\t\t\t</div>\n\t\t\t\t\t\t\t<span class=\"md:block w-full truncate\">You</span>\n\t\t\t\t\t\t\t<h3 class=\"md:inline-block mt-3 md:mt-0 text-2xl text-gray-600 font-light leading-1.3\">\n\t\t\t\t\t\t\t\tBrowser</h3>\n\t\t\t\t\t\t\t<span class=\"leading-1.3 text-2xl text-green-success\">Working</span>\n\t\t\t\t\t\t</div>\n\n\t\t\t\t\t\t<div id=\"cf-cloudflare-status\"\n\t\t\t\t\t\t\tclass=\" relative w-1/3 md:w-full py-15 md:p-0 md:py-8 md:text-left md:border-solid md:border-0 md:border-b md:border-gray-400 overflow-hidden float-left md:float-none text-center\">\n\t\t\t\t\t\t\t<div class=\"relative mb-10 md:m-0\">\n\t\t\t\t\t\t\t\t<span class=\"cf-icon-cloud block md:hidden h-20 bg-center bg-no-repeat\"></span>\n\t\t\t\t\t\t\t\t<span class=\"cf-icon-ok w-12 h-12 absolute left-1/2 md:left-auto md:right-0 md:top-0 -ml-6 -bottom-4\"></span>\n\t\t\t\t\t\t\t</div>\n\t\t\t\t\t\t\t<span class=\"md:block w-full truncate\">São Paulo</span>\n\t\t\t\t\t\t\t<h3 class=\"md:inline-block mt-3 md:mt-0 text-2xl text-gray-600 font-light leading-1.3\">\n\t\t\t\t\t\t\t\tCloudflare</h3>\n\t\t\t\t\t\t\t<span class=\"leading-1.3 text-2xl text-green-success\">Working</span>\n\t\t\t\t\t\t</div>\n\n\t\t\t\t\t\t<div id=\"cf-host-status\"\n\t\t\t\t\t\t\tclass=\"cf-error-source relative w-1/3 md:w-full py-15 md:p-0 md:py-8 md:text-left md:border-solid md:border-0 md:border-b md:border-gray-400 overflow-hidden float-left md:float-none text-center\">\n\t\t\t\t\t\t\t<div class=\"relative mb-10 md:m-0\">\n\t\t\t\t\t\t\t\t<span class=\"cf-icon-server block md:hidden h-20 bg-center bg-no-repeat\"></span>\n\t\t\t\t\t\t\t\t<span class=\"cf-icon-error w-12 h-12 absolute left-1/2 md:left-auto md:right-0 md:top-0 -ml-6 -bottom-4\"></span>\n\t\t\t\t\t\t\t</div>\n\t\t\t\t\t\t\t<span class=\"md:block w-full truncate\">ws.sisconsulta.com</span>\n\t\t\t\t\t\t\t<h3 class=\"md:inline-block mt-3 md:mt-0 text-2xl text-gray-600 font-light leading-1.3\">Host\n\t\t\t\t\t\t\t</h3>\n\t\t\t\t\t\t\t<span class=\"leading-1.3 text-2xl text-red-error\">Error</span>\n\t\t\t\t\t\t</div>\n\n\t\t\t\t\t</div>\n\n\t\t\t\t</div>\n\t\t\t</div>\n\n\t\t\t<div class=\"w-240 lg:w-full mx-auto mb-8 lg:px-8\">\n\t\t\t\t<div class=\"clearfix\">\n\t\t\t\t\t<div class=\"w-1/2 md:w-full float-left pr-6 md:pb-10 md:pr-0 leading-relaxed\">\n\t\t\t\t\t\t<h2 class=\"text-3xl font-normal leading-1.3 mb-4\">What happened?</h2>\n\t\t\t\t\t\t<p>The origin web server timed out responding to this request.</p>\n\t\t\t\t\t</div>\n\n\t\t\t\t\t<div class=\"w-1/2 md:w-full float-left leading-relaxed\">\n\t\t\t\t\t\t<h2 class=\"text-3xl font-normal leading-1.3 mb-4\">What can I do?</h2>\n\t\t\t\t\t\t<h3 class=\"text-15 font-semibold mb-2\">If you're a visitor of this website:</h3>\n\t\t\t\t\t\t<p class=\"mb-6\">Please try again in a few minutes.</p>\n\n\t\t\t\t\t\t<h3 class=\"text-15 font-semibold mb-2\">If you're the owner of this website:</h3>\n\t\t\t\t\t\t<p><span>The connection to the origin web server was made, but the origin web server timed out before responding. The likely cause is an overloaded background task, database or application, stressing the resources on your web server. To resolve, please work with your hosting provider or web development team to free up resources for your database or overloaded application.</span>\n\t\t\t\t\t\t\t<a rel=\"noopener noreferrer\"\n\t\t\t\t\t\t\t\thref=\"https://support.cloudflare.com/hc/en-us/articles/200171926-Error-524\">Additional\n\t\t\t\t\t\t\t\ttroubleshooting information here.</a></p>\n\t\t\t\t\t</div>\n\t\t\t\t</div>\n\n\t\t\t</div>\n\n\t\t\t<div class=\"feedback-hidden py-8 text-center\" id=\"error-feedback\">\n\t\t\t\t<div id=\"error-feedback-survey\" class=\"footer-line-wrapper\">\n\t\t\t\t\tWas this page helpful?\n\t\t\t\t\t<button class=\"border border-solid bg-white cf-button cursor-pointer ml-4 px-4 py-2 rounded\" id=\"feedback-button-yes\" type=\"button\">Yes</button>\n\t\t\t\t\t<button class=\"border border-solid bg-white cf-button cursor-pointer ml-4 px-4 py-2 rounded\" id=\"feedback-button-no\" type=\"button\">No</button>\n\t\t\t\t</div>\n\t\t\t\t<div class=\"feedback-success feedback-hidden\" id=\"error-feedback-success\">\n\t\t\t\t\tThank you for your feedback!\n\t\t\t\t</div>\n\t\t\t</div>\n\n\n\t\t\t<div\n\t\t\t\tclass=\"cf-error-footer cf-wrapper w-240 lg:w-full py-10 sm:py-4 sm:px-8 mx-auto text-center sm:text-left border-solid border-0 border-t border-gray-300\">\n\t\t\t\t<p class=\"text-13\">\n\t\t\t\t\t<span class=\"cf-footer-item sm:block sm:mb-1\">Cloudflare Ray ID: <strong class=\"font-semibold\">72dc3820ab4f4d15</strong></span>\n\t\t\t\t\t<span class=\"cf-footer-separator sm:hidden\">&bull;</span>\n\t\t\t\t\t<span id=\"cf-footer-item-ip\" class=\"cf-footer-item hidden sm:block sm:mb-1\">\n      Your IP:\n      <button type=\"button\" id=\"cf-footer-ip-reveal\" class=\"cf-footer-ip-reveal-btn\">Click to reveal</button>\n      <span class=\"hidden\" id=\"cf-footer-ip\">67.159.228.134</span>\n\t\t\t\t\t<span class=\"cf-footer-separator sm:hidden\">&bull;</span>\n\t\t\t\t\t</span>\n\t\t\t\t\t<span class=\"cf-footer-item sm:block sm:mb-1\"><span>Performance &amp; security by</span> <a\n\t\t\t\t\t\trel=\"noopener noreferrer\" href=\"https://www.cloudflare.com/5xx-error-landing\" id=\"brand_link\"\n\t\t\t\t\t\ttarget=\"_blank\">Cloudflare</a></span>\n\n\t\t\t\t</p>\n\t\t\t\t<script>\n\t\t\t\t\t(function(){function d(){var b=a.getElementById(\"cf-footer-item-ip\"),c=a.getElementById(\"cf-footer-ip-reveal\");b&&\"classList\"in b&&(b.classList.remove(\"hidden\"),c.addEventListener(\"click\",function(){c.classList.add(\"hidden\");a.getElementById(\"cf-footer-ip\").classList.remove(\"hidden\")}))}var a=document;document.addEventListener&&a.addEventListener(\"DOMContentLoaded\",d)})();\n\t\t\t\t</script>\n\t\t\t</div><!-- /.error-footer -->\n\n\n\t\t</div>\n\t</div>\n</body>\n\n</html>",
          "latency": 0,
          "statusCode": 524,
          "label": "",
          "headers": [],
          "filePath": "",
          "sendFileAsBody": false,
          "rules": [
            {
              "target": "query",
              "modifier": "parametros",
              "value": "1003",
              "operator": "equals"
            }
          ],
          "rulesOperator": "AND",
          "disableTemplating": false,
          "fallbackTo404": false,
          "default": false
        }
      ],
      "enabled": true,
      "randomResponse": false,
      "sequentialResponse": false
    },
    {
      "uuid": "52d6462a-77c7-48f3-b889-af6f96b7473b",
      "documentation": "",
      "method": "get",
      "endpoint": "Wssisconsulta/consultaJSON.asmx/GetConsulta",
      "responses": [
        {
          "uuid": "79e78378-2187-4def-a496-8a18950b8af1",
          "body": "<?xml version=\"1.0\" encoding=\"utf-8\"?>\r\n<string xmlns=\"http://tempuri.org/\">{\r\n    \"Retorno\": {\r\n        \"RETORNO\": {\r\n            \"idPesquisa\": \"2955013\",\r\n            \"Mensagem\": \"Pronta\",\r\n            \"Resultado\": \"Ok\",\r\n            \"RetornoCompleto\": \"1\",\r\n            \"IdentCliente\": \"=\",\r\n            \"ArquivoPesquisa\": \"https://html-consultas.s3.amazonaws.com/2162D6F9800DA4D1658255744MX1HBAQE8R65DD5KSOTND7CQ5.html\"\r\n        },\r\n        \"QUADRORESUMO\": {\r\n            \"Situacao\": \"CIRCULACAO\",\r\n            \"Debitos\": \"SIM\",\r\n            \"Restricoes\": \"NÃO\",\r\n            \"Leilao1\": \"NÃO\",\r\n            \"Leilao2\": \"NÃO\",\r\n            \"VendaDireta\": \"NÃO\",\r\n            \"Remarketing\": \"NÃO\",\r\n            \"Sinistro\": \"NÃO\",\r\n            \"IndicioDeSinistro1\": \"NÃO\",\r\n            \"IndicioDeSinistro2\": \"NÃO\",\r\n            \"TotalDeDebitos\": \"SIM\"\r\n        },\r\n        \"QUADRODEBITOS\": {\r\n            \"IPVA\": \"R$ 0,00\",\r\n            \"Licenciamento\": \"R$ 0,00\",\r\n            \"Multas\": \"R$ 3.897,35\",\r\n            \"DPVAT\": \"R$ 0,00\",\r\n            \"TotalDeDividas\": \"R$ 3.897,35\"\r\n        },\r\n        \"BASENACIONAL\": {\r\n            \"existe_erro\": \"0\",\r\n            \"Mensagem\": \"Parâmetro informado foi localizado.\",\r\n            \"placa\": \"QJV8777\",\r\n            \"chassi\": \"YV1XZACADK2072222\",\r\n            \"Renavam\": \"01167878512\",\r\n            \"Situacao\": \"CIRCULACAO\",\r\n            \"ChassiRemarcado\": \"Não\",\r\n            \"UltimaAtualizacao\": \"08/10/2018\",\r\n            \"Municipio\": \"JOINVILLE\",\r\n            \"UF\": \"SC\",\r\n            \"Procedencia\": \"ESTRANGEIRA\",\r\n            \"Tipo\": \"UTILITARIO\",\r\n            \"Especie\": \"MISTO\",\r\n            \"TipoMontagem\": \"COMPLETA\",\r\n            \"Marca\": \"I/VOLVO XC40 T4\",\r\n            \"MarcaModelo\": \"I/VOLVO XC40 T4\",\r\n            \"Anomod\": \"2019\",\r\n            \"Anofab\": \"2018\",\r\n            \"CapPassag\": \"005\",\r\n            \"Cor\": \"BRANCA\",\r\n            \"Potencia\": \"190\",\r\n            \"Cilindradas\": \"1969\",\r\n            \"Carroceria\": \"NAO APLICA\",\r\n            \"Combustivel\": \"GASOLINA\",\r\n            \"NMotor\": \"B4204T472730028\",\r\n            \"NCambio\": \"NÃO INFORMADO\",\r\n            \"MultaRENAINF\": \"Sim\",\r\n            \"ComunicadodeVenda\": \"Nao\",\r\n            \"PendenciaEmissaoDocumento\": \"Não\",\r\n            \"RestricaoRENAJUD\": \"Nao\",\r\n            \"EmplacamentoEletronico\": \"Nao\",\r\n            \"RestricaoRFB\": \"Sem registro\",\r\n            \"PlacaMercosul\": \"Pre Veicular\",\r\n            \"TipoDocumentoProprietario\": \"CGC\",\r\n            \"NDocumentoProprietario\": \"11.081.531/0001-72\",\r\n            \"TipoDocumentoFaturamento\": \"PESSOA JURIDICA\",\r\n            \"NDocumentoFaturamento\": \"10.918.425/0002-19\",\r\n            \"UfFaturamento\": \"ES\",\r\n            \"Categoria\": \"NÃO INFORMADO\",\r\n            \"DataAtualizacao\": \"00/00/0000\",\r\n            \"NCarroceria\": \"NÃO INFORMADO\",\r\n            \"CMT\": \"4,26\",\r\n            \"PBT\": \"2,16\",\r\n            \"CapacidadedeCarga\": \"0,51\",\r\n            \"Eixos\": \"02\",\r\n            \"NEixoAuxiliar\": \"NÃO INFORMADO\",\r\n            \"NEixoTraseiro\": \"NÃO INFORMADO\",\r\n            \"Restricao01\": \"Nada consta\",\r\n            \"Restricao02\": \"Nada consta\",\r\n            \"Restricao03\": \"Nada consta\",\r\n            \"Restricao04\": \"Nada consta\",\r\n            \"RFativo\": \"VEICULO NÃO POSSUI ROUBO/FURTO ATIVO.\"\r\n        },\r\n        \"HISTORICOROUBOFURTO\": {\r\n            \"existe_erro\": \"0\",\r\n            \"Consta\": \"0\",\r\n            \"Mensagem\": \"VEÍCULO NÃO POSSUÍ HISTÓRICO DE ROUBO E FURTO\"\r\n        },\r\n        \"BASEESTADUAL\": {\r\n            \"existe_erro\": \"0\",\r\n            \"Consta\": \"1\",\r\n            \"Placa\": \"QJV8777\",\r\n            \"Procedencia\": \"ESTRANGEIRO\",\r\n            \"Chassi\": \"YV1XZACADK2072222    \",\r\n            \"Motor\": \"B4204T472730028\",\r\n            \"Renavam\": \"01167878512\",\r\n            \"Cor\": \"BRANCA\",\r\n            \"Anodefabricacao\": \"2018\",\r\n            \"Anodomodelo\": \"2019\",\r\n            \"Municipio\": \"JOINVILLE-SC\",\r\n            \"Qtdpassageiros\": \"005\",\r\n            \"Capacidadecarga\": \"00051\",\r\n            \"Especie\": \"MISTO\",\r\n            \"Carroceria\": \"Não Informado\",\r\n            \"Cambio\": \"Não Informado\",\r\n            \"Eixos\": \"02\",\r\n            \"Cilindradas\": \"Não Informado\",\r\n            \"Remarcacaochassi\": \"Não\",\r\n            \"Categoria\": \"PARTICULAR\",\r\n            \"Tipo\": \"UTILITARIO\",\r\n            \"Cmt\": \"00426\",\r\n            \"Combustivel\": \"GASOLINA\",\r\n            \"DocumentoProprietario\": \"Não informado\",\r\n            \"Marcamodelo\": \"I/VOLVO XC40 T4          \",\r\n            \"PBT\": \"00216\",\r\n            \"Potencia\": \"190\",\r\n            \"Situacao\": \"EM CIRCULACAO\",\r\n            \"DtLmtRestTrib\": \"Não informado\",\r\n            \"RestricoesBaseEstadual\": {\r\n                \"RestricaoAdministrativa\": \"NADA CONSTA\",\r\n                \"BloqueioGuincho\": \"NÃO INFORMADO\",\r\n                \"Furto\": \"NÃO INFORMADO\",\r\n                \"InspecaoAmbiental\": \"NÃO INFORMADO\",\r\n                \"RestricaoJudicial\": \"NADA CONSTA\",\r\n                \"Renajud\": \"NADA CONSTA\",\r\n                \"RestricaoTributaria\": \"NADA CONSTA\",\r\n                \"RestricaoFinanceira\": \"NADA CONSTA\",\r\n                \"OutrasRestricoes\": \"Nada consta\"\r\n            },\r\n            \"DebitosBaseEstadual\": {\r\n                \"Dpvat\": \"0,00\",\r\n                \"Ipva\": \"0,00\",\r\n                \"Licenciamento\": \"0,00\",\r\n                \"Multas\": \"683,95\",\r\n                \"Cetesb\": \"\",\r\n                \"Der\": \"\",\r\n                \"Dersa\": \"\",\r\n                \"Detran\": \"\",\r\n                \"Municipais\": \"\",\r\n                \"PolRodFederal\": \"0,00\",\r\n                \"Renainf\": \"0,00\"\r\n            },\r\n            \"PROPRIETARIOS\": {\r\n                \"Anterior\": \"Não Informado\",\r\n                \"Atual\": \"INSTITUTO LATINO AMERICANO DE DESENV EDU\"\r\n            }\r\n        },\r\n        \"GRAVAMECOMPLETO\": {\r\n            \"existe_erro\": \"0\",\r\n            \"Consta\": \"0\",\r\n            \"Mensagem\": \"VEÍCULO NUNCA CONSTOU DA BASE DE GRAVAMES\",\r\n            \"GravameCodigo\": \"0\"\r\n        },\r\n        \"DENATRANROBO\": {\r\n            \"existe_erro\": \"0\",\r\n            \"Consta\": \"1\",\r\n            \"Resumo\": {\r\n                \"RouboFurtoAtivo\": \"VEÍCULO SEM  OCORRÊNCIA DE FURTO/ROUBO\",\r\n                \"ComunicadoDeVendaAtivo\": \"Não\",\r\n                \"RestricaoJudicial\": \"Não\",\r\n                \"Renajud\": \"Não\",\r\n                \"MultaRenainf\": \"CONSTA\",\r\n                \"Recall\": \"Não\",\r\n                \"RecallCodigo\": \"0\",\r\n                \"Csv\": \"Não\"\r\n            }\r\n        },\r\n        \"RECALL\": {\r\n            \"existe_erro\": \"0\",\r\n            \"Consta\": \"1\",\r\n            \"Recall\": \"Não\",\r\n            \"RecallCodigo\": \"0\"\r\n        },\r\n        \"Decodificador\": {\r\n            \"Existe_erro\": \"0\",\r\n            \"Chassi\": \"YV1XZACADK2072222\",\r\n            \"Fabricante\": \"VOLVO\",\r\n            \"AnoFabricacao\": \"2018\",\r\n            \"AnoModelo\": \"2019\",\r\n            \"Combustivel\": \"GASOLINA\",\r\n            \"TipoDaCarroceria\": \"SUV\",\r\n            \"RegiaoGeografica\": \"EUROPA\",\r\n            \"Pais\": \"SUECIA\",\r\n            \"LocalDaFabrica\": \"Não informado\",\r\n            \"Marca\": \"VOLVO\",\r\n            \"Modelo\": \"VOLVO/XC40 T4\",\r\n            \"Veiculo\": \"XC40 T4\",\r\n            \"Versao\": \"Volvo XC 40 T-4 2.0 190cv FWD\",\r\n            \"Motor\": \"B4204T472730028\",\r\n            \"QuantidadeDeEixos\": \"NÃO INFORMADO\",\r\n            \"TipoDoMotor\": \"NÃO INFORMADO\",\r\n            \"Tracao\": \"NÃO INFORMADO\",\r\n            \"Transmissao\": \"NÃO INFORMADO\",\r\n            \"Portas\": \"Não informado\",\r\n            \"Classificacao\": \"NÃO INFORMADO\",\r\n            \"Comprimento\": \"NÃO INFORMADO\",\r\n            \"MesDeProducao\": \"NÃO INFORMADO\",\r\n            \"PesoBruto\": \"NÃO INFORMADO\",\r\n            \"TipoDeFreio\": \"NÃO INFORMADO\",\r\n            \"DigitoVerificador\": \"NÃO INFORMADO\",\r\n            \"VerificacaoDoSerial\": \"NÃO INFORMADO\",\r\n            \"DistanciaEntreEixos\": \"NÃO INFORMADO\",\r\n            \"Conclusao\": \"NÃO INFORMADO\",\r\n            \"QuantidadeDeIrregularidades\": \"NÃO INFORMADO\"\r\n        },\r\n        \"TABELAFIPE\": {\r\n            \"Existe_erro\": \"0\",\r\n            \"Registro\": {\r\n                \"Codigo\": \"029128-5\",\r\n                \"Descricao\": \"Volvo XC 40 T-4 2.0 190cv FWD\",\r\n                \"Preco\": \"172,819.00\"\r\n            }\r\n        },\r\n        \"LEILAO1\": {\r\n            \"existe_erro\": \"0\",\r\n            \"Consta\": \"0\",\r\n            \"Mensagem\": \"NENHUM REGISTRO DE LEILÃO\"\r\n        },\r\n        \"LEILAO2\": {\r\n            \"existe_erro\": \"0\",\r\n            \"Consta\": \"0\",\r\n            \"Mensagem\": \"NENHUM REGISTRO DE LEILÃO\"\r\n        },\r\n        \"VENDADIRETA\": {\r\n            \"existe_erro\": \"0\",\r\n            \"Consta\": \"0\",\r\n            \"Mensagem\": \"NENHUM REGISTRO ENCONTRADO\"\r\n        },\r\n        \"OFERTADELEILAO\": {\r\n            \"existe_erro\": \"0\",\r\n            \"Consta\": \"0\",\r\n            \"Mensagem\": \"NENHUM REGISTRO DE OFERTA DE LEILÃO PARA A PLACA \"\r\n        },\r\n        \"APONTAMENTODECOMERCIALIZACAO\": {\r\n            \"Existe_erro\": \"0\",\r\n            \"Mensagem\": \"NADA CONSTA\"\r\n        },\r\n        \"HISTORICOAVARIA\": {\r\n            \"existe_erro\": \"0\",\r\n            \"Mensagem\": \"Não possui histórico de avaria\"\r\n        },\r\n        \"SINISTROINDENIZACAO\": {\r\n            \"existe_erro\": \"0\",\r\n            \"Mensagem\": \"NÃO EXISTE OCORRÊNCIA DE SINISTRO DE INDENIZAÇÃO INTEGRAL PARA A PLACA {$placa}\"\r\n        },\r\n        \"INDICIOSINISTRO1\": {\r\n            \"Existe_erro\": \"0\",\r\n            \"Consta\": \"Não\"\r\n        },\r\n        \"INDICIOSINISTRO2\": {\r\n            \"Existe_erro\": \"0\",\r\n            \"Consta\": \"Não\"\r\n        },\r\n        \"PAINELDEMULTAS\": {\r\n            \"Indisponiveis\": {\r\n                \"Mensagem\": \"Todas as bases foram consultadas\"\r\n            },\r\n            \"PAINEL\": {\r\n                \"Mensagem\": \"CONSTAM REGISTROS DE MULTAS E/OU NOTIFICAÇÕES\",\r\n                \"Multas\": {\r\n                    \"Registro\": [\r\n                        {\r\n                            \"OrgaoAutuador\": \"SAO PAULO\",\r\n                            \"AutoDeInfracao\": \"JQA1383978\",\r\n                            \"Descricao\": \"AVANCAR O SINAL VERMELHO EXC A SINALIZ PERM LIVRE CONV A DIR FISC ELETRONICA\",\r\n                            \"DataHora\": \"26/10/2021 - 00:06\",\r\n                            \"Local\": \"AVENIDA NOVE DE JULHO (CENTRO/BAIRRO) X RUA PAIM\",\r\n                            \"Observacao\": \"-\",\r\n                            \"Valor\": \"R$ 302,41\"\r\n                        },\r\n                        {\r\n                            \"OrgaoAutuador\": \"SAO PAULO\",\r\n                            \"AutoDeInfracao\": \"HVB3771821\",\r\n                            \"Descricao\": \"TRANSITAR EM VELOCIDADE SUPERIOR A MAXIMA PERMITIDA EM ATE 20%\",\r\n                            \"DataHora\": \"12/10/2021 - 06:21\",\r\n                            \"Local\": \"AV ALCANTARA MACHADO (CENTRO/BAIRRO),A MAIS 18M DA R HIPODROMO\",\r\n                            \"Observacao\": \"-\",\r\n                            \"Valor\": \"R$ 134,12\"\r\n                        },\r\n                        {\r\n                            \"OrgaoAutuador\": \"SAO PAULO\",\r\n                            \"AutoDeInfracao\": \"HVB3913899\",\r\n                            \"Descricao\": \"TRANSITAR EM VELOCIDADE SUPERIOR A MAXIMA PERMITIDA EM ATE 20%\",\r\n                            \"DataHora\": \"10/11/2021 - 20:18\",\r\n                            \"Local\": \"R MELO FREIRE (BAIRRO/CENTRO), A MAIS404 METROS DO VIADUTO CARLOS FERRACI\",\r\n                            \"Observacao\": \"-\",\r\n                            \"Valor\": \"R$ 134,12\"\r\n                        },\r\n                        {\r\n                            \"OrgaoAutuador\": \"SAO PAULO\",\r\n                            \"AutoDeInfracao\": \"HVB4046730\",\r\n                            \"Descricao\": \"TRANSITAR EM VELOCIDADE SUPERIOR A MAXIMA PERMITIDA EM ATE 20%\",\r\n                            \"DataHora\": \"08/12/2021 - 08:32\",\r\n                            \"Local\": \"AV ALCANTARA MACHADO (CENTRO/BAIRRO),A MAIS 18M DA R HIPODROMO\",\r\n                            \"Observacao\": \"-\",\r\n                            \"Valor\": \"R$ 134,12\"\r\n                        },\r\n                        {\r\n                            \"OrgaoAutuador\": \"DER\",\r\n                            \"AutoDeInfracao\": \"1DA4157371\",\r\n                            \"Descricao\": \"Ultrapassar pela contramao linha de divisao de fluxos opostos, continua amarela\",\r\n                            \"DataHora\": \"11/06/2022 - 11h16min\",\r\n                            \"Local\": \"SP 036/000\",\r\n                            \"Observacao\": \"-\",\r\n                            \"Valor\": \"R$ 1.467,35\"\r\n                        },\r\n                        {\r\n                            \"OrgaoAutuador\": \"SAO PAULO\",\r\n                            \"AutoDeInfracao\": \"TPA1607381\",\r\n                            \"Descricao\": \"TRANSITAR NA FAIXA OU VIA EXCLUSIVA REGULAM P/TRANSP PUBL COLETIVO PASSAG\",\r\n                            \"DataHora\": \"19/05/2022 - 15:10\",\r\n                            \"Local\": \"AV ALCANTARA MACHADO 04110\",\r\n                            \"Observacao\": \"-\",\r\n                            \"Valor\": \"R$ 293,47\"\r\n                        },\r\n                        {\r\n                            \"OrgaoAutuador\": \"SAO PAULO\",\r\n                            \"AutoDeInfracao\": \"HRA7469250\",\r\n                            \"Descricao\": \"TRANSITAR EM LOCAL/HORARIO NAO PERMITIDO PELA REGULAMENTACAO - RODIZIO\",\r\n                            \"DataHora\": \"26/05/2022 - 08:03\",\r\n                            \"Local\": \"RUA CATUMBI (CENTRO/BAIRRO), NUMERO 318\",\r\n                            \"Observacao\": \"-\",\r\n                            \"Valor\": \"R$ 130,16\"\r\n                        },\r\n                        {\r\n                            \"OrgaoAutuador\": \"SAO PAULO\",\r\n                            \"AutoDeInfracao\": \"GVB1039090\",\r\n                            \"Descricao\": \"TRANSITAR EM VELOCIDADE SUPERIOR A MAXIMA PERMITIDA EM ATE 20%\",\r\n                            \"DataHora\": \"21/05/2022 - 08:22\",\r\n                            \"Local\": \"AVENIDA OLAVO FONTOURA (SANTANA/MARGINAL), NUMERO 1800\",\r\n                            \"Observacao\": \"-\",\r\n                            \"Valor\": \"R$ 130,16\"\r\n                        }\r\n                    ]\r\n                },\r\n                \"Autuacoes\": {\r\n                    \"Registro\": [\r\n                        {\r\n                            \"OrgaoAutuador\": \"SAO PAULO\",\r\n                            \"AutoDeInfracao\": \"HVB3666666\",\r\n                            \"Descricao\": \"TRANSITAR EM VELOCIDADE SUPERIOR A MAXIMA PERMITIDA EM ATE 20%\",\r\n                            \"DataHora\": \"21/09/2021 - 12:52\",\r\n                            \"Local\": \"AVENIDA ALCANTARA MACHADO (CENTRO/BAIRRO), NUMERO 638\",\r\n                            \"Observacao\": \"-\",\r\n                            \"Valor\": \"R$ 130,16\"\r\n                        },\r\n                        {\r\n                            \"OrgaoAutuador\": \"SAO PAULO\",\r\n                            \"AutoDeInfracao\": \"QVB1805740\",\r\n                            \"Descricao\": \"TRANSITAR EM VELOCIDADE SUPERIOR A MAXIMA PERMITIDA EM ATE 20%\",\r\n                            \"DataHora\": \"24/07/2021 - 10:14\",\r\n                            \"Local\": \"AV D RUTH CARDOSO/AV DAS N UNIDAS (I/CB) PT LOCAL A MAIS 140M AV DOS SEMANEIROS\",\r\n                            \"Observacao\": \"-\",\r\n                            \"Valor\": \"R$ 130,16\"\r\n                        },\r\n                        {\r\n                            \"OrgaoAutuador\": \"SAO PAULO\",\r\n                            \"AutoDeInfracao\": \"HVB3280113\",\r\n                            \"Descricao\": \"TRANSITAR EM VELOCIDADE SUPERIOR A MAXIMA PERMITIDA EM ATE 20%\",\r\n                            \"DataHora\": \"11/07/2021 - 21:42\",\r\n                            \"Local\": \"AVENIDA PAES DE BARROS (CENTRO/BAIRRO), NUMERO 2430\",\r\n                            \"Observacao\": \"-\",\r\n                            \"Valor\": \"R$ 130,16\"\r\n                        },\r\n                        {\r\n                            \"OrgaoAutuador\": \"SAO PAULO\",\r\n                            \"AutoDeInfracao\": \"HVB3277909\",\r\n                            \"Descricao\": \"TRANSITAR EM VELOCIDADE SUPERIOR A MAXIMA PERMITIDA EM ATE 20%\",\r\n                            \"DataHora\": \"11/07/2021 - 14:29\",\r\n                            \"Local\": \"AV RANGEL PESTANA (BAIRRO/CENTRO), A MENOS 22M DA R MARIA MARCOLINA\",\r\n                            \"Observacao\": \"-\",\r\n                            \"Valor\": \"R$ 130,16\"\r\n                        },\r\n                        {\r\n                            \"OrgaoAutuador\": \"SAO PAULO\",\r\n                            \"AutoDeInfracao\": \"HVB1934490\",\r\n                            \"Descricao\": \"TRANSITAR EM VELOCIDADE SUPERIOR A MAXIMA PERMITIDA EM ATE 20%\",\r\n                            \"DataHora\": \"15/11/2020 - 07:55\",\r\n                            \"Local\": \"AV CDE DE FRONTIN (C/B), A MAIS 40M DA R MONS FRANCISCO DE PAULA-FX EXC DE ONIB\",\r\n                            \"Observacao\": \"-\",\r\n                            \"Valor\": \"R$ 130,16\"\r\n                        },\r\n                        {\r\n                            \"OrgaoAutuador\": \"SAO PAULO\",\r\n                            \"AutoDeInfracao\": \"HVB1836817\",\r\n                            \"Descricao\": \"TRANSITAR EM VELOCIDADE SUPERIOR A MAXIMA PERMITIDA EM ATE 20%\",\r\n                            \"DataHora\": \"29/10/2020 - 10:32\",\r\n                            \"Local\": \"AV ALCANTARA MACHADO (CENTRO/BAIRRO),A MAIS 18M DA R HIPODROMO\",\r\n                            \"Observacao\": \"-\",\r\n                            \"Valor\": \"R$ 130,16\"\r\n                        },\r\n                        {\r\n                            \"OrgaoAutuador\": \"SAO PAULO\",\r\n                            \"AutoDeInfracao\": \"HVB1741943\",\r\n                            \"Descricao\": \"TRANSITAR EM VELOCIDADE SUPERIOR A MAXIMA PERMITIDA EM ATE 20%\",\r\n                            \"DataHora\": \"12/10/2020 - 19:45\",\r\n                            \"Local\": \"AVENIDA PAES DE BARROS (CENTRO/BAIRRO), NUMERO 2430\",\r\n                            \"Observacao\": \"-\",\r\n                            \"Valor\": \"R$ 130,16\"\r\n                        },\r\n                        {\r\n                            \"OrgaoAutuador\": \"SAO PAULO\",\r\n                            \"AutoDeInfracao\": \"HRA5753047\",\r\n                            \"Descricao\": \"TRANSITAR EM LOCAL/HORARIO NAO PERMITIDO PELA REGULAMENTACAO - RODIZIO\",\r\n                            \"DataHora\": \"08/10/2020 - 17:21\",\r\n                            \"Local\": \"AVENIDA PAES DE BARROS (CENTRO/BAIRRO), NUMERO 2430\",\r\n                            \"Observacao\": \"-\",\r\n                            \"Valor\": \"R$ 130,16\"\r\n                        },\r\n                        {\r\n                            \"OrgaoAutuador\": \"SAO PAULO\",\r\n                            \"AutoDeInfracao\": \"HVB1552287\",\r\n                            \"Descricao\": \"TRANSITAR EM VELOCIDADE SUPERIOR A MAXIMA PERMITIDA EM ATE 20%\",\r\n                            \"DataHora\": \"12/09/2020 - 14:59\",\r\n                            \"Local\": \"AV ALCANTARA MACHADO (BAIRRO/CENTRO),A MENOS 28 METROS DO VIADUTO GUADALAJARA\",\r\n                            \"Observacao\": \"-\",\r\n                            \"Valor\": \"R$ 130,16\"\r\n                        }\r\n                    ]\r\n                },\r\n                \"TotalDebitos\": \"\\r\\n        R$ 3.897,35    \"\r\n            },\r\n            \"FAZENDA\": {\r\n                \"Mensagem\": \"UF Indisponível\"\r\n            }\r\n        }\r\n    }\r\n}</string>",
          "latency": 0,
          "statusCode": 200,
          "label": "",
          "headers": [],
          "filePath": "",
          "sendFileAsBody": false,
          "rules": [
            {
              "target": "query",
              "modifier": "usuario",
              "value": "1349602",
              "operator": "equals"
            },
            {
              "target": "query",
              "modifier": "senha",
              "value": "562428",
              "operator": "equals"
            },
            {
              "target": "query",
              "modifier": "RetornoJson",
              "value": "1",
              "operator": "equals"
            },
            {
              "target": "query",
              "modifier": "idPesquisa",
              "value": "2955013",
              "operator": "equals"
            }
          ],
          "rulesOperator": "AND",
          "disableTemplating": false,
          "fallbackTo404": false,
          "default": true
        },
        {
          "uuid": "71448c33-65a8-47fb-a17e-55da0e15759b",
          "body": "<?xml version=\"1.0\" encoding=\"utf-8\"?>\r\n<string xmlns=\"http://tempuri.org/\">{\r\n    \"Retorno\": {\r\n        \"RETORNO\": {\r\n            \"idPesquisa\": \"295\",\r\n            \"Mensagem\": \"Consulta não encontrada.\",\r\n            \"Resultado\": \"Falha\",\r\n            \"RetornoCompleto\": \"0\",\r\n            \"IdentCliente\": \"Não Informado\"\r\n        }\r\n    }\r\n}</string>",
          "latency": 0,
          "statusCode": 200,
          "label": "Fields Empty",
          "headers": [],
          "filePath": "",
          "sendFileAsBody": false,
          "rules": [
            {
              "target": "query",
              "modifier": "usuario",
              "value": "1349602",
              "operator": "equals"
            },
            {
              "target": "query",
              "modifier": "senha",
              "value": "562428",
              "operator": "equals"
            },
            {
              "target": "query",
              "modifier": "RetornoJson",
              "value": "1",
              "operator": "equals"
            },
            {
              "target": "query",
              "modifier": "idPesquisa",
              "value": "295",
              "operator": "equals"
            }
          ],
          "rulesOperator": "AND",
          "disableTemplating": false,
          "fallbackTo404": false,
          "default": false
        },
        {
          "uuid": "11638a84-f28c-4408-9a87-8c3d5ed36e82",
          "body": "<!DOCTYPE html>\n<!--[if lt IE 7\n]> <html class=\"no-js ie6 oldie\" lang=\"en-US\"> <![endif\n]-->\n<!--[if IE 7\n]>    <html class=\"no-js ie7 oldie\" lang=\"en-US\"> <![endif\n]-->\n<!--[if IE 8\n]>    <html class=\"no-js ie8 oldie\" lang=\"en-US\"> <![endif\n]-->\n<!--[if gt IE 8\n]><!--> <html class=\"no-js\" lang=\"en-US\"> <!--<![endif\n]-->\n<head>\n\n\n<title>ws.sisconsulta.com | 524: A timeout occurred</title>\n<meta charset=\"UTF-8\" />\n<meta http-equiv=\"Content-Type\" content=\"text/html; charset=UTF-8\" />\n<meta http-equiv=\"X-UA-Compatible\" content=\"IE=Edge\" />\n<meta name=\"robots\" content=\"noindex, nofollow\" />\n<meta name=\"viewport\" content=\"width=device-width,initial-scale=1\" />\n<link rel=\"stylesheet\" id=\"cf_styles-css\" href=\"/cdn-cgi/styles/main.css\" />\n\n\n<script>\n(function(){if(document.addEventListener&&window.XMLHttpRequest&&JSON&&JSON.stringify){var e=function(a){var c=document.getElementById(\"error-feedback-survey\"),d=document.getElementById(\"error-feedback-success\"),b=new XMLHttpRequest;a={event: \"feedback clicked\",properties: {errorCode: 524,helpful:a,version: 1\n                }\n            };b.open(\"POST\",\n            \"https://sparrow.cloudflare.com/api/v1/event\");b.setRequestHeader(\"Content-Type\",\n            \"application/json\");b.setRequestHeader(\"Sparrow-Source-Key\",\n            \"c771f0e4b54944bebf4261d44bd79a1e\");\nb.send(JSON.stringify(a));c.classList.add(\"feedback-hidden\");d.classList.remove(\"feedback-hidden\")\n        };document.addEventListener(\"DOMContentLoaded\",function(){var a=document.getElementById(\"error-feedback\"),c=document.getElementById(\"feedback-button-yes\"),d=document.getElementById(\"feedback-button-no\");\"classList\"in a&&(a.classList.remove(\"feedback-hidden\"),c.addEventListener(\"click\",function(){e(!0)\n            }),d.addEventListener(\"click\",function(){e(!1)\n            }))\n        })\n    }\n})();\n</script>\n\n</head>\n<body>\n<div id=\"cf-wrapper\">\n\n    \n\n    <div id=\"cf-error-details\" class=\"p-0\">\n        <header class=\"mx-auto pt-10 lg:pt-6 lg:px-8 w-240 lg:w-full mb-8\">\n            <h1 class=\"inline-block sm:block sm:mb-2 font-light text-60 lg:text-4xl text-black-dark leading-tight mr-2\">\n              \n              <span class=\"cf-error-type\">Error</span>\n              <span class=\"cf-error-code\">524</span>\n            </h1>\n            <span class=\"inline-block sm:block font-mono text-15 lg:text-sm lg:leading-relaxed\">Ray ID: 72dd305829325fb6 &bull;</span>\n            <span class=\"inline-block sm:block font-mono text-15 lg:text-sm lg:leading-relaxed\">2022-07-20 16: 50: 52 UTC</span>\n            <h2 class=\"text-gray-600 leading-1.3 text-3xl font-light\">A timeout occurred</h2>\n        </header>\n        \n        <div class=\"my-8 bg-gradient-gray\">\n            <div class=\"w-240 lg:w-full mx-auto\">\n                <div class=\"clearfix md:px-8\">\n                  \n<div id=\"cf-browser-status\" class=\" relative w-1/3 md:w-full py-15 md:p-0 md:py-8 md:text-left md:border-solid md:border-0 md:border-b md:border-gray-400 overflow-hidden float-left md:float-none text-center\">\n  <div class=\"relative mb-10 md:m-0\">\n    <span class=\"cf-icon-browser block md:hidden h-20 bg-center bg-no-repeat\"></span>\n    <span class=\"cf-icon-ok w-12 h-12 absolute left-1/2 md:left-auto md:right-0 md:top-0 -ml-6 -bottom-4\"></span>\n  </div>\n  <span class=\"md:block w-full truncate\">You</span>\n  <h3 class=\"md:inline-block mt-3 md:mt-0 text-2xl text-gray-600 font-light leading-1.3\">Browser</h3>\n  <span class=\"leading-1.3 text-2xl text-green-success\">Working</span>\n</div>\n\n<div id=\"cf-cloudflare-status\" class=\" relative w-1/3 md:w-full py-15 md:p-0 md:py-8 md:text-left md:border-solid md:border-0 md:border-b md:border-gray-400 overflow-hidden float-left md:float-none text-center\">\n  <div class=\"relative mb-10 md:m-0\">\n    <span class=\"cf-icon-cloud block md:hidden h-20 bg-center bg-no-repeat\"></span>\n    <span class=\"cf-icon-ok w-12 h-12 absolute left-1/2 md:left-auto md:right-0 md:top-0 -ml-6 -bottom-4\"></span>\n  </div>\n  <span class=\"md:block w-full truncate\">Seattle</span>\n  <h3 class=\"md:inline-block mt-3 md:mt-0 text-2xl text-gray-600 font-light leading-1.3\">Cloudflare</h3>\n  <span class=\"leading-1.3 text-2xl text-green-success\">Working</span>\n</div>\n\n<div id=\"cf-host-status\" class=\"cf-error-source relative w-1/3 md:w-full py-15 md:p-0 md:py-8 md:text-left md:border-solid md:border-0 md:border-b md:border-gray-400 overflow-hidden float-left md:float-none text-center\">\n  <div class=\"relative mb-10 md:m-0\">\n    <span class=\"cf-icon-server block md:hidden h-20 bg-center bg-no-repeat\"></span>\n    <span class=\"cf-icon-error w-12 h-12 absolute left-1/2 md:left-auto md:right-0 md:top-0 -ml-6 -bottom-4\"></span>\n  </div>\n  <span class=\"md:block w-full truncate\">ws.sisconsulta.com</span>\n  <h3 class=\"md:inline-block mt-3 md:mt-0 text-2xl text-gray-600 font-light leading-1.3\">Host</h3>\n  <span class=\"leading-1.3 text-2xl text-red-error\">Error</span>\n</div>\n\n                </div>\n              \n            </div>\n        </div>\n\n        <div class=\"w-240 lg:w-full mx-auto mb-8 lg:px-8\">\n            <div class=\"clearfix\">\n                <div class=\"w-1/2 md:w-full float-left pr-6 md:pb-10 md:pr-0 leading-relaxed\">\n                    <h2 class=\"text-3xl font-normal leading-1.3 mb-4\">What happened?</h2>\n                    <p>The origin web server timed out responding to this request.</p>\n                </div>\n              \n                <div class=\"w-1/2 md:w-full float-left leading-relaxed\">\n                    <h2 class=\"text-3xl font-normal leading-1.3 mb-4\">What can I do?</h2>\n                          <h3 class=\"text-15 font-semibold mb-2\">If you're a visitor of this website:</h3>\n      <p class=\"mb-6\">Please try again in a few minutes.</p>\n\n      <h3 class=\"text-15 font-semibold mb-2\">If you're the owner of this website:</h3>\n      <p><span>The connection to the origin web server was made, but the origin web server timed out before responding. The likely cause is an overloaded background task, database or application, stressing the resources on your web server. To resolve, please work with your hosting provider or web development team to free up resources for your database or overloaded application.</span> <a rel=\"noopener noreferrer\" href=\"https://support.cloudflare.com/hc/en-us/articles/200171926-Error-524\">Additional troubleshooting information here.</a></p>\n                </div>\n            </div>\n              \n        </div>\n\n        <div class=\"feedback-hidden py-8 text-center\" id=\"error-feedback\">\n    <div id=\"error-feedback-survey\" class=\"footer-line-wrapper\">\n        Was this page helpful?\n        <button class=\"border border-solid bg-white cf-button cursor-pointer ml-4 px-4 py-2 rounded\" id=\"feedback-button-yes\" type=\"button\">Yes</button>\n        <button class=\"border border-solid bg-white cf-button cursor-pointer ml-4 px-4 py-2 rounded\" id=\"feedback-button-no\" type=\"button\">No</button>\n    </div>\n    <div class=\"feedback-success feedback-hidden\" id=\"error-feedback-success\">\n        Thank you for your feedback!\n    </div>\n</div>\n\n\n        <div class=\"cf-error-footer cf-wrapper w-240 lg:w-full py-10 sm:py-4 sm:px-8 mx-auto text-center sm:text-left border-solid border-0 border-t border-gray-300\">\n  <p class=\"text-13\">\n    <span class=\"cf-footer-item sm:block sm:mb-1\">Cloudflare Ray ID: <strong class=\"font-semibold\">72dd305829325fb6</strong></span>\n    <span class=\"cf-footer-separator sm:hidden\">&bull;</span>\n    <span id=\"cf-footer-item-ip\" class=\"cf-footer-item hidden sm:block sm:mb-1\">\n      Your IP:\n      <button type=\"button\" id=\"cf-footer-ip-reveal\" class=\"cf-footer-ip-reveal-btn\">Click to reveal</button>\n      <span class=\"hidden\" id=\"cf-footer-ip\">52.12.249.252</span>\n      <span class=\"cf-footer-separator sm:hidden\">&bull;</span>\n    </span>\n    <span class=\"cf-footer-item sm:block sm:mb-1\"><span>Performance &amp; security by</span> <a rel=\"noopener noreferrer\" href=\"https://www.cloudflare.com/5xx-error-landing\" id=\"brand_link\" target=\"_blank\">Cloudflare</a></span>\n    \n  </p>\n  <script>(function(){function d(){var b=a.getElementById(\"cf-footer-item-ip\"),c=a.getElementById(\"cf-footer-ip-reveal\");b&&\"classList\"in b&&(b.classList.remove(\"hidden\"),c.addEventListener(\"click\",function(){c.classList.add(\"hidden\");a.getElementById(\"cf-footer-ip\").classList.remove(\"hidden\")\n        }))\n    }var a=document;document.addEventListener&&a.addEventListener(\"DOMContentLoaded\",d)\n})();</script>\n</div><!-- /.error-footer -->\n\n\n    </div>\n</div>\n</body>\n</html>\n\n",
          "latency": 0,
          "statusCode": 524,
          "label": "Timeout",
          "headers": [],
          "filePath": "",
          "sendFileAsBody": false,
          "rules": [
            {
              "target": "query",
              "modifier": "usuario",
              "value": "1349602",
              "operator": "equals"
            },
            {
              "target": "query",
              "modifier": "senha",
              "value": "562428",
              "operator": "equals"
            },
            {
              "target": "query",
              "modifier": "RetornoJson",
              "value": "1",
              "operator": "equals"
            },
            {
              "target": "query",
              "modifier": "idPesquisa",
              "value": "296",
              "operator": "equals"
            }
          ],
          "rulesOperator": "AND",
          "disableTemplating": false,
          "fallbackTo404": false,
          "default": false
        }
      ],
      "enabled": true,
      "randomResponse": false,
      "sequentialResponse": false
    }
  ],
  "proxyMode": false,
  "proxyHost": "",
  "proxyRemovePrefix": false,
  "tlsOptions": {
    "enabled": false,
    "type": "CERT",
    "pfxPath": "",
    "certPath": "",
    "keyPath": "",
    "caPath": "",
    "passphrase": ""
  },
  "cors": true,
  "headers": [],
  "proxyReqHeaders": [
    {
      "key": "",
      "value": ""
    }
  ],
  "proxyResHeaders": [
    {
      "key": "",
      "value": ""
    }
  ]
}