solid OpenSCAD_Model
  facet normal -0.951051 -0.309035 0
    outer loop
      vertex 17.4767 -11.7634 2
      vertex 16.9037 -10 10
      vertex 16.9037 -10 2
    endloop
  endfacet
  facet normal -0.951051 -0.309035 0
    outer loop
      vertex 16.9037 -10 10
      vertex 17.4767 -11.7634 2
      vertex 17.4767 -11.7634 10
    endloop
  endfacet
  facet normal 0.587784 0.809018 -0
    outer loop
      vertex 22.3308 -8.23664 2
      vertex 20.8308 -7.14683 10
      vertex 22.3308 -8.23664 10
    endloop
  endfacet
  facet normal 0.587784 0.809018 0
    outer loop
      vertex 20.8308 -7.14683 10
      vertex 22.3308 -8.23664 2
      vertex 20.8308 -7.14683 2
    endloop
  endfacet
  facet normal 0.951065 0.308992 0
    outer loop
      vertex 22.9037 -10 10
      vertex 22.3308 -8.23664 2
      vertex 22.3308 -8.23664 10
    endloop
  endfacet
  facet normal 0.951065 0.308992 0
    outer loop
      vertex 22.3308 -8.23664 2
      vertex 22.9037 -10 10
      vertex 22.9037 -10 2
    endloop
  endfacet
  facet normal 0 1 -0
    outer loop
      vertex 20.8308 -7.14683 2
      vertex 18.9767 -7.14683 10
      vertex 20.8308 -7.14683 10
    endloop
  endfacet
  facet normal 0 1 0
    outer loop
      vertex 18.9767 -7.14683 10
      vertex 20.8308 -7.14683 2
      vertex 18.9767 -7.14683 2
    endloop
  endfacet
  facet normal 0 0 1
    outer loop
      vertex 21.0037 -10 10
      vertex 22.9037 -10 10
      vertex 22.3308 -8.23664 10
    endloop
  endfacet
  facet normal 0 0 1
    outer loop
      vertex 22.9037 -10 10
      vertex 21.0037 -10 10
      vertex 22.3308 -11.7634 10
    endloop
  endfacet
  facet normal 0 0 1
    outer loop
      vertex 20.2436 -8.95384 10
      vertex 22.3308 -8.23664 10
      vertex 20.8308 -7.14683 10
    endloop
  endfacet
  facet normal 0 0 1
    outer loop
      vertex 22.3308 -8.23664 10
      vertex 20.2436 -8.95384 10
      vertex 21.0037 -10 10
    endloop
  endfacet
  facet normal -0 0 1
    outer loop
      vertex 18.9767 -7.14683 10
      vertex 20.2436 -8.95384 10
      vertex 20.8308 -7.14683 10
    endloop
  endfacet
  facet normal -0 0 1
    outer loop
      vertex 17.4767 -8.23664 10
      vertex 19.0138 -9.35344 10
      vertex 18.9767 -7.14683 10
    endloop
  endfacet
  facet normal 0 0 1
    outer loop
      vertex 20.2436 -8.95384 10
      vertex 18.9767 -7.14683 10
      vertex 19.0138 -9.35344 10
    endloop
  endfacet
  facet normal -0 0 1
    outer loop
      vertex 20.2436 -11.0462 10
      vertex 22.3308 -11.7634 10
      vertex 21.0037 -10 10
    endloop
  endfacet
  facet normal 0 0 1
    outer loop
      vertex 22.3308 -11.7634 10
      vertex 20.2436 -11.0462 10
      vertex 20.8308 -12.8532 10
    endloop
  endfacet
  facet normal 0 0 1
    outer loop
      vertex 18.9767 -12.8532 10
      vertex 20.2436 -11.0462 10
      vertex 19.0138 -10.6466 10
    endloop
  endfacet
  facet normal 0 0 1
    outer loop
      vertex 20.2436 -11.0462 10
      vertex 18.9767 -12.8532 10
      vertex 20.8308 -12.8532 10
    endloop
  endfacet
  facet normal 0 0 1
    outer loop
      vertex 16.9037 -10 10
      vertex 19.0138 -9.35344 10
      vertex 17.4767 -8.23664 10
    endloop
  endfacet
  facet normal 0 0 1
    outer loop
      vertex 19.0138 -9.35344 10
      vertex 16.9037 -10 10
      vertex 19.0138 -10.6466 10
    endloop
  endfacet
  facet normal 0 0 1
    outer loop
      vertex 19.0138 -10.6466 10
      vertex 17.4767 -11.7634 10
      vertex 18.9767 -12.8532 10
    endloop
  endfacet
  facet normal 0 0 1
    outer loop
      vertex 19.0138 -10.6466 10
      vertex 16.9037 -10 10
      vertex 17.4767 -11.7634 10
    endloop
  endfacet
  facet normal -0.58778 -0.809021 0
    outer loop
      vertex 17.4767 -11.7634 2
      vertex 18.9767 -12.8532 10
      vertex 17.4767 -11.7634 10
    endloop
  endfacet
  facet normal -0.58778 -0.809021 -0
    outer loop
      vertex 18.9767 -12.8532 10
      vertex 17.4767 -11.7634 2
      vertex 18.9767 -12.8532 2
    endloop
  endfacet
  facet normal 0.951067 -0.308986 0
    outer loop
      vertex 22.3308 -11.7634 10
      vertex 22.9037 -10 2
      vertex 22.9037 -10 10
    endloop
  endfacet
  facet normal 0.951067 -0.308986 0
    outer loop
      vertex 22.9037 -10 2
      vertex 22.3308 -11.7634 10
      vertex 22.3308 -11.7634 2
    endloop
  endfacet
  facet normal -0.587784 0.809018 0
    outer loop
      vertex 18.9767 -7.14683 2
      vertex 17.4767 -8.23664 10
      vertex 18.9767 -7.14683 10
    endloop
  endfacet
  facet normal -0.587784 0.809018 0
    outer loop
      vertex 17.4767 -8.23664 10
      vertex 18.9767 -7.14683 2
      vertex 17.4767 -8.23664 2
    endloop
  endfacet
  facet normal 0 -1 0
    outer loop
      vertex 18.9767 -12.8532 2
      vertex 20.8308 -12.8532 10
      vertex 18.9767 -12.8532 10
    endloop
  endfacet
  facet normal 0 -1 -0
    outer loop
      vertex 20.8308 -12.8532 10
      vertex 18.9767 -12.8532 2
      vertex 20.8308 -12.8532 2
    endloop
  endfacet
  facet normal 0.58778 -0.809021 0
    outer loop
      vertex 20.8308 -12.8532 2
      vertex 22.3308 -11.7634 10
      vertex 20.8308 -12.8532 10
    endloop
  endfacet
  facet normal 0.58778 -0.809021 0
    outer loop
      vertex 22.3308 -11.7634 10
      vertex 20.8308 -12.8532 2
      vertex 22.3308 -11.7634 2
    endloop
  endfacet
  facet normal -0.951049 0.309041 0
    outer loop
      vertex 16.9037 -10 2
      vertex 17.4767 -8.23664 10
      vertex 17.4767 -8.23664 2
    endloop
  endfacet
  facet normal -0.951049 0.309041 0
    outer loop
      vertex 17.4767 -8.23664 10
      vertex 16.9037 -10 2
      vertex 16.9037 -10 10
    endloop
  endfacet
  facet normal 0 0 1
    outer loop
      vertex 14.6194 -137.599 2
      vertex 12.4271 -137.448 2
      vertex 13.5355 -139.221 2
    endloop
  endfacet
  facet normal -0 0 1
    outer loop
      vertex 10.9271 -138.538 2
      vertex 13.5355 -139.221 2
      vertex 12.4271 -137.448 2
    endloop
  endfacet
  facet normal 0 0 1
    outer loop
      vertex 13.5355 -139.221 2
      vertex 10.9271 -138.538 2
      vertex 11.9134 -140.305 2
    endloop
  endfacet
  facet normal 0 0 1
    outer loop
      vertex 10.9271 -138.538 2
      vertex 10 -140.685 2
      vertex 11.9134 -140.305 2
    endloop
  endfacet
  facet normal -0 0 1
    outer loop
      vertex 9.07295 -138.538 2
      vertex 10 -140.685 2
      vertex 10.9271 -138.538 2
    endloop
  endfacet
  facet normal 0 0 1
    outer loop
      vertex 9.07295 -138.538 2
      vertex 8.08658 -140.305 2
      vertex 10 -140.685 2
    endloop
  endfacet
  facet normal 0 0 1
    outer loop
      vertex 6.46447 -139.221 2
      vertex 9.07295 -138.538 2
      vertex 7.57295 -137.448 2
    endloop
  endfacet
  facet normal 0 0 1
    outer loop
      vertex 5.3806 -137.599 2
      vertex 7.57295 -137.448 2
      vertex 7 -135.685 2
    endloop
  endfacet
  facet normal 0 0 1
    outer loop
      vertex 9.07295 -138.538 2
      vertex 6.46447 -139.221 2
      vertex 8.08658 -140.305 2
    endloop
  endfacet
  facet normal 0 0 1
    outer loop
      vertex 7 -135.685 2
      vertex 5 -135.685 2
      vertex 5.3806 -137.599 2
    endloop
  endfacet
  facet normal 0 0 1
    outer loop
      vertex 23.9661 -58.7957 2
      vertex 21.4118 -56.9383 2
      vertex 21.9848 -58.7017 2
    endloop
  endfacet
  facet normal -0 0 1
    outer loop
      vertex 18.9767 -12.8532 2
      vertex 24.7927 -15.9296 2
      vertex 20.8308 -12.8532 2
    endloop
  endfacet
  facet normal 0 0 1
    outer loop
      vertex 24.7927 -15.9296 2
      vertex 19.9118 -55.8485 2
      vertex 21.4118 -56.9383 2
    endloop
  endfacet
  facet normal 0 0 1
    outer loop
      vertex 18.0577 -55.8485 2
      vertex 24.7927 -15.9296 2
      vertex 18.9767 -12.8532 2
    endloop
  endfacet
  facet normal 0 0 1
    outer loop
      vertex 24.7927 -15.9296 2
      vertex 18.0577 -55.8485 2
      vertex 19.9118 -55.8485 2
    endloop
  endfacet
  facet normal 0 0 1
    outer loop
      vertex 17.4767 -11.7634 2
      vertex 18.0577 -55.8485 2
      vertex 18.9767 -12.8532 2
    endloop
  endfacet
  facet normal 0 0 1
    outer loop
      vertex 14.9224 -9.90601 2
      vertex 17.4767 -11.7634 2
      vertex 16.9037 -10 2
    endloop
  endfacet
  facet normal 0 0 1
    outer loop
      vertex 14.9046 -9.90568 2
      vertex 17.4767 -11.7634 2
      vertex 14.9224 -9.90601 2
    endloop
  endfacet
  facet normal 0 0 1
    outer loop
      vertex 116.636 -21.819 2
      vertex 114.849 -23.8912 2
      vertex 116.62 -21.9123 2
    endloop
  endfacet
  facet normal 0 0 1
    outer loop
      vertex 116.636 -21.819 2
      vertex 113.349 -24.981 2
      vertex 114.849 -23.8912 2
    endloop
  endfacet
  facet normal 0 0 1
    outer loop
      vertex 113.349 -24.981 2
      vertex 24.7927 -15.9296 2
      vertex 112.776 -26.7444 2
    endloop
  endfacet
  facet normal 0 0 1
    outer loop
      vertex 22.3308 -8.23664 2
      vertex 113.349 -24.981 2
      vertex 116.636 -21.819 2
    endloop
  endfacet
  facet normal -0 0 1
    outer loop
      vertex 21.4118 -56.9383 2
      vertex 23.9839 -58.796 2
      vertex 24.7927 -15.9296 2
    endloop
  endfacet
  facet normal 0 0 1
    outer loop
      vertex 23.9839 -58.796 2
      vertex 21.4118 -56.9383 2
      vertex 23.9661 -58.7957 2
    endloop
  endfacet
  facet normal -0 0 1
    outer loop
      vertex 22.3308 -11.7634 2
      vertex 24.7927 -15.9296 2
      vertex 22.9037 -10 2
    endloop
  endfacet
  facet normal 0 0 1
    outer loop
      vertex 113.349 -24.981 2
      vertex 22.9037 -10 2
      vertex 24.7927 -15.9296 2
    endloop
  endfacet
  facet normal 0 0 1
    outer loop
      vertex 113.349 -24.981 2
      vertex 22.3308 -8.23664 2
      vertex 22.9037 -10 2
    endloop
  endfacet
  facet normal 0 0 1
    outer loop
      vertex 20.7639 -5.07456 2
      vertex 22.3308 -8.23664 2
      vertex 116.636 -21.819 2
    endloop
  endfacet
  facet normal -0 0 1
    outer loop
      vertex 20.7477 -5.16787 2
      vertex 22.3308 -8.23664 2
      vertex 20.7639 -5.07456 2
    endloop
  endfacet
  facet normal 0 0 1
    outer loop
      vertex 22.3308 -8.23664 2
      vertex 20.7477 -5.16787 2
      vertex 20.8308 -7.14683 2
    endloop
  endfacet
  facet normal 0 0 1
    outer loop
      vertex 19.9037 -5 2
      vertex 20.8308 -7.14683 2
      vertex 20.7477 -5.16787 2
    endloop
  endfacet
  facet normal 0 0 1
    outer loop
      vertex 19.9037 -5 2
      vertex 18.9767 -7.14683 2
      vertex 20.8308 -7.14683 2
    endloop
  endfacet
  facet normal -0 0 1
    outer loop
      vertex 17.9903 -5.3806 2
      vertex 18.9767 -7.14683 2
      vertex 19.9037 -5 2
    endloop
  endfacet
  facet normal -0 0 1
    outer loop
      vertex 16.3682 -6.46447 2
      vertex 18.9767 -7.14683 2
      vertex 17.9903 -5.3806 2
    endloop
  endfacet
  facet normal 0 0 1
    outer loop
      vertex 18.9767 -7.14683 2
      vertex 16.3682 -6.46447 2
      vertex 17.4767 -8.23664 2
    endloop
  endfacet
  facet normal -0 0 1
    outer loop
      vertex 15.2843 -8.08658 2
      vertex 17.4767 -8.23664 2
      vertex 16.3682 -6.46447 2
    endloop
  endfacet
  facet normal 0 0 1
    outer loop
      vertex 17.4767 -8.23664 2
      vertex 15.2843 -8.08658 2
      vertex 16.9037 -10 2
    endloop
  endfacet
  facet normal 0 0 1
    outer loop
      vertex 13.9903 -58.3639 2
      vertex 17.4767 -11.7634 2
      vertex 14.9046 -9.90568 2
    endloop
  endfacet
  facet normal 0 0 1
    outer loop
      vertex 16.9037 -10 2
      vertex 15.2843 -8.08658 2
      vertex 14.9224 -9.90601 2
    endloop
  endfacet
  facet normal 0 0 1
    outer loop
      vertex 118.776 -26.7444 2
      vertex 120.776 -26.7444 2
      vertex 120.395 -24.831 2
    endloop
  endfacet
  facet normal 0 0 1
    outer loop
      vertex 118.203 -24.981 2
      vertex 120.395 -24.831 2
      vertex 119.311 -23.2089 2
    endloop
  endfacet
  facet normal 0 0 1
    outer loop
      vertex 120.776 -26.7444 2
      vertex 118.776 -26.7444 2
      vertex 120.395 -28.6578 2
    endloop
  endfacet
  facet normal -0 0 1
    outer loop
      vertex 118.203 -28.5078 2
      vertex 120.395 -28.6578 2
      vertex 118.776 -26.7444 2
    endloop
  endfacet
  facet normal 0 0 1
    outer loop
      vertex 120.395 -24.831 2
      vertex 118.203 -24.981 2
      vertex 118.776 -26.7444 2
    endloop
  endfacet
  facet normal 0 0 1
    outer loop
      vertex 116.703 -23.8912 2
      vertex 119.311 -23.2089 2
      vertex 117.689 -22.125 2
    endloop
  endfacet
  facet normal 0 0 1
    outer loop
      vertex 119.311 -23.2089 2
      vertex 116.703 -23.8912 2
      vertex 118.203 -24.981 2
    endloop
  endfacet
  facet normal 0 0 1
    outer loop
      vertex 116.62 -21.9123 2
      vertex 116.703 -23.8912 2
      vertex 117.689 -22.125 2
    endloop
  endfacet
  facet normal 0 0 1
    outer loop
      vertex 116.703 -23.8912 2
      vertex 116.62 -21.9123 2
      vertex 114.849 -23.8912 2
    endloop
  endfacet
  facet normal 0 0 1
    outer loop
      vertex 120.395 -28.6578 2
      vertex 118.203 -28.5078 2
      vertex 119.311 -30.2799 2
    endloop
  endfacet
  facet normal -0 0 1
    outer loop
      vertex 116.703 -29.5976 2
      vertex 119.311 -30.2799 2
      vertex 118.203 -28.5078 2
    endloop
  endfacet
  facet normal 0 0 1
    outer loop
      vertex 119.311 -30.2799 2
      vertex 116.703 -29.5976 2
      vertex 117.689 -31.3638 2
    endloop
  endfacet
  facet normal 0 0 1
    outer loop
      vertex 116.703 -29.5976 2
      vertex 115.776 -31.7444 2
      vertex 117.689 -31.3638 2
    endloop
  endfacet
  facet normal -0 0 1
    outer loop
      vertex 114.849 -29.5976 2
      vertex 115.776 -31.7444 2
      vertex 116.703 -29.5976 2
    endloop
  endfacet
  facet normal 0 0 1
    outer loop
      vertex 115.776 -31.7444 2
      vertex 114.849 -29.5976 2
      vertex 114.932 -31.5765 2
    endloop
  endfacet
  facet normal 0 0 1
    outer loop
      vertex 113.349 -28.5078 2
      vertex 114.932 -31.5765 2
      vertex 114.849 -29.5976 2
    endloop
  endfacet
  facet normal 0 0 1
    outer loop
      vertex 114.932 -31.5765 2
      vertex 113.349 -28.5078 2
      vertex 114.915 -31.6698 2
    endloop
  endfacet
  facet normal 0 0 1
    outer loop
      vertex 113.349 -28.5078 2
      vertex 24.7927 -15.9296 2
      vertex 114.915 -31.6698 2
    endloop
  endfacet
  facet normal 0 0 1
    outer loop
      vertex 24.7927 -15.9296 2
      vertex 113.349 -28.5078 2
      vertex 112.776 -26.7444 2
    endloop
  endfacet
  facet normal -0 0 1
    outer loop
      vertex 20.8308 -12.8532 2
      vertex 24.7927 -15.9296 2
      vertex 22.3308 -11.7634 2
    endloop
  endfacet
  facet normal 0 0 1
    outer loop
      vertex 23.9661 -58.7957 2
      vertex 21.9848 -58.7017 2
      vertex 23.8714 -59.272 2
    endloop
  endfacet
  facet normal 0 0 1
    outer loop
      vertex 21.4118 -60.4651 2
      vertex 23.8714 -59.272 2
      vertex 21.9848 -58.7017 2
    endloop
  endfacet
  facet normal 0 0 1
    outer loop
      vertex 21.4118 -60.4651 2
      vertex 23.9511 -59.2813 2
      vertex 23.8714 -59.272 2
    endloop
  endfacet
  facet normal 0 0 1
    outer loop
      vertex 19.9118 -61.5549 2
      vertex 23.9511 -59.2813 2
      vertex 21.4118 -60.4651 2
    endloop
  endfacet
  facet normal 0 0 1
    outer loop
      vertex 12.4271 -133.922 2
      vertex 23.9511 -59.2813 2
      vertex 19.9118 -61.5549 2
    endloop
  endfacet
  facet normal 0 0 1
    outer loop
      vertex 10.9271 -132.832 2
      vertex 19.9118 -61.5549 2
      vertex 18.0577 -61.5549 2
    endloop
  endfacet
  facet normal 0 0 1
    outer loop
      vertex 9.07295 -132.832 2
      vertex 18.0577 -61.5549 2
      vertex 16.5577 -60.4651 2
    endloop
  endfacet
  facet normal 0 0 1
    outer loop
      vertex 13.9903 -58.3639 2
      vertex 16.5577 -60.4651 2
      vertex 15.9848 -58.7017 2
    endloop
  endfacet
  facet normal 0 0 1
    outer loop
      vertex 17.4767 -11.7634 2
      vertex 13.9903 -58.3639 2
      vertex 18.0577 -55.8485 2
    endloop
  endfacet
  facet normal 0 0 1
    outer loop
      vertex 16.5577 -56.9383 2
      vertex 13.9903 -58.3639 2
      vertex 15.9848 -58.7017 2
    endloop
  endfacet
  facet normal 0 0 1
    outer loop
      vertex 18.0577 -55.8485 2
      vertex 13.9903 -58.3639 2
      vertex 16.5577 -56.9383 2
    endloop
  endfacet
  facet normal 0 0 1
    outer loop
      vertex 16.5577 -60.4651 2
      vertex 13.9903 -58.3639 2
      vertex 9.07295 -132.832 2
    endloop
  endfacet
  facet normal 0 0 1
    outer loop
      vertex 23.9511 -59.2813 2
      vertex 12.4271 -133.922 2
      vertex 14.9663 -136.265 2
    endloop
  endfacet
  facet normal 0 0 1
    outer loop
      vertex 14.9663 -136.265 2
      vertex 12.4271 -133.922 2
      vertex 14.8866 -136.255 2
    endloop
  endfacet
  facet normal -0 -0 1
    outer loop
      vertex 13 -135.685 2
      vertex 14.8866 -136.255 2
      vertex 12.4271 -133.922 2
    endloop
  endfacet
  facet normal -0 0 1
    outer loop
      vertex 12.4271 -137.448 2
      vertex 14.6194 -137.599 2
      vertex 13 -135.685 2
    endloop
  endfacet
  facet normal 0 0 1
    outer loop
      vertex 14.8866 -136.255 2
      vertex 13 -135.685 2
      vertex 14.6194 -137.599 2
    endloop
  endfacet
  facet normal 0 0 1
    outer loop
      vertex 19.9118 -61.5549 2
      vertex 10.9271 -132.832 2
      vertex 12.4271 -133.922 2
    endloop
  endfacet
  facet normal 0 0 1
    outer loop
      vertex 18.0577 -61.5549 2
      vertex 9.07295 -132.832 2
      vertex 10.9271 -132.832 2
    endloop
  endfacet
  facet normal 0 0 1
    outer loop
      vertex 5.03371 -135.105 2
      vertex 9.07295 -132.832 2
      vertex 13.9903 -58.3639 2
    endloop
  endfacet
  facet normal 0 0 1
    outer loop
      vertex 9.07295 -132.832 2
      vertex 5.03371 -135.105 2
      vertex 7.57295 -133.922 2
    endloop
  endfacet
  facet normal 0 0 1
    outer loop
      vertex 7.57295 -133.922 2
      vertex 5.11344 -135.115 2
      vertex 7 -135.685 2
    endloop
  endfacet
  facet normal 0 0 1
    outer loop
      vertex 5 -135.685 2
      vertex 7 -135.685 2
      vertex 5.11344 -135.115 2
    endloop
  endfacet
  facet normal 0 0 1
    outer loop
      vertex 7.57295 -137.448 2
      vertex 5.3806 -137.599 2
      vertex 6.46447 -139.221 2
    endloop
  endfacet
  facet normal 0 0 1
    outer loop
      vertex 7.57295 -133.922 2
      vertex 5.03371 -135.105 2
      vertex 5.11344 -135.115 2
    endloop
  endfacet
  facet normal 0 0 1
    outer loop
      vertex 116.116 -25.6982 2
      vertex 116.116 -27.7906 2
      vertex 116.876 -26.7444 2
    endloop
  endfacet
  facet normal -0 0 1
    outer loop
      vertex 114.886 -26.0978 2
      vertex 116.116 -27.7906 2
      vertex 116.116 -25.6982 2
    endloop
  endfacet
  facet normal 0 0 1
    outer loop
      vertex 116.116 -27.7906 2
      vertex 114.886 -26.0978 2
      vertex 114.886 -27.391 2
    endloop
  endfacet
  facet normal 0 0 1
    outer loop
      vertex 10.3399 -134.639 2
      vertex 10.3399 -136.731 2
      vertex 11.1 -135.685 2
    endloop
  endfacet
  facet normal -0 0 1
    outer loop
      vertex 9.11008 -135.039 2
      vertex 10.3399 -136.731 2
      vertex 10.3399 -134.639 2
    endloop
  endfacet
  facet normal 0 0 1
    outer loop
      vertex 10.3399 -136.731 2
      vertex 9.11008 -135.039 2
      vertex 9.11008 -136.332 2
    endloop
  endfacet
  facet normal 0 0 1
    outer loop
      vertex 19.3247 -57.6555 2
      vertex 19.3247 -59.7479 2
      vertex 20.0848 -58.7017 2
    endloop
  endfacet
  facet normal -0 0 1
    outer loop
      vertex 18.0949 -58.0551 2
      vertex 19.3247 -59.7479 2
      vertex 19.3247 -57.6555 2
    endloop
  endfacet
  facet normal 0 0 1
    outer loop
      vertex 19.3247 -59.7479 2
      vertex 18.0949 -58.0551 2
      vertex 18.0949 -59.3483 2
    endloop
  endfacet
  facet normal 0 0 1
    outer loop
      vertex 20.2436 -8.95384 2
      vertex 20.2436 -11.0462 2
      vertex 21.0037 -10 2
    endloop
  endfacet
  facet normal -0 0 1
    outer loop
      vertex 19.0138 -9.35344 2
      vertex 20.2436 -11.0462 2
      vertex 20.2436 -8.95384 2
    endloop
  endfacet
  facet normal 0 0 1
    outer loop
      vertex 20.2436 -11.0462 2
      vertex 19.0138 -9.35344 2
      vertex 19.0138 -10.6466 2
    endloop
  endfacet
  facet normal 0.309027 0.951053 -0
    outer loop
      vertex 20.2436 -11.0462 2
      vertex 19.0138 -10.6466 10
      vertex 20.2436 -11.0462 10
    endloop
  endfacet
  facet normal 0.309027 0.951053 0
    outer loop
      vertex 19.0138 -10.6466 10
      vertex 20.2436 -11.0462 2
      vertex 19.0138 -10.6466 2
    endloop
  endfacet
  facet normal 0.309027 -0.951053 0
    outer loop
      vertex 19.0138 -9.35344 2
      vertex 20.2436 -8.95384 10
      vertex 19.0138 -9.35344 10
    endloop
  endfacet
  facet normal 0.309027 -0.951053 0
    outer loop
      vertex 20.2436 -8.95384 10
      vertex 19.0138 -9.35344 2
      vertex 20.2436 -8.95384 2
    endloop
  endfacet
  facet normal -0.80901 -0.587796 0
    outer loop
      vertex 21.0037 -10 2
      vertex 20.2436 -8.95384 10
      vertex 20.2436 -8.95384 2
    endloop
  endfacet
  facet normal -0.80901 -0.587796 0
    outer loop
      vertex 20.2436 -8.95384 10
      vertex 21.0037 -10 2
      vertex 21.0037 -10 10
    endloop
  endfacet
  facet normal 1 -0 0
    outer loop
      vertex 19.0138 -10.6466 10
      vertex 19.0138 -9.35344 2
      vertex 19.0138 -9.35344 10
    endloop
  endfacet
  facet normal 1 0 0
    outer loop
      vertex 19.0138 -9.35344 2
      vertex 19.0138 -10.6466 10
      vertex 19.0138 -10.6466 2
    endloop
  endfacet
  facet normal -0.80902 0.587781 0
    outer loop
      vertex 20.2436 -11.0462 2
      vertex 21.0037 -10 10
      vertex 21.0037 -10 2
    endloop
  endfacet
  facet normal -0.80902 0.587781 0
    outer loop
      vertex 21.0037 -10 10
      vertex 20.2436 -11.0462 2
      vertex 20.2436 -11.0462 10
    endloop
  endfacet
  facet normal -0.951067 -0.308986 0
    outer loop
      vertex 16.5577 -60.4651 2
      vertex 15.9848 -58.7017 10
      vertex 15.9848 -58.7017 2
    endloop
  endfacet
  facet normal -0.951067 -0.308986 0
    outer loop
      vertex 15.9848 -58.7017 10
      vertex 16.5577 -60.4651 2
      vertex 16.5577 -60.4651 10
    endloop
  endfacet
  facet normal 0.58778 0.809021 -0
    outer loop
      vertex 21.4118 -56.9383 2
      vertex 19.9118 -55.8485 10
      vertex 21.4118 -56.9383 10
    endloop
  endfacet
  facet normal 0.58778 0.809021 0
    outer loop
      vertex 19.9118 -55.8485 10
      vertex 21.4118 -56.9383 2
      vertex 19.9118 -55.8485 2
    endloop
  endfacet
  facet normal 0.951051 0.309035 0
    outer loop
      vertex 21.9848 -58.7017 10
      vertex 21.4118 -56.9383 2
      vertex 21.4118 -56.9383 10
    endloop
  endfacet
  facet normal 0.951051 0.309035 0
    outer loop
      vertex 21.4118 -56.9383 2
      vertex 21.9848 -58.7017 10
      vertex 21.9848 -58.7017 2
    endloop
  endfacet
  facet normal 0 1 -0
    outer loop
      vertex 19.9118 -55.8485 2
      vertex 18.0577 -55.8485 10
      vertex 19.9118 -55.8485 10
    endloop
  endfacet
  facet normal 0 1 0
    outer loop
      vertex 18.0577 -55.8485 10
      vertex 19.9118 -55.8485 2
      vertex 18.0577 -55.8485 2
    endloop
  endfacet
  facet normal 0 0 1
    outer loop
      vertex 20.0848 -58.7017 10
      vertex 21.9848 -58.7017 10
      vertex 21.4118 -56.9383 10
    endloop
  endfacet
  facet normal 0 0 1
    outer loop
      vertex 21.9848 -58.7017 10
      vertex 20.0848 -58.7017 10
      vertex 21.4118 -60.4651 10
    endloop
  endfacet
  facet normal 0 0 1
    outer loop
      vertex 19.3247 -57.6555 10
      vertex 21.4118 -56.9383 10
      vertex 19.9118 -55.8485 10
    endloop
  endfacet
  facet normal 0 0 1
    outer loop
      vertex 21.4118 -56.9383 10
      vertex 19.3247 -57.6555 10
      vertex 20.0848 -58.7017 10
    endloop
  endfacet
  facet normal -0 0 1
    outer loop
      vertex 18.0577 -55.8485 10
      vertex 19.3247 -57.6555 10
      vertex 19.9118 -55.8485 10
    endloop
  endfacet
  facet normal -0 0 1
    outer loop
      vertex 16.5577 -56.9383 10
      vertex 18.0949 -58.0551 10
      vertex 18.0577 -55.8485 10
    endloop
  endfacet
  facet normal 0 0 1
    outer loop
      vertex 19.3247 -57.6555 10
      vertex 18.0577 -55.8485 10
      vertex 18.0949 -58.0551 10
    endloop
  endfacet
  facet normal -0 0 1
    outer loop
      vertex 19.3247 -59.7479 10
      vertex 21.4118 -60.4651 10
      vertex 20.0848 -58.7017 10
    endloop
  endfacet
  facet normal 0 0 1
    outer loop
      vertex 21.4118 -60.4651 10
      vertex 19.3247 -59.7479 10
      vertex 19.9118 -61.5549 10
    endloop
  endfacet
  facet normal 0 0 1
    outer loop
      vertex 18.0577 -61.5549 10
      vertex 19.3247 -59.7479 10
      vertex 18.0949 -59.3483 10
    endloop
  endfacet
  facet normal 0 0 1
    outer loop
      vertex 19.3247 -59.7479 10
      vertex 18.0577 -61.5549 10
      vertex 19.9118 -61.5549 10
    endloop
  endfacet
  facet normal 0 0 1
    outer loop
      vertex 15.9848 -58.7017 10
      vertex 18.0949 -58.0551 10
      vertex 16.5577 -56.9383 10
    endloop
  endfacet
  facet normal 0 0 1
    outer loop
      vertex 18.0949 -58.0551 10
      vertex 15.9848 -58.7017 10
      vertex 18.0949 -59.3483 10
    endloop
  endfacet
  facet normal 0 0 1
    outer loop
      vertex 18.0949 -59.3483 10
      vertex 16.5577 -60.4651 10
      vertex 18.0577 -61.5549 10
    endloop
  endfacet
  facet normal 0 0 1
    outer loop
      vertex 18.0949 -59.3483 10
      vertex 15.9848 -58.7017 10
      vertex 16.5577 -60.4651 10
    endloop
  endfacet
  facet normal -0.58778 -0.809021 0
    outer loop
      vertex 16.5577 -60.4651 2
      vertex 18.0577 -61.5549 10
      vertex 16.5577 -60.4651 10
    endloop
  endfacet
  facet normal -0.58778 -0.809021 -0
    outer loop
      vertex 18.0577 -61.5549 10
      vertex 16.5577 -60.4651 2
      vertex 18.0577 -61.5549 2
    endloop
  endfacet
  facet normal 0.951051 -0.309035 0
    outer loop
      vertex 21.4118 -60.4651 10
      vertex 21.9848 -58.7017 2
      vertex 21.9848 -58.7017 10
    endloop
  endfacet
  facet normal 0.951051 -0.309035 0
    outer loop
      vertex 21.9848 -58.7017 2
      vertex 21.4118 -60.4651 10
      vertex 21.4118 -60.4651 2
    endloop
  endfacet
  facet normal -0.58778 0.809021 0
    outer loop
      vertex 18.0577 -55.8485 2
      vertex 16.5577 -56.9383 10
      vertex 18.0577 -55.8485 10
    endloop
  endfacet
  facet normal -0.58778 0.809021 0
    outer loop
      vertex 16.5577 -56.9383 10
      vertex 18.0577 -55.8485 2
      vertex 16.5577 -56.9383 2
    endloop
  endfacet
  facet normal 0 -1 0
    outer loop
      vertex 18.0577 -61.5549 2
      vertex 19.9118 -61.5549 10
      vertex 18.0577 -61.5549 10
    endloop
  endfacet
  facet normal 0 -1 -0
    outer loop
      vertex 19.9118 -61.5549 10
      vertex 18.0577 -61.5549 2
      vertex 19.9118 -61.5549 2
    endloop
  endfacet
  facet normal 0.58778 -0.809021 0
    outer loop
      vertex 19.9118 -61.5549 2
      vertex 21.4118 -60.4651 10
      vertex 19.9118 -61.5549 10
    endloop
  endfacet
  facet normal 0.58778 -0.809021 0
    outer loop
      vertex 21.4118 -60.4651 10
      vertex 19.9118 -61.5549 2
      vertex 21.4118 -60.4651 2
    endloop
  endfacet
  facet normal -0.951067 0.308986 0
    outer loop
      vertex 15.9848 -58.7017 2
      vertex 16.5577 -56.9383 10
      vertex 16.5577 -56.9383 2
    endloop
  endfacet
  facet normal -0.951067 0.308986 0
    outer loop
      vertex 16.5577 -56.9383 10
      vertex 15.9848 -58.7017 2
      vertex 15.9848 -58.7017 10
    endloop
  endfacet
  facet normal 0.309027 0.951053 -0
    outer loop
      vertex 19.3247 -59.7479 2
      vertex 18.0949 -59.3483 10
      vertex 19.3247 -59.7479 10
    endloop
  endfacet
  facet normal 0.309027 0.951053 0
    outer loop
      vertex 18.0949 -59.3483 10
      vertex 19.3247 -59.7479 2
      vertex 18.0949 -59.3483 2
    endloop
  endfacet
  facet normal 0.309027 -0.951053 0
    outer loop
      vertex 18.0949 -58.0551 2
      vertex 19.3247 -57.6555 10
      vertex 18.0949 -58.0551 10
    endloop
  endfacet
  facet normal 0.309027 -0.951053 0
    outer loop
      vertex 19.3247 -57.6555 10
      vertex 18.0949 -58.0551 2
      vertex 19.3247 -57.6555 2
    endloop
  endfacet
  facet normal -0.80902 -0.587781 0
    outer loop
      vertex 20.0848 -58.7017 2
      vertex 19.3247 -57.6555 10
      vertex 19.3247 -57.6555 2
    endloop
  endfacet
  facet normal -0.80902 -0.587781 0
    outer loop
      vertex 19.3247 -57.6555 10
      vertex 20.0848 -58.7017 2
      vertex 20.0848 -58.7017 10
    endloop
  endfacet
  facet normal 1 -0 0
    outer loop
      vertex 18.0949 -59.3483 10
      vertex 18.0949 -58.0551 2
      vertex 18.0949 -58.0551 10
    endloop
  endfacet
  facet normal 1 0 0
    outer loop
      vertex 18.0949 -58.0551 2
      vertex 18.0949 -59.3483 10
      vertex 18.0949 -59.3483 2
    endloop
  endfacet
  facet normal -0.80902 0.587781 0
    outer loop
      vertex 19.3247 -59.7479 2
      vertex 20.0848 -58.7017 10
      vertex 20.0848 -58.7017 2
    endloop
  endfacet
  facet normal -0.80902 0.587781 0
    outer loop
      vertex 20.0848 -58.7017 10
      vertex 19.3247 -59.7479 2
      vertex 19.3247 -59.7479 10
    endloop
  endfacet
  facet normal -0.951038 -0.309074 0
    outer loop
      vertex 7.57295 -137.448 2
      vertex 7 -135.685 10
      vertex 7 -135.685 2
    endloop
  endfacet
  facet normal -0.951038 -0.309074 0
    outer loop
      vertex 7 -135.685 10
      vertex 7.57295 -137.448 2
      vertex 7.57295 -137.448 10
    endloop
  endfacet
  facet normal 0.587851 0.808969 -0
    outer loop
      vertex 12.4271 -133.922 2
      vertex 10.9271 -132.832 10
      vertex 12.4271 -133.922 10
    endloop
  endfacet
  facet normal 0.587851 0.808969 0
    outer loop
      vertex 10.9271 -132.832 10
      vertex 12.4271 -133.922 2
      vertex 10.9271 -132.832 2
    endloop
  endfacet
  facet normal 0.951046 0.309049 0
    outer loop
      vertex 13 -135.685 10
      vertex 12.4271 -133.922 2
      vertex 12.4271 -133.922 10
    endloop
  endfacet
  facet normal 0.951046 0.309049 0
    outer loop
      vertex 12.4271 -133.922 2
      vertex 13 -135.685 10
      vertex 13 -135.685 2
    endloop
  endfacet
  facet normal 0 1 -0
    outer loop
      vertex 10.9271 -132.832 2
      vertex 9.07295 -132.832 10
      vertex 10.9271 -132.832 10
    endloop
  endfacet
  facet normal 0 1 0
    outer loop
      vertex 9.07295 -132.832 10
      vertex 10.9271 -132.832 2
      vertex 9.07295 -132.832 2
    endloop
  endfacet
  facet normal 0 0 1
    outer loop
      vertex 11.1 -135.685 10
      vertex 13 -135.685 10
      vertex 12.4271 -133.922 10
    endloop
  endfacet
  facet normal 0 0 1
    outer loop
      vertex 13 -135.685 10
      vertex 11.1 -135.685 10
      vertex 12.4271 -137.448 10
    endloop
  endfacet
  facet normal 0 0 1
    outer loop
      vertex 10.3399 -134.639 10
      vertex 12.4271 -133.922 10
      vertex 10.9271 -132.832 10
    endloop
  endfacet
  facet normal 0 0 1
    outer loop
      vertex 12.4271 -133.922 10
      vertex 10.3399 -134.639 10
      vertex 11.1 -135.685 10
    endloop
  endfacet
  facet normal -0 0 1
    outer loop
      vertex 9.07295 -132.832 10
      vertex 10.3399 -134.639 10
      vertex 10.9271 -132.832 10
    endloop
  endfacet
  facet normal -0 0 1
    outer loop
      vertex 7.57295 -133.922 10
      vertex 9.11008 -135.039 10
      vertex 9.07295 -132.832 10
    endloop
  endfacet
  facet normal 0 0 1
    outer loop
      vertex 10.3399 -134.639 10
      vertex 9.07295 -132.832 10
      vertex 9.11008 -135.039 10
    endloop
  endfacet
  facet normal -0 0 1
    outer loop
      vertex 10.3399 -136.731 10
      vertex 12.4271 -137.448 10
      vertex 11.1 -135.685 10
    endloop
  endfacet
  facet normal 0 0 1
    outer loop
      vertex 12.4271 -137.448 10
      vertex 10.3399 -136.731 10
      vertex 10.9271 -138.538 10
    endloop
  endfacet
  facet normal 0 0 1
    outer loop
      vertex 9.07295 -138.538 10
      vertex 10.3399 -136.731 10
      vertex 9.11008 -136.332 10
    endloop
  endfacet
  facet normal 0 0 1
    outer loop
      vertex 10.3399 -136.731 10
      vertex 9.07295 -138.538 10
      vertex 10.9271 -138.538 10
    endloop
  endfacet
  facet normal 0 0 1
    outer loop
      vertex 7 -135.685 10
      vertex 9.11008 -135.039 10
      vertex 7.57295 -133.922 10
    endloop
  endfacet
  facet normal 0 0 1
    outer loop
      vertex 9.11008 -135.039 10
      vertex 7 -135.685 10
      vertex 9.11008 -136.332 10
    endloop
  endfacet
  facet normal 0 0 1
    outer loop
      vertex 9.11008 -136.332 10
      vertex 7.57295 -137.448 10
      vertex 9.07295 -138.538 10
    endloop
  endfacet
  facet normal 0 0 1
    outer loop
      vertex 9.11008 -136.332 10
      vertex 7 -135.685 10
      vertex 7.57295 -137.448 10
    endloop
  endfacet
  facet normal -0.587851 -0.808969 0
    outer loop
      vertex 7.57295 -137.448 2
      vertex 9.07295 -138.538 10
      vertex 7.57295 -137.448 10
    endloop
  endfacet
  facet normal -0.587851 -0.808969 -0
    outer loop
      vertex 9.07295 -138.538 10
      vertex 7.57295 -137.448 2
      vertex 9.07295 -138.538 2
    endloop
  endfacet
  facet normal 0.951046 -0.309049 0
    outer loop
      vertex 12.4271 -137.448 10
      vertex 13 -135.685 2
      vertex 13 -135.685 10
    endloop
  endfacet
  facet normal 0.951046 -0.309049 0
    outer loop
      vertex 13 -135.685 2
      vertex 12.4271 -137.448 10
      vertex 12.4271 -137.448 2
    endloop
  endfacet
  facet normal -0.587851 0.808969 0
    outer loop
      vertex 9.07295 -132.832 2
      vertex 7.57295 -133.922 10
      vertex 9.07295 -132.832 10
    endloop
  endfacet
  facet normal -0.587851 0.808969 0
    outer loop
      vertex 7.57295 -133.922 10
      vertex 9.07295 -132.832 2
      vertex 7.57295 -133.922 2
    endloop
  endfacet
  facet normal 0 -1 0
    outer loop
      vertex 9.07295 -138.538 2
      vertex 10.9271 -138.538 10
      vertex 9.07295 -138.538 10
    endloop
  endfacet
  facet normal 0 -1 -0
    outer loop
      vertex 10.9271 -138.538 10
      vertex 9.07295 -138.538 2
      vertex 10.9271 -138.538 2
    endloop
  endfacet
  facet normal 0.587851 -0.808969 0
    outer loop
      vertex 10.9271 -138.538 2
      vertex 12.4271 -137.448 10
      vertex 10.9271 -138.538 10
    endloop
  endfacet
  facet normal 0.587851 -0.808969 0
    outer loop
      vertex 12.4271 -137.448 10
      vertex 10.9271 -138.538 2
      vertex 12.4271 -137.448 2
    endloop
  endfacet
  facet normal -0.951038 0.309074 0
    outer loop
      vertex 7 -135.685 2
      vertex 7.57295 -133.922 10
      vertex 7.57295 -133.922 2
    endloop
  endfacet
  facet normal -0.951038 0.309074 0
    outer loop
      vertex 7.57295 -133.922 10
      vertex 7 -135.685 2
      vertex 7 -135.685 10
    endloop
  endfacet
  facet normal 0.308602 0.951191 -0
    outer loop
      vertex 10.3399 -136.731 2
      vertex 9.11008 -136.332 10
      vertex 10.3399 -136.731 10
    endloop
  endfacet
  facet normal 0.308602 0.951191 0
    outer loop
      vertex 9.11008 -136.332 10
      vertex 10.3399 -136.731 2
      vertex 9.11008 -136.332 2
    endloop
  endfacet
  facet normal 0.309302 -0.950964 0
    outer loop
      vertex 9.11008 -135.039 2
      vertex 10.3399 -134.639 10
      vertex 9.11008 -135.039 10
    endloop
  endfacet
  facet normal 0.309302 -0.950964 0
    outer loop
      vertex 10.3399 -134.639 10
      vertex 9.11008 -135.039 2
      vertex 10.3399 -134.639 2
    endloop
  endfacet
  facet normal -0.808967 -0.587854 0
    outer loop
      vertex 11.1 -135.685 2
      vertex 10.3399 -134.639 10
      vertex 10.3399 -134.639 2
    endloop
  endfacet
  facet normal -0.808967 -0.587854 0
    outer loop
      vertex 10.3399 -134.639 10
      vertex 11.1 -135.685 2
      vertex 11.1 -135.685 10
    endloop
  endfacet
  facet normal 1 -0 0
    outer loop
      vertex 9.11008 -136.332 10
      vertex 9.11008 -135.039 2
      vertex 9.11008 -135.039 10
    endloop
  endfacet
  facet normal 1 0 0
    outer loop
      vertex 9.11008 -135.039 2
      vertex 9.11008 -136.332 10
      vertex 9.11008 -136.332 2
    endloop
  endfacet
  facet normal -0.808967 0.587854 0
    outer loop
      vertex 10.3399 -136.731 2
      vertex 11.1 -135.685 10
      vertex 11.1 -135.685 2
    endloop
  endfacet
  facet normal -0.808967 0.587854 0
    outer loop
      vertex 11.1 -135.685 10
      vertex 10.3399 -136.731 2
      vertex 10.3399 -136.731 10
    endloop
  endfacet
  facet normal -0.951051 -0.309035 0
    outer loop
      vertex 113.349 -28.5078 2
      vertex 112.776 -26.7444 10
      vertex 112.776 -26.7444 2
    endloop
  endfacet
  facet normal -0.951051 -0.309035 0
    outer loop
      vertex 112.776 -26.7444 10
      vertex 113.349 -28.5078 2
      vertex 113.349 -28.5078 10
    endloop
  endfacet
  facet normal 0.58778 0.809021 -0
    outer loop
      vertex 118.203 -24.981 2
      vertex 116.703 -23.8912 10
      vertex 118.203 -24.981 10
    endloop
  endfacet
  facet normal 0.58778 0.809021 0
    outer loop
      vertex 116.703 -23.8912 10
      vertex 118.203 -24.981 2
      vertex 116.703 -23.8912 2
    endloop
  endfacet
  facet normal 0.951051 0.309035 0
    outer loop
      vertex 118.776 -26.7444 10
      vertex 118.203 -24.981 2
      vertex 118.203 -24.981 10
    endloop
  endfacet
  facet normal 0.951051 0.309035 0
    outer loop
      vertex 118.203 -24.981 2
      vertex 118.776 -26.7444 10
      vertex 118.776 -26.7444 2
    endloop
  endfacet
  facet normal 0 1 -0
    outer loop
      vertex 116.703 -23.8912 2
      vertex 114.849 -23.8912 10
      vertex 116.703 -23.8912 10
    endloop
  endfacet
  facet normal 0 1 0
    outer loop
      vertex 114.849 -23.8912 10
      vertex 116.703 -23.8912 2
      vertex 114.849 -23.8912 2
    endloop
  endfacet
  facet normal 0 0 1
    outer loop
      vertex 116.876 -26.7444 10
      vertex 118.776 -26.7444 10
      vertex 118.203 -24.981 10
    endloop
  endfacet
  facet normal 0 0 1
    outer loop
      vertex 118.776 -26.7444 10
      vertex 116.876 -26.7444 10
      vertex 118.203 -28.5078 10
    endloop
  endfacet
  facet normal 0 0 1
    outer loop
      vertex 116.116 -25.6982 10
      vertex 118.203 -24.981 10
      vertex 116.703 -23.8912 10
    endloop
  endfacet
  facet normal 0 0 1
    outer loop
      vertex 118.203 -24.981 10
      vertex 116.116 -25.6982 10
      vertex 116.876 -26.7444 10
    endloop
  endfacet
  facet normal -0 0 1
    outer loop
      vertex 114.849 -23.8912 10
      vertex 116.116 -25.6982 10
      vertex 116.703 -23.8912 10
    endloop
  endfacet
  facet normal -0 0 1
    outer loop
      vertex 113.349 -24.981 10
      vertex 114.886 -26.0978 10
      vertex 114.849 -23.8912 10
    endloop
  endfacet
  facet normal 0 0 1
    outer loop
      vertex 116.116 -25.6982 10
      vertex 114.849 -23.8912 10
      vertex 114.886 -26.0978 10
    endloop
  endfacet
  facet normal -0 0 1
    outer loop
      vertex 116.116 -27.7906 10
      vertex 118.203 -28.5078 10
      vertex 116.876 -26.7444 10
    endloop
  endfacet
  facet normal 0 0 1
    outer loop
      vertex 118.203 -28.5078 10
      vertex 116.116 -27.7906 10
      vertex 116.703 -29.5976 10
    endloop
  endfacet
  facet normal 0 0 1
    outer loop
      vertex 114.849 -29.5976 10
      vertex 116.116 -27.7906 10
      vertex 114.886 -27.391 10
    endloop
  endfacet
  facet normal 0 0 1
    outer loop
      vertex 116.116 -27.7906 10
      vertex 114.849 -29.5976 10
      vertex 116.703 -29.5976 10
    endloop
  endfacet
  facet normal 0 0 1
    outer loop
      vertex 112.776 -26.7444 10
      vertex 114.886 -26.0978 10
      vertex 113.349 -24.981 10
    endloop
  endfacet
  facet normal 0 0 1
    outer loop
      vertex 114.886 -26.0978 10
      vertex 112.776 -26.7444 10
      vertex 114.886 -27.391 10
    endloop
  endfacet
  facet normal 0 0 1
    outer loop
      vertex 114.886 -27.391 10
      vertex 113.349 -28.5078 10
      vertex 114.849 -29.5976 10
    endloop
  endfacet
  facet normal 0 0 1
    outer loop
      vertex 114.886 -27.391 10
      vertex 112.776 -26.7444 10
      vertex 113.349 -28.5078 10
    endloop
  endfacet
  facet normal -0.58778 -0.809021 0
    outer loop
      vertex 113.349 -28.5078 2
      vertex 114.849 -29.5976 10
      vertex 113.349 -28.5078 10
    endloop
  endfacet
  facet normal -0.58778 -0.809021 -0
    outer loop
      vertex 114.849 -29.5976 10
      vertex 113.349 -28.5078 2
      vertex 114.849 -29.5976 2
    endloop
  endfacet
  facet normal 0.951051 -0.309035 0
    outer loop
      vertex 118.203 -28.5078 10
      vertex 118.776 -26.7444 2
      vertex 118.776 -26.7444 10
    endloop
  endfacet
  facet normal 0.951051 -0.309035 0
    outer loop
      vertex 118.776 -26.7444 2
      vertex 118.203 -28.5078 10
      vertex 118.203 -28.5078 2
    endloop
  endfacet
  facet normal -0.58778 0.809021 0
    outer loop
      vertex 114.849 -23.8912 2
      vertex 113.349 -24.981 10
      vertex 114.849 -23.8912 10
    endloop
  endfacet
  facet normal -0.58778 0.809021 0
    outer loop
      vertex 113.349 -24.981 10
      vertex 114.849 -23.8912 2
      vertex 113.349 -24.981 2
    endloop
  endfacet
  facet normal 0 -1 0
    outer loop
      vertex 114.849 -29.5976 2
      vertex 116.703 -29.5976 10
      vertex 114.849 -29.5976 10
    endloop
  endfacet
  facet normal 0 -1 -0
    outer loop
      vertex 116.703 -29.5976 10
      vertex 114.849 -29.5976 2
      vertex 116.703 -29.5976 2
    endloop
  endfacet
  facet normal 0.58778 -0.809021 0
    outer loop
      vertex 116.703 -29.5976 2
      vertex 118.203 -28.5078 10
      vertex 116.703 -29.5976 10
    endloop
  endfacet
  facet normal 0.58778 -0.809021 0
    outer loop
      vertex 118.203 -28.5078 10
      vertex 116.703 -29.5976 2
      vertex 118.203 -28.5078 2
    endloop
  endfacet
  facet normal -0.951051 0.309035 0
    outer loop
      vertex 112.776 -26.7444 2
      vertex 113.349 -24.981 10
      vertex 113.349 -24.981 2
    endloop
  endfacet
  facet normal -0.951051 0.309035 0
    outer loop
      vertex 113.349 -24.981 10
      vertex 112.776 -26.7444 2
      vertex 112.776 -26.7444 10
    endloop
  endfacet
  facet normal 0.308981 0.951068 -0
    outer loop
      vertex 116.116 -27.7906 2
      vertex 114.886 -27.391 10
      vertex 116.116 -27.7906 10
    endloop
  endfacet
  facet normal 0.308981 0.951068 0
    outer loop
      vertex 114.886 -27.391 10
      vertex 116.116 -27.7906 2
      vertex 114.886 -27.391 2
    endloop
  endfacet
  facet normal 0.308981 -0.951068 0
    outer loop
      vertex 114.886 -26.0978 2
      vertex 116.116 -25.6982 10
      vertex 114.886 -26.0978 10
    endloop
  endfacet
  facet normal 0.308981 -0.951068 0
    outer loop
      vertex 116.116 -25.6982 10
      vertex 114.886 -26.0978 2
      vertex 116.116 -25.6982 2
    endloop
  endfacet
  facet normal -0.809057 -0.58773 0
    outer loop
      vertex 116.876 -26.7444 2
      vertex 116.116 -25.6982 10
      vertex 116.116 -25.6982 2
    endloop
  endfacet
  facet normal -0.809057 -0.58773 0
    outer loop
      vertex 116.116 -25.6982 10
      vertex 116.876 -26.7444 2
      vertex 116.876 -26.7444 10
    endloop
  endfacet
  facet normal 1 -0 0
    outer loop
      vertex 114.886 -27.391 10
      vertex 114.886 -26.0978 2
      vertex 114.886 -26.0978 10
    endloop
  endfacet
  facet normal 1 0 0
    outer loop
      vertex 114.886 -26.0978 2
      vertex 114.886 -27.391 10
      vertex 114.886 -27.391 2
    endloop
  endfacet
  facet normal -0.809057 0.58773 0
    outer loop
      vertex 116.116 -27.7906 2
      vertex 116.876 -26.7444 10
      vertex 116.876 -26.7444 2
    endloop
  endfacet
  facet normal -0.809057 0.58773 0
    outer loop
      vertex 116.876 -26.7444 10
      vertex 116.116 -27.7906 2
      vertex 116.116 -27.7906 10
    endloop
  endfacet
  facet normal 0.195077 0.980788 -0
    outer loop
      vertex 20.7477 -5.16787 0
      vertex 19.9037 -5 2
      vertex 20.7477 -5.16787 2
    endloop
  endfacet
  facet normal 0.195077 0.980788 0
    outer loop
      vertex 19.9037 -5 2
      vertex 20.7477 -5.16787 0
      vertex 19.9037 -5 0
    endloop
  endfacet
  facet normal 0 0 -1
    outer loop
      vertex 120.395 -28.6578 0
      vertex 120.395 -24.831 0
      vertex 120.776 -26.7444 0
    endloop
  endfacet
  facet normal 0 0 -1
    outer loop
      vertex 114.932 -31.5765 0
      vertex 120.395 -28.6578 0
      vertex 119.311 -30.2799 0
    endloop
  endfacet
  facet normal 0 0 -1
    outer loop
      vertex 120.395 -28.6578 0
      vertex 116.62 -21.9123 0
      vertex 120.395 -24.831 0
    endloop
  endfacet
  facet normal 0 0 -1
    outer loop
      vertex 114.932 -31.5765 0
      vertex 119.311 -30.2799 0
      vertex 117.689 -31.3638 0
    endloop
  endfacet
  facet normal 0 0 -1
    outer loop
      vertex 120.395 -24.831 0
      vertex 116.62 -21.9123 0
      vertex 119.311 -23.2089 0
    endloop
  endfacet
  facet normal 0 0 -1
    outer loop
      vertex 119.311 -23.2089 0
      vertex 116.62 -21.9123 0
      vertex 117.689 -22.125 0
    endloop
  endfacet
  facet normal 0 0 -1
    outer loop
      vertex 114.932 -31.5765 0
      vertex 117.689 -31.3638 0
      vertex 115.776 -31.7444 0
    endloop
  endfacet
  facet normal -0 0 -1
    outer loop
      vertex 120.395 -28.6578 0
      vertex 114.932 -31.5765 0
      vertex 116.62 -21.9123 0
    endloop
  endfacet
  facet normal 0 0 -1
    outer loop
      vertex 24.7927 -15.9296 0
      vertex 116.62 -21.9123 0
      vertex 114.932 -31.5765 0
    endloop
  endfacet
  facet normal 0 0 -1
    outer loop
      vertex 24.7927 -15.9296 0
      vertex 114.932 -31.5765 0
      vertex 114.915 -31.6698 0
    endloop
  endfacet
  facet normal 0 0 -1
    outer loop
      vertex 116.62 -21.9123 0
      vertex 24.7927 -15.9296 0
      vertex 116.636 -21.819 0
    endloop
  endfacet
  facet normal 0 0 -1
    outer loop
      vertex 14.7293 -19.1965 0
      vertex 23.9839 -58.796 0
      vertex 23.9661 -58.7957 0
    endloop
  endfacet
  facet normal 0 0 -1
    outer loop
      vertex 14.7293 -19.1965 0
      vertex 23.9661 -58.7957 0
      vertex 23.8714 -59.272 0
    endloop
  endfacet
  facet normal 0 0 -1
    outer loop
      vertex 24.7927 -15.9296 0
      vertex 20.7639 -5.07456 0
      vertex 116.636 -21.819 0
    endloop
  endfacet
  facet normal 0 0 -1
    outer loop
      vertex 23.9839 -58.796 0
      vertex 14.7293 -19.1965 0
      vertex 24.7927 -15.9296 0
    endloop
  endfacet
  facet normal 0 0 -1
    outer loop
      vertex 5.3806 -137.599 0
      vertex 5 -135.685 0
      vertex 5.11344 -135.115 0
    endloop
  endfacet
  facet normal 0 0 -1
    outer loop
      vertex 1.7537 -30.29 0
      vertex 11.0537 -21.5249 0
      vertex 11.0537 -30.29 0
    endloop
  endfacet
  facet normal -0 0 -1
    outer loop
      vertex 11.0537 -21.5249 0
      vertex 1.7537 -30.29 0
      vertex 1.7537 -18.33 0
    endloop
  endfacet
  facet normal 0 0 -1
    outer loop
      vertex 11.0537 -21.5249 0
      vertex 1.7537 -18.33 0
      vertex 5.30331 -13.33 0
    endloop
  endfacet
  facet normal -0 0 -1
    outer loop
      vertex 5.30331 -13.33 0
      vertex 1.7537 -18.33 0
      vertex 1.7537 -13.33 0
    endloop
  endfacet
  facet normal 0 0 -1
    outer loop
      vertex 13.5355 -139.221 0
      vertex 14.8866 -136.255 0
      vertex 14.6194 -137.599 0
    endloop
  endfacet
  facet normal 0 0 -1
    outer loop
      vertex 14.8866 -136.255 0
      vertex 13.9903 -58.3639 0
      vertex 14.7293 -19.1965 0
    endloop
  endfacet
  facet normal 0 0 -1
    outer loop
      vertex 11.9134 -140.305 0
      vertex 14.8866 -136.255 0
      vertex 13.5355 -139.221 0
    endloop
  endfacet
  facet normal -0 0 -1
    outer loop
      vertex 14.8866 -136.255 0
      vertex 11.9134 -140.305 0
      vertex 5.11344 -135.115 0
    endloop
  endfacet
  facet normal 0 0 -1
    outer loop
      vertex 5.11344 -135.115 0
      vertex 11.9134 -140.305 0
      vertex 10 -140.685 0
    endloop
  endfacet
  facet normal 0 0 -1
    outer loop
      vertex 5.11344 -135.115 0
      vertex 10 -140.685 0
      vertex 8.08658 -140.305 0
    endloop
  endfacet
  facet normal 0 0 -1
    outer loop
      vertex 5.11344 -135.115 0
      vertex 8.08658 -140.305 0
      vertex 6.46447 -139.221 0
    endloop
  endfacet
  facet normal 0 0 -1
    outer loop
      vertex 5.11344 -135.115 0
      vertex 6.46447 -139.221 0
      vertex 5.3806 -137.599 0
    endloop
  endfacet
  facet normal 0 0 -1
    outer loop
      vertex 14.8866 -136.255 0
      vertex 5.11344 -135.115 0
      vertex 13.9903 -58.3639 0
    endloop
  endfacet
  facet normal 0 0 -1
    outer loop
      vertex 13.9903 -58.3639 0
      vertex 5.11344 -135.115 0
      vertex 5.03371 -135.105 0
    endloop
  endfacet
  facet normal 0 0 -1
    outer loop
      vertex 24.7927 -15.9296 0
      vertex 20.7477 -5.16787 0
      vertex 20.7639 -5.07456 0
    endloop
  endfacet
  facet normal 0 -0 -1
    outer loop
      vertex 17.2787 -5.85607 0
      vertex 24.7927 -15.9296 0
      vertex 14.7293 -19.1965 0
    endloop
  endfacet
  facet normal 0 0 -1
    outer loop
      vertex 24.7927 -15.9296 0
      vertex 17.2787 -5.85607 0
      vertex 20.7477 -5.16787 0
    endloop
  endfacet
  facet normal -0 0 -1
    outer loop
      vertex 20.7477 -5.16787 0
      vertex 17.2787 -5.85607 0
      vertex 19.9037 -5 0
    endloop
  endfacet
  facet normal 0 0 -1
    outer loop
      vertex 19.9037 -5 0
      vertex 17.2787 -5.85607 0
      vertex 17.9903 -5.3806 0
    endloop
  endfacet
  facet normal 0 0 -1
    outer loop
      vertex 14.9663 -136.265 0
      vertex 23.8714 -59.272 0
      vertex 23.9511 -59.2813 0
    endloop
  endfacet
  facet normal 0 0 -1
    outer loop
      vertex 14.8866 -136.255 0
      vertex 23.8714 -59.272 0
      vertex 14.9663 -136.265 0
    endloop
  endfacet
  facet normal -0 0 -1
    outer loop
      vertex 23.8714 -59.272 0
      vertex 14.8866 -136.255 0
      vertex 14.7293 -19.1965 0
    endloop
  endfacet
  facet normal 0 0 -1
    outer loop
      vertex 5.30331 -13.33 0
      vertex 17.2787 -5.85607 0
      vertex 14.7293 -19.1965 0
    endloop
  endfacet
  facet normal 0 0 -1
    outer loop
      vertex 5.30331 -13.33 0
      vertex 14.7293 -19.1965 0
      vertex 11.0537 -21.5249 0
    endloop
  endfacet
  facet normal -0 0 -1
    outer loop
      vertex 17.2787 -5.85607 0
      vertex 5.30331 -13.33 0
      vertex 17.2281 -5.77615 0
    endloop
  endfacet
  facet normal -0.555576 0.831465 1.12795e-05
    outer loop
      vertex 17.9903 -5.3806 2
      vertex 17.2787 -5.85607 1
      vertex 16.3682 -6.46447 2
    endloop
  endfacet
  facet normal -0.555565 0.831473 0
    outer loop
      vertex 17.9903 -5.3806 0
      vertex 17.2787 -5.85607 1
      vertex 17.9903 -5.3806 2
    endloop
  endfacet
  facet normal -0.555565 0.831473 0
    outer loop
      vertex 17.2787 -5.85607 1
      vertex 17.9903 -5.3806 0
      vertex 17.2787 -5.85607 0
    endloop
  endfacet
  facet normal -0.555585 0.83146 0
    outer loop
      vertex 16.3682 -6.46447 2
      vertex 17.2787 -5.85607 1
      vertex 16.3682 -6.46447 1
    endloop
  endfacet
  facet normal -0.83146 0.555585 0
    outer loop
      vertex 15.2843 -8.08658 1
      vertex 16.3682 -6.46447 2
      vertex 16.3682 -6.46447 1
    endloop
  endfacet
  facet normal -0.83146 0.555585 0
    outer loop
      vertex 16.3682 -6.46447 2
      vertex 15.2843 -8.08658 1
      vertex 15.2843 -8.08658 2
    endloop
  endfacet
  facet normal -0.195091 0.980785 0
    outer loop
      vertex 19.9037 -5 0
      vertex 17.9903 -5.3806 2
      vertex 19.9037 -5 2
    endloop
  endfacet
  facet normal -0.195091 0.980785 0
    outer loop
      vertex 17.9903 -5.3806 2
      vertex 19.9037 -5 0
      vertex 17.9903 -5.3806 0
    endloop
  endfacet
  facet normal -0.980786 0.195087 0
    outer loop
      vertex 14.9224 -9.90601 1
      vertex 15.2843 -8.08658 2
      vertex 15.2843 -8.08658 1
    endloop
  endfacet
  facet normal -0.980786 0.195087 0
    outer loop
      vertex 15.2843 -8.08658 2
      vertex 14.9224 -9.90601 1
      vertex 14.9224 -9.90601 2
    endloop
  endfacet
  facet normal 0.980802 -0.195007 0
    outer loop
      vertex 23.8714 -59.272 2
      vertex 23.9661 -58.7957 0
      vertex 23.9661 -58.7957 2
    endloop
  endfacet
  facet normal 0.980802 -0.195007 0
    outer loop
      vertex 23.9661 -58.7957 0
      vertex 23.8714 -59.272 2
      vertex 23.8714 -59.272 0
    endloop
  endfacet
  facet normal 0.0185361 0.999828 -0
    outer loop
      vertex 14.9224 -9.90601 1
      vertex 14.9046 -9.90568 2
      vertex 14.9224 -9.90601 2
    endloop
  endfacet
  facet normal 0.0185361 0.999828 0
    outer loop
      vertex 14.9046 -9.90568 2
      vertex 14.9224 -9.90601 1
      vertex 14.9046 -9.90568 1
    endloop
  endfacet
  facet normal -0.0168515 -0.999858 0
    outer loop
      vertex 23.9661 -58.7957 0
      vertex 23.9839 -58.796 2
      vertex 23.9661 -58.7957 2
    endloop
  endfacet
  facet normal -0.0168515 -0.999858 -0
    outer loop
      vertex 23.9839 -58.796 2
      vertex 23.9661 -58.7957 0
      vertex 23.9839 -58.796 0
    endloop
  endfacet
  facet normal -0.999822 0.0188644 0
    outer loop
      vertex 14.7293 -19.1965 0
      vertex 13.9903 -58.3639 0
      vertex 14.7293 -19.1965 1
    endloop
  endfacet
  facet normal -0.999822 0.0188647 0
    outer loop
      vertex 14.7293 -19.1965 1
      vertex 14.9046 -9.90568 2
      vertex 14.9046 -9.90568 1
    endloop
  endfacet
  facet normal -0.999822 0.0188644 0
    outer loop
      vertex 13.9903 -58.3639 2
      vertex 14.7293 -19.1965 1
      vertex 13.9903 -58.3639 0
    endloop
  endfacet
  facet normal -0.999822 0.0188644 2.66657e-06
    outer loop
      vertex 14.7293 -19.1965 1
      vertex 13.9903 -58.3639 2
      vertex 14.9046 -9.90568 2
    endloop
  endfacet
  facet normal 0.999822 -0.0188646 0
    outer loop
      vertex 23.9839 -58.796 2
      vertex 24.7927 -15.9296 0
      vertex 24.7927 -15.9296 2
    endloop
  endfacet
  facet normal 0.999822 -0.0188646 0
    outer loop
      vertex 24.7927 -15.9296 0
      vertex 23.9839 -58.796 2
      vertex 23.9839 -58.796 0
    endloop
  endfacet
  facet normal -0.194793 -0.980844 0
    outer loop
      vertex 8.08658 -140.305 0
      vertex 10 -140.685 2
      vertex 8.08658 -140.305 2
    endloop
  endfacet
  facet normal -0.194793 -0.980844 -0
    outer loop
      vertex 10 -140.685 2
      vertex 8.08658 -140.305 0
      vertex 10 -140.685 0
    endloop
  endfacet
  facet normal 0.831443 -0.555611 0
    outer loop
      vertex 13.5355 -139.221 2
      vertex 14.6194 -137.599 0
      vertex 14.6194 -137.599 2
    endloop
  endfacet
  facet normal 0.831443 -0.555611 0
    outer loop
      vertex 14.6194 -137.599 0
      vertex 13.5355 -139.221 2
      vertex 13.5355 -139.221 0
    endloop
  endfacet
  facet normal -0.980797 -0.195032 0
    outer loop
      vertex 5.3806 -137.599 0
      vertex 5 -135.685 2
      vertex 5 -135.685 0
    endloop
  endfacet
  facet normal -0.980797 -0.195032 0
    outer loop
      vertex 5 -135.685 2
      vertex 5.3806 -137.599 0
      vertex 5.3806 -137.599 2
    endloop
  endfacet
  facet normal 0.555622 -0.831435 0
    outer loop
      vertex 11.9134 -140.305 0
      vertex 13.5355 -139.221 2
      vertex 11.9134 -140.305 2
    endloop
  endfacet
  facet normal 0.555622 -0.831435 0
    outer loop
      vertex 13.5355 -139.221 2
      vertex 11.9134 -140.305 0
      vertex 13.5355 -139.221 0
    endloop
  endfacet
  facet normal 0.980805 -0.194993 0
    outer loop
      vertex 14.6194 -137.599 2
      vertex 14.8866 -136.255 0
      vertex 14.8866 -136.255 2
    endloop
  endfacet
  facet normal 0.980805 -0.194993 0
    outer loop
      vertex 14.8866 -136.255 0
      vertex 14.6194 -137.599 2
      vertex 14.6194 -137.599 0
    endloop
  endfacet
  facet normal -0.980766 0.19519 0
    outer loop
      vertex 5 -135.685 0
      vertex 5.11344 -135.115 2
      vertex 5.11344 -135.115 0
    endloop
  endfacet
  facet normal -0.980766 0.19519 0
    outer loop
      vertex 5.11344 -135.115 2
      vertex 5 -135.685 0
      vertex 5 -135.685 2
    endloop
  endfacet
  facet normal -0.83145 -0.5556 0
    outer loop
      vertex 6.46447 -139.221 0
      vertex 5.3806 -137.599 2
      vertex 5.3806 -137.599 0
    endloop
  endfacet
  facet normal -0.83145 -0.5556 0
    outer loop
      vertex 5.3806 -137.599 2
      vertex 6.46447 -139.221 0
      vertex 6.46447 -139.221 2
    endloop
  endfacet
  facet normal 0.194795 -0.980844 0
    outer loop
      vertex 10 -140.685 0
      vertex 11.9134 -140.305 2
      vertex 10 -140.685 2
    endloop
  endfacet
  facet normal 0.194795 -0.980844 0
    outer loop
      vertex 11.9134 -140.305 2
      vertex 10 -140.685 0
      vertex 11.9134 -140.305 0
    endloop
  endfacet
  facet normal -0.55562 -0.831436 0
    outer loop
      vertex 6.46447 -139.221 0
      vertex 8.08658 -140.305 2
      vertex 6.46447 -139.221 2
    endloop
  endfacet
  facet normal -0.55562 -0.831436 -0
    outer loop
      vertex 8.08658 -140.305 2
      vertex 6.46447 -139.221 0
      vertex 8.08658 -140.305 0
    endloop
  endfacet
  facet normal 0.115901 0.993261 -0
    outer loop
      vertex 23.9511 -59.2813 0
      vertex 23.8714 -59.272 2
      vertex 23.9511 -59.2813 2
    endloop
  endfacet
  facet normal 0.115901 0.993261 0
    outer loop
      vertex 23.8714 -59.272 2
      vertex 23.9511 -59.2813 0
      vertex 23.8714 -59.272 0
    endloop
  endfacet
  facet normal -0.124448 -0.992226 0
    outer loop
      vertex 5.03371 -135.105 0
      vertex 5.11344 -135.115 2
      vertex 5.03371 -135.105 2
    endloop
  endfacet
  facet normal -0.124448 -0.992226 -0
    outer loop
      vertex 5.11344 -135.115 2
      vertex 5.03371 -135.105 0
      vertex 5.11344 -135.115 0
    endloop
  endfacet
  facet normal -0.124494 -0.99222 0
    outer loop
      vertex 14.8866 -136.255 0
      vertex 14.9663 -136.265 2
      vertex 14.8866 -136.255 2
    endloop
  endfacet
  facet normal -0.124494 -0.99222 -0
    outer loop
      vertex 14.9663 -136.265 2
      vertex 14.8866 -136.255 0
      vertex 14.9663 -136.265 0
    endloop
  endfacet
  facet normal -0.993258 0.115925 0
    outer loop
      vertex 5.03371 -135.105 0
      vertex 13.9903 -58.3639 2
      vertex 13.9903 -58.3639 0
    endloop
  endfacet
  facet normal -0.993258 0.115925 0
    outer loop
      vertex 13.9903 -58.3639 2
      vertex 5.03371 -135.105 0
      vertex 5.03371 -135.105 2
    endloop
  endfacet
  facet normal 0.993258 -0.115924 0
    outer loop
      vertex 14.9663 -136.265 2
      vertex 23.9511 -59.2813 0
      vertex 23.9511 -59.2813 2
    endloop
  endfacet
  facet normal 0.993258 -0.115924 0
    outer loop
      vertex 23.9511 -59.2813 0
      vertex 14.9663 -136.265 2
      vertex 14.9663 -136.265 0
    endloop
  endfacet
  facet normal -0.19511 -0.980781 0
    outer loop
      vertex 114.932 -31.5765 0
      vertex 115.776 -31.7444 2
      vertex 114.932 -31.5765 2
    endloop
  endfacet
  facet normal -0.19511 -0.980781 -0
    outer loop
      vertex 115.776 -31.7444 2
      vertex 114.932 -31.5765 0
      vertex 115.776 -31.7444 0
    endloop
  endfacet
  facet normal 0.831435 0.555622 0
    outer loop
      vertex 120.395 -24.831 2
      vertex 119.311 -23.2089 0
      vertex 119.311 -23.2089 2
    endloop
  endfacet
  facet normal 0.831435 0.555622 0
    outer loop
      vertex 119.311 -23.2089 0
      vertex 120.395 -24.831 2
      vertex 120.395 -24.831 0
    endloop
  endfacet
  facet normal 0.980746 0.195288 0
    outer loop
      vertex 120.776 -26.7444 2
      vertex 120.395 -24.831 0
      vertex 120.395 -24.831 2
    endloop
  endfacet
  facet normal 0.980746 0.195288 0
    outer loop
      vertex 120.395 -24.831 0
      vertex 120.776 -26.7444 2
      vertex 120.776 -26.7444 0
    endloop
  endfacet
  facet normal 0.555611 -0.831443 0
    outer loop
      vertex 117.689 -31.3638 0
      vertex 119.311 -30.2799 2
      vertex 117.689 -31.3638 2
    endloop
  endfacet
  facet normal 0.555611 -0.831443 0
    outer loop
      vertex 119.311 -30.2799 2
      vertex 117.689 -31.3638 0
      vertex 119.311 -30.2799 0
    endloop
  endfacet
  facet normal 0.980746 -0.195288 0
    outer loop
      vertex 120.395 -28.6578 2
      vertex 120.776 -26.7444 0
      vertex 120.776 -26.7444 2
    endloop
  endfacet
  facet normal 0.980746 -0.195288 0
    outer loop
      vertex 120.776 -26.7444 0
      vertex 120.395 -28.6578 2
      vertex 120.395 -28.6578 0
    endloop
  endfacet
  facet normal 0.831435 -0.555622 0
    outer loop
      vertex 119.311 -30.2799 2
      vertex 120.395 -28.6578 0
      vertex 120.395 -28.6578 2
    endloop
  endfacet
  facet normal 0.831435 -0.555622 0
    outer loop
      vertex 120.395 -28.6578 0
      vertex 119.311 -30.2799 2
      vertex 119.311 -30.2799 0
    endloop
  endfacet
  facet normal 0.195146 0.980774 -0
    outer loop
      vertex 117.689 -22.125 0
      vertex 116.62 -21.9123 2
      vertex 117.689 -22.125 2
    endloop
  endfacet
  facet normal 0.195146 0.980774 0
    outer loop
      vertex 116.62 -21.9123 2
      vertex 117.689 -22.125 0
      vertex 116.62 -21.9123 0
    endloop
  endfacet
  facet normal 0.19513 -0.980777 0
    outer loop
      vertex 115.776 -31.7444 0
      vertex 117.689 -31.3638 2
      vertex 115.776 -31.7444 2
    endloop
  endfacet
  facet normal 0.19513 -0.980777 0
    outer loop
      vertex 117.689 -31.3638 2
      vertex 115.776 -31.7444 0
      vertex 117.689 -31.3638 0
    endloop
  endfacet
  facet normal 0.555611 0.831443 -0
    outer loop
      vertex 119.311 -23.2089 0
      vertex 117.689 -22.125 2
      vertex 119.311 -23.2089 2
    endloop
  endfacet
  facet normal 0.555611 0.831443 0
    outer loop
      vertex 117.689 -22.125 2
      vertex 119.311 -23.2089 0
      vertex 117.689 -22.125 0
    endloop
  endfacet
  facet normal -0.985261 0.171056 0
    outer loop
      vertex 20.7477 -5.16787 0
      vertex 20.7639 -5.07456 2
      vertex 20.7639 -5.07456 0
    endloop
  endfacet
  facet normal -0.985261 0.171056 0
    outer loop
      vertex 20.7639 -5.07456 2
      vertex 20.7477 -5.16787 0
      vertex 20.7477 -5.16787 2
    endloop
  endfacet
  facet normal 0.983802 -0.179257 0
    outer loop
      vertex 114.915 -31.6698 2
      vertex 114.932 -31.5765 0
      vertex 114.932 -31.5765 2
    endloop
  endfacet
  facet normal 0.983802 -0.179257 0
    outer loop
      vertex 114.932 -31.5765 0
      vertex 114.915 -31.6698 2
      vertex 114.915 -31.6698 0
    endloop
  endfacet
  facet normal 0.985612 -0.169022 0
    outer loop
      vertex 116.62 -21.9123 2
      vertex 116.636 -21.819 0
      vertex 116.636 -21.819 2
    endloop
  endfacet
  facet normal 0.985612 -0.169022 0
    outer loop
      vertex 116.636 -21.819 0
      vertex 116.62 -21.9123 2
      vertex 116.62 -21.9123 0
    endloop
  endfacet
  facet normal -0.172049 -0.985088 0
    outer loop
      vertex 24.7927 -15.9296 0
      vertex 114.915 -31.6698 2
      vertex 24.7927 -15.9296 2
    endloop
  endfacet
  facet normal -0.172049 -0.985088 -0
    outer loop
      vertex 114.915 -31.6698 2
      vertex 24.7927 -15.9296 0
      vertex 114.915 -31.6698 0
    endloop
  endfacet
  facet normal 0.17205 0.985088 -0
    outer loop
      vertex 116.636 -21.819 0
      vertex 20.7639 -5.07456 2
      vertex 116.636 -21.819 2
    endloop
  endfacet
  facet normal 0.17205 0.985088 0
    outer loop
      vertex 20.7639 -5.07456 2
      vertex 116.636 -21.819 0
      vertex 20.7639 -5.07456 0
    endloop
  endfacet
  facet normal 0 1 -0
    outer loop
      vertex 11.0537 -27.76 5.2
      vertex 1.7537 -27.76 7.5
      vertex 11.0537 -27.76 7.5
    endloop
  endfacet
  facet normal 0 1 0
    outer loop
      vertex 1.7537 -27.76 7.5
      vertex 11.0537 -27.76 5.2
      vertex 1.7537 -27.76 5.2
    endloop
  endfacet
  facet normal -0 0 1
    outer loop
      vertex 1.7537 -19.78 1
      vertex 3.9037 -23.84 1
      vertex 3.9037 -19.78 1
    endloop
  endfacet
  facet normal 0 0 1
    outer loop
      vertex 3.9037 -23.84 1
      vertex 1.7537 -19.78 1
      vertex 1.7537 -23.84 1
    endloop
  endfacet
  facet normal 0 0 1
    outer loop
      vertex 17.2281 -5.77615 1
      vertex 16.3682 -6.46447 1
      vertex 17.2787 -5.85607 1
    endloop
  endfacet
  facet normal 0 0 1
    outer loop
      vertex 15.2843 -8.08658 1
      vertex 14.9046 -9.90568 1
      vertex 14.9224 -9.90601 1
    endloop
  endfacet
  facet normal 0 0 1
    outer loop
      vertex 14.9046 -9.90568 1
      vertex 11.0537 -13.33 1
      vertex 14.7293 -19.1965 1
    endloop
  endfacet
  facet normal 0 0 1
    outer loop
      vertex 15.2843 -8.08658 1
      vertex 11.0537 -13.33 1
      vertex 14.9046 -9.90568 1
    endloop
  endfacet
  facet normal 0 0 1
    outer loop
      vertex 5.30331 -13.33 1
      vertex 15.2843 -8.08658 1
      vertex 16.3682 -6.46447 1
    endloop
  endfacet
  facet normal 0 0 1
    outer loop
      vertex 15.2843 -8.08658 1
      vertex 5.30331 -13.33 1
      vertex 11.0537 -13.33 1
    endloop
  endfacet
  facet normal 0 0 1
    outer loop
      vertex 5.30331 -13.33 1
      vertex 16.3682 -6.46447 1
      vertex 17.2281 -5.77615 1
    endloop
  endfacet
  facet normal -0 0 1
    outer loop
      vertex 11.0537 -18.71 1
      vertex 14.7293 -19.1965 1
      vertex 11.0537 -13.33 1
    endloop
  endfacet
  facet normal 0 0 1
    outer loop
      vertex 11.0537 -18.71 1
      vertex 11.0537 -21.5249 1
      vertex 14.7293 -19.1965 1
    endloop
  endfacet
  facet normal -0 0 1
    outer loop
      vertex 3.9037 -19.78 1
      vertex 11.0537 -21.5249 1
      vertex 11.0537 -18.71 1
    endloop
  endfacet
  facet normal 0 0 1
    outer loop
      vertex 3.9037 -19.78 1
      vertex 11.0537 -18.71 1
      vertex 3.9037 -18.71 1
    endloop
  endfacet
  facet normal 0 0 1
    outer loop
      vertex 3.9037 -23.84 1
      vertex 11.0537 -21.5249 1
      vertex 3.9037 -19.78 1
    endloop
  endfacet
  facet normal 0 0 1
    outer loop
      vertex 11.0537 -21.5249 1
      vertex 3.9037 -23.84 1
      vertex 11.0537 -24.91 1
    endloop
  endfacet
  facet normal 0 0 1
    outer loop
      vertex 11.0537 -24.91 1
      vertex 3.9037 -23.84 1
      vertex 3.9037 -24.91 1
    endloop
  endfacet
  facet normal 0 1 0
    outer loop
      vertex 5.30331 -13.33 1
      vertex 11.0537 -13.33 7.5
      vertex 11.0537 -13.33 1
    endloop
  endfacet
  facet normal 0 1 0
    outer loop
      vertex 11.0537 -13.33 7.5
      vertex 5.30331 -13.33 1
      vertex 1.7537 -13.33 7.5
    endloop
  endfacet
  facet normal 0 1 0
    outer loop
      vertex 1.7537 -13.33 0
      vertex 5.30331 -13.33 1
      vertex 5.30331 -13.33 0
    endloop
  endfacet
  facet normal 0 1 0
    outer loop
      vertex 5.30331 -13.33 1
      vertex 1.7537 -13.33 0
      vertex 1.7537 -13.33 7.5
    endloop
  endfacet
  facet normal 1 0 0
    outer loop
      vertex 11.0537 -27.76 7.5
      vertex 11.0537 -30.29 7.5
      vertex 11.0537 -27.76 5.2
    endloop
  endfacet
  facet normal 1 0 0
    outer loop
      vertex 11.0537 -24.91 5.2
      vertex 11.0537 -27.76 5.2
      vertex 11.0537 -24.91 1
    endloop
  endfacet
  facet normal 1 -0 0
    outer loop
      vertex 11.0537 -24.91 1
      vertex 11.0537 -21.5249 0
      vertex 11.0537 -21.5249 1
    endloop
  endfacet
  facet normal 1 0 0
    outer loop
      vertex 11.0537 -30.29 0
      vertex 11.0537 -27.76 5.2
      vertex 11.0537 -30.29 7.5
    endloop
  endfacet
  facet normal 1 0 0
    outer loop
      vertex 11.0537 -24.91 1
      vertex 11.0537 -30.29 0
      vertex 11.0537 -21.5249 0
    endloop
  endfacet
  facet normal 1 0 0
    outer loop
      vertex 11.0537 -27.76 5.2
      vertex 11.0537 -30.29 0
      vertex 11.0537 -24.91 1
    endloop
  endfacet
  facet normal 1 0 0
    outer loop
      vertex 11.0537 -15.86 5.2
      vertex 11.0537 -13.33 7.5
      vertex 11.0537 -15.86 7.5
    endloop
  endfacet
  facet normal 1 0 0
    outer loop
      vertex 11.0537 -13.33 7.5
      vertex 11.0537 -15.86 5.2
      vertex 11.0537 -13.33 1
    endloop
  endfacet
  facet normal 1 0 0
    outer loop
      vertex 11.0537 -18.71 1
      vertex 11.0537 -15.86 5.2
      vertex 11.0537 -18.71 5.2
    endloop
  endfacet
  facet normal 1 0 0
    outer loop
      vertex 11.0537 -15.86 5.2
      vertex 11.0537 -18.71 1
      vertex 11.0537 -13.33 1
    endloop
  endfacet
  facet normal -1 0 0
    outer loop
      vertex 1.7537 -19.78 1
      vertex 1.7537 -18.33 1
      vertex 1.7537 -18.33 0
    endloop
  endfacet
  facet normal -1 0 0
    outer loop
      vertex 1.7537 -18.33 1
      vertex 1.7537 -19.78 1
      vertex 1.7537 -18.71 3.6
    endloop
  endfacet
  facet normal -1 0 0
    outer loop
      vertex 1.7537 -18.33 0
      vertex 1.7537 -23.84 1
      vertex 1.7537 -19.78 1
    endloop
  endfacet
  facet normal -1 0 0
    outer loop
      vertex 1.7537 -23.84 1
      vertex 1.7537 -24.91 3.6
      vertex 1.7537 -23.84 3.6
    endloop
  endfacet
  facet normal -1 0 0
    outer loop
      vertex 1.7537 -24.91 3.6
      vertex 1.7537 -27.76 5.2
      vertex 1.7537 -24.91 5.2
    endloop
  endfacet
  facet normal -1 0 0
    outer loop
      vertex 1.7537 -30.29 0
      vertex 1.7537 -24.91 3.6
      vertex 1.7537 -23.84 1
    endloop
  endfacet
  facet normal -1 0 0
    outer loop
      vertex 1.7537 -30.29 0
      vertex 1.7537 -23.84 1
      vertex 1.7537 -18.33 0
    endloop
  endfacet
  facet normal -1 -0 0
    outer loop
      vertex 1.7537 -24.91 3.6
      vertex 1.7537 -30.29 0
      vertex 1.7537 -27.76 5.2
    endloop
  endfacet
  facet normal -1 0 0
    outer loop
      vertex 1.7537 -30.29 7.5
      vertex 1.7537 -27.76 5.2
      vertex 1.7537 -30.29 0
    endloop
  endfacet
  facet normal -1 0 0
    outer loop
      vertex 1.7537 -27.76 5.2
      vertex 1.7537 -30.29 7.5
      vertex 1.7537 -27.76 7.5
    endloop
  endfacet
  facet normal -1 0 0
    outer loop
      vertex 1.7537 -13.33 0
      vertex 1.7537 -15.86 5.2
      vertex 1.7537 -13.33 7.5
    endloop
  endfacet
  facet normal -1 0 0
    outer loop
      vertex 1.7537 -18.33 1
      vertex 1.7537 -13.33 0
      vertex 1.7537 -18.33 0
    endloop
  endfacet
  facet normal -1 0 0
    outer loop
      vertex 1.7537 -13.33 0
      vertex 1.7537 -18.33 1
      vertex 1.7537 -15.86 5.2
    endloop
  endfacet
  facet normal -1 0 0
    outer loop
      vertex 1.7537 -18.33 1
      vertex 1.7537 -18.71 3.6
      vertex 1.7537 -15.86 5.2
    endloop
  endfacet
  facet normal -1 -0 0
    outer loop
      vertex 1.7537 -15.86 5.2
      vertex 1.7537 -18.71 3.6
      vertex 1.7537 -18.71 5.2
    endloop
  endfacet
  facet normal -1 -0 0
    outer loop
      vertex 1.7537 -13.33 7.5
      vertex 1.7537 -15.86 5.2
      vertex 1.7537 -15.86 7.5
    endloop
  endfacet
  facet normal -1 -0 0
    outer loop
      vertex 1.7537 -18.71 3.6
      vertex 1.7537 -19.78 1
      vertex 1.7537 -19.78 3.6
    endloop
  endfacet
  facet normal 0 -1 0
    outer loop
      vertex 1.7537 -15.86 5.2
      vertex 11.0537 -15.86 7.5
      vertex 1.7537 -15.86 7.5
    endloop
  endfacet
  facet normal 0 -1 -0
    outer loop
      vertex 11.0537 -15.86 7.5
      vertex 1.7537 -15.86 5.2
      vertex 11.0537 -15.86 5.2
    endloop
  endfacet
  facet normal -0 0 1
    outer loop
      vertex 1.7537 -13.33 7.5
      vertex 11.0537 -15.86 7.5
      vertex 11.0537 -13.33 7.5
    endloop
  endfacet
  facet normal 0 0 1
    outer loop
      vertex 11.0537 -15.86 7.5
      vertex 1.7537 -13.33 7.5
      vertex 1.7537 -15.86 7.5
    endloop
  endfacet
  facet normal 0 -1 0
    outer loop
      vertex 1.7537 -30.29 0
      vertex 11.0537 -30.29 7.5
      vertex 1.7537 -30.29 7.5
    endloop
  endfacet
  facet normal 0 -1 -0
    outer loop
      vertex 11.0537 -30.29 7.5
      vertex 1.7537 -30.29 0
      vertex 11.0537 -30.29 0
    endloop
  endfacet
  facet normal -0 0 1
    outer loop
      vertex 1.7537 -27.76 7.5
      vertex 11.0537 -30.29 7.5
      vertex 11.0537 -27.76 7.5
    endloop
  endfacet
  facet normal 0 0 1
    outer loop
      vertex 11.0537 -30.29 7.5
      vertex 1.7537 -27.76 7.5
      vertex 1.7537 -30.29 7.5
    endloop
  endfacet
  facet normal 0 -1 0
    outer loop
      vertex 3.9037 -18.71 3.6
      vertex 1.7537 -18.71 5.2
      vertex 1.7537 -18.71 3.6
    endloop
  endfacet
  facet normal 0 -1 0
    outer loop
      vertex 1.7537 -18.71 5.2
      vertex 3.9037 -18.71 3.6
      vertex 11.0537 -18.71 5.2
    endloop
  endfacet
  facet normal 0 -1 0
    outer loop
      vertex 11.0537 -18.71 1
      vertex 3.9037 -18.71 3.6
      vertex 3.9037 -18.71 1
    endloop
  endfacet
  facet normal 0 -1 0
    outer loop
      vertex 3.9037 -18.71 3.6
      vertex 11.0537 -18.71 1
      vertex 11.0537 -18.71 5.2
    endloop
  endfacet
  facet normal -0 0 1
    outer loop
      vertex 1.7537 -15.86 5.2
      vertex 11.0537 -18.71 5.2
      vertex 11.0537 -15.86 5.2
    endloop
  endfacet
  facet normal 0 0 1
    outer loop
      vertex 11.0537 -18.71 5.2
      vertex 1.7537 -15.86 5.2
      vertex 1.7537 -18.71 5.2
    endloop
  endfacet
  facet normal 0 -1 0
    outer loop
      vertex 1.7537 -19.78 1
      vertex 3.9037 -19.78 3.6
      vertex 1.7537 -19.78 3.6
    endloop
  endfacet
  facet normal 0 -1 -0
    outer loop
      vertex 3.9037 -19.78 3.6
      vertex 1.7537 -19.78 1
      vertex 3.9037 -19.78 1
    endloop
  endfacet
  facet normal -0 0 1
    outer loop
      vertex 1.7537 -18.71 3.6
      vertex 3.9037 -19.78 3.6
      vertex 3.9037 -18.71 3.6
    endloop
  endfacet
  facet normal 0 0 1
    outer loop
      vertex 3.9037 -19.78 3.6
      vertex 1.7537 -18.71 3.6
      vertex 1.7537 -19.78 3.6
    endloop
  endfacet
  facet normal 1 -0 0
    outer loop
      vertex 3.9037 -24.91 3.6
      vertex 3.9037 -23.84 1
      vertex 3.9037 -23.84 3.6
    endloop
  endfacet
  facet normal 1 0 0
    outer loop
      vertex 3.9037 -23.84 1
      vertex 3.9037 -24.91 3.6
      vertex 3.9037 -24.91 1
    endloop
  endfacet
  facet normal 1 -0 0
    outer loop
      vertex 3.9037 -19.78 3.6
      vertex 3.9037 -18.71 1
      vertex 3.9037 -18.71 3.6
    endloop
  endfacet
  facet normal 1 0 0
    outer loop
      vertex 3.9037 -18.71 1
      vertex 3.9037 -19.78 3.6
      vertex 3.9037 -19.78 1
    endloop
  endfacet
  facet normal 0 1 -0
    outer loop
      vertex 3.9037 -23.84 1
      vertex 1.7537 -23.84 3.6
      vertex 3.9037 -23.84 3.6
    endloop
  endfacet
  facet normal 0 1 0
    outer loop
      vertex 1.7537 -23.84 3.6
      vertex 3.9037 -23.84 1
      vertex 1.7537 -23.84 1
    endloop
  endfacet
  facet normal 0 1 0
    outer loop
      vertex 11.0537 -24.91 5.2
      vertex 3.9037 -24.91 3.6
      vertex 1.7537 -24.91 5.2
    endloop
  endfacet
  facet normal 0 1 -0
    outer loop
      vertex 11.0537 -24.91 1
      vertex 3.9037 -24.91 3.6
      vertex 11.0537 -24.91 5.2
    endloop
  endfacet
  facet normal 0 1 0
    outer loop
      vertex 3.9037 -24.91 3.6
      vertex 11.0537 -24.91 1
      vertex 3.9037 -24.91 1
    endloop
  endfacet
  facet normal 0 1 0
    outer loop
      vertex 1.7537 -24.91 5.2
      vertex 3.9037 -24.91 3.6
      vertex 1.7537 -24.91 3.6
    endloop
  endfacet
  facet normal -0 0 1
    outer loop
      vertex 1.7537 -23.84 3.6
      vertex 3.9037 -24.91 3.6
      vertex 3.9037 -23.84 3.6
    endloop
  endfacet
  facet normal 0 0 1
    outer loop
      vertex 3.9037 -24.91 3.6
      vertex 1.7537 -23.84 3.6
      vertex 1.7537 -24.91 3.6
    endloop
  endfacet
  facet normal -0 0 1
    outer loop
      vertex 1.7537 -24.91 5.2
      vertex 11.0537 -27.76 5.2
      vertex 11.0537 -24.91 5.2
    endloop
  endfacet
  facet normal 0 0 1
    outer loop
      vertex 11.0537 -27.76 5.2
      vertex 1.7537 -24.91 5.2
      vertex 1.7537 -27.76 5.2
    endloop
  endfacet
  facet normal 0.844896 0.534931 0
    outer loop
      vertex 17.2787 -5.85607 1
      vertex 17.2281 -5.77615 0
      vertex 17.2281 -5.77615 1
    endloop
  endfacet
  facet normal 0.844896 0.534931 0
    outer loop
      vertex 17.2281 -5.77615 0
      vertex 17.2787 -5.85607 1
      vertex 17.2787 -5.85607 0
    endloop
  endfacet
  facet normal -0.535127 0.844772 0
    outer loop
      vertex 17.2281 -5.77615 0
      vertex 5.30331 -13.33 1
      vertex 17.2281 -5.77615 1
    endloop
  endfacet
  facet normal -0.535127 0.844772 0
    outer loop
      vertex 5.30331 -13.33 1
      vertex 17.2281 -5.77615 0
      vertex 5.30331 -13.33 0
    endloop
  endfacet
  facet normal 0.535137 -0.844765 0
    outer loop
      vertex 11.0537 -21.5249 0
      vertex 14.7293 -19.1965 1
      vertex 11.0537 -21.5249 1
    endloop
  endfacet
  facet normal 0.535137 -0.844765 0
    outer loop
      vertex 14.7293 -19.1965 1
      vertex 11.0537 -21.5249 0
      vertex 14.7293 -19.1965 0
    endloop
  endfacet
endsolid OpenSCAD_Model
