{
	"info": {
		"_postman_id": "c2c90c04-7fa4-4a11-b34c-7e82123185c4",
		"name": "Teclado",
		"schema": "https://schema.getpostman.com/json/collection/v2.1.0/collection.json",
		"_exporter_id": "21440079"
	},
	"item": [
		{
			"name": "new teclado",
			"request": {
				"method": "POST",
				"header": [],
				"body": {
					"mode": "raw",
					"raw": "{\r\n    \"marca\" : \"hp\",\r\n    \"teclaSwitch\" : \"membrama\",\r\n    \"tpm\" : 10\r\n}",
					"options": {
						"raw": {
							"language": "json"
						}
					}
				},
				"url": {
					"raw": "localhost:8080/api/new-teclado",
					"host": [
						"localhost"
					],
					"port": "8080",
					"path": [
						"api",
						"new-teclado"
					]
				}
			},
			"response": []
		},
		{
			"name": "teclador",
			"request": {
				"method": "GET",
				"header": [],
				"url": {
					"raw": "localhost:8080/api/teclados",
					"host": [
						"localhost"
					],
					"port": "8080",
					"path": [
						"api",
						"teclados"
					]
				}
			},
			"response": []
		},
		{
			"name": "put teclado",
			"request": {
				"method": "PUT",
				"header": [],
				"body": {
					"mode": "raw",
					"raw": "{\r\n    \"marca\": \"razer\",\r\n    \"teclaSwitch\": \"marrom\",\r\n    \"tpm\": 90\r\n\r\n}",
					"options": {
						"raw": {
							"language": "json"
						}
					}
				},
				"url": {
					"raw": "localhost:8080/api/teclado/5",
					"host": [
						"localhost"
					],
					"port": "8080",
					"path": [
						"api",
						"teclado",
						"5"
					]
				}
			},
			"response": []
		},
		{
			"name": "del teclado",
			"request": {
				"method": "DELETE",
				"header": [],
				"url": {
					"raw": "localhost:8080/api/teclado/5",
					"host": [
						"localhost"
					],
					"port": "8080",
					"path": [
						"api",
						"teclado",
						"5"
					]
				}
			},
			"response": []
		},
		{
			"name": "get por marca",
			"request": {
				"method": "GET",
				"header": [],
				"url": {
					"raw": "localhost:8080/api/tecladobymarca/razer",
					"host": [
						"localhost"
					],
					"port": "8080",
					"path": [
						"api",
						"tecladobymarca",
						"razer"
					]
				}
			},
			"response": []
		},
		{
			"name": "get tpm order switch",
			"request": {
				"method": "GET",
				"header": [],
				"url": {
					"raw": "localhost:8080/api/teclado-tpm/100",
					"host": [
						"localhost"
					],
					"port": "8080",
					"path": [
						"api",
						"teclado-tpm",
						"100"
					]
				}
			},
			"response": []
		}
	]
}