{
	"info": {
		"_postman_id": "23ff04eb-1361-45ae-baa7-3260e5d594f1",
		"name": "prova",
		"schema": "https://schema.getpostman.com/json/collection/v2.1.0/collection.json",
		"_exporter_id": "21440079"
	},
	"item": [
		{
			"name": "contratar",
			"request": {
				"method": "POST",
				"header": [],
				"body": {
					"mode": "raw",
					"raw": "{\r\n    \"nome\" : \"Matheus\",\r\n    \"sobrenome\" : \"Della Vechia\",\r\n    \"funcao\" : \"develop\",\r\n    \"salario\" : 2000,\r\n    \"inicioContrato\" : \"2022-06-01\"\r\n}",
					"options": {
						"raw": {
							"language": "json"
						}
					}
				},
				"url": {
					"raw": "localhost:8080/funcionario/contratar",
					"host": [
						"localhost"
					],
					"port": "8080",
					"path": [
						"funcionario",
						"contratar"
					]
				}
			},
			"response": []
		},
		{
			"name": "getFuncionario",
			"request": {
				"method": "GET",
				"header": [],
				"url": {
					"raw": "localhost:8080/funcionario/by/4",
					"host": [
						"localhost"
					],
					"port": "8080",
					"path": [
						"funcionario",
						"by",
						"4"
					]
				}
			},
			"response": []
		},
		{
			"name": "demitir",
			"request": {
				"method": "PUT",
				"header": [],
				"body": {
					"mode": "raw",
					"raw": "{\r\n    \"nome\": \"Matheus\",\r\n    \"sobrenome\": \"Della Vechia\",\r\n    \"funcao\": \"develop\",\r\n    \"salario\": 2000.0,\r\n    \"inicioContrato\": \"2022-06-01\"\r\n}",
					"options": {
						"raw": {
							"language": "json"
						}
					}
				},
				"url": {
					"raw": "localhost:8080/funcionario/demitir/4",
					"host": [
						"localhost"
					],
					"port": "8080",
					"path": [
						"funcionario",
						"demitir",
						"4"
					]
				}
			},
			"response": []
		},
		{
			"name": "getContratados",
			"request": {
				"method": "GET",
				"header": [],
				"url": {
					"raw": "localhost:8080/funcionario/all/contratados",
					"host": [
						"localhost"
					],
					"port": "8080",
					"path": [
						"funcionario",
						"all",
						"contratados"
					]
				}
			},
			"response": []
		},
		{
			"name": "getDemitidos",
			"request": {
				"method": "GET",
				"header": [],
				"url": {
					"raw": "localhost:8080/funcionario/all/demitidos",
					"host": [
						"localhost"
					],
					"port": "8080",
					"path": [
						"funcionario",
						"all",
						"demitidos"
					]
				}
			},
			"response": []
		}
	]
}