[
    {
        "test-name": "fapi1-advanced-final-discovery-end-point-verification",
        "variant": {
                "fapi_profile": "openbanking_uk"
        },
        "configuration-filename": "authlete-*.json",
        "current-block": "",
        "condition": "CheckJwksUriIsHostedOnOpenBankingDirectory",
        "expected-result": "warning",
        "comment": "this occurs on everything except production bank deployments"
    },
    {
        "test-name": "fapi1-advanced-final-attempt-reuse-authorisation-code-after-one-second",
        "variant": "*",
        "configuration-filename": "authlete*.json",
        "current-block": "Attempting reuse of authorisation code & testing if access token is revoked",
        "condition": "CallProtectedResourceWithBearerTokenExpectingError",
        "expected-result": "warning",
        "comment": "known case where authlete doesn't implement a 'should'"
    },
    {
        "test-name": "fapi1-advanced-final-refresh-token",
        "variant": {
                "client_auth_type": "private_key_jwt",
                "fapi_profile": "openbanking_uk",
                "fapi_response_mode": "plain_response"
        },
        "configuration-filename": "authlete-fapi-rw-id2-ob-privatekey.json",
        "current-block": "Second client: Check for refresh token",
        "condition": "FAPIEnsureServerConfigurationDoesNotSupportRefreshToken",
        "expected-result": "warning",
        "comment": "The second client in this configuration does not get issued a refresh token, which is now a warning"
    },
    {
        "test-name": "fapi1-advanced-final",
        "variant": "*",
        "configuration-filename": "authlete-fapi-brazil-*.json",
        "current-block": "",
        "condition": "FAPIBrazilMustTestUsingPayments",
        "expected-result": "warning",
        "comment": "The Authlete config we currently have is only good for accounts access"
    },
    {
        "test-name": "fapi1-advanced-final-brazildcr-happy-flow",
        "variant": "*",
        "configuration-filename": "authlete-fapi-brazil-dcr.json",
        "current-block": "",
        "condition": "FAPIBrazilMustTestUsingPayments",
        "expected-result": "warning",
        "comment": "The Authlete config we currently have is only good for accounts access"
    },
    {
        "test-name": "oidcc-codereuse-30seconds",
        "variant": "*",
        "configuration-filename": "authlete-*.json",
        "current-block": "Testing if access token was revoked after the authorization code was reused",
        "condition": "CallProtectedResourceWithBearerTokenExpectingError",
        "expected-result": "warning",
        "comment": "known case where authlete doesn't implement a 'should'"
    },
    {
        "test-name": "oidcc-server-rotate-keys",
        "variant": "*",
        "configuration-filename": "authlete-*.json",
        "current-block": "",
        "condition": "VerifyNewJwksHasNewSigningKey",
        "expected-result": "failure",
        "comment": "CI can't trigger key rotation"
    },
    {
        "test-name": "oidcc-userinfo-post-body",
        "variant": "*",
        "configuration-filename": "authlete-*.json",
        "current-block": "",
        "condition": "UserInfoEndpointWithAccessTokenInBodyNotSupported",
        "expected-result": "warning",
        "comment": "Authlete doesn't support POST with access token in body, which is not required"
    }
]
