{"id":{"$oid":"620a4ceefc13ae63ed000064"},"orderId":"$oid:620a4808fc13ae40eb0004b6","productId":"$oid:620a4525fc13ae30cf000066","quantity":198,"price":330,"subTotal":65340}
{"id":{"$oid":"620a4ceefc13ae63ed000065"},"orderId":"$oid:620a4808fc13ae40eb0004b7","productId":"$oid:620a4525fc13ae30cf000064","quantity":333,"price":795,"subTotal":264735}
{"id":{"$oid":"620a4ceefc13ae63ed000066"},"orderId":"$oid:620a4808fc13ae40eb0004b6","productId":"$oid:620a4525fc13ae30cf000066","quantity":237,"price":811,"subTotal":192207}
{"id":{"$oid":"620a4ceefc13ae63ed000067"},"orderId":"$oid:620a4808fc13ae40eb0004b7","productId":"$oid:620a4525fc13ae30cf000066","quantity":276,"price":653,"subTotal":180228}
{"id":{"$oid":"620a4ceefc13ae63ed000068"},"orderId":"$oid:620a4808fc13ae40eb0004b7","productId":"$oid:620a4525fc13ae30cf000066","quantity":402,"price":640,"subTotal":257280}
{"id":{"$oid":"620a4ceefc13ae63ed000069"},"orderId":"$oid:620a4808fc13ae40eb0004b7","productId":"$oid:620a4525fc13ae30cf000066","quantity":282,"price":312,"subTotal":87984}
{"id":{"$oid":"620a4ceefc13ae63ed00006a"},"orderId":"$oid:620a4808fc13ae40eb0004b5","productId":"$oid:620a4525fc13ae30cf000066","quantity":75,"price":12,"subTotal":900}
{"id":{"$oid":"620a4ceefc13ae63ed00006b"},"orderId":"$oid:620a4808fc13ae40eb0004b6","productId":"$oid:620a4525fc13ae30cf000064","quantity":961,"price":596,"subTotal":572756}
{"id":{"$oid":"620a4ceefc13ae63ed00006c"},"orderId":"$oid:620a4808fc13ae40eb0004b7","productId":"$oid:620a4525fc13ae30cf000065","quantity":372,"price":629,"subTotal":233988}
{"id":{"$oid":"620a4ceefc13ae63ed00006d"},"orderId":"$oid:620a4808fc13ae40eb0004b6","productId":"$oid:620a4525fc13ae30cf000064","quantity":259,"price":777,"subTotal":201243}
{"id":{"$oid":"620a4ceefc13ae63ed00006e"},"orderId":"$oid:620a4808fc13ae40eb0004b5","productId":"$oid:620a4525fc13ae30cf000065","quantity":850,"price":423,"subTotal":359550}
{"id":{"$oid":"620a4ceefc13ae63ed00006f"},"orderId":"$oid:620a4808fc13ae40eb0004b5","productId":"$oid:620a4525fc13ae30cf000066","quantity":744,"price":765,"subTotal":569160}
{"id":{"$oid":"620a4ceefc13ae63ed000070"},"orderId":"$oid:620a4808fc13ae40eb0004b5","productId":"$oid:620a4525fc13ae30cf000064","quantity":136,"price":51,"subTotal":6936}
{"id":{"$oid":"620a4ceefc13ae63ed000071"},"orderId":"$oid:620a4808fc13ae40eb0004b5","productId":"$oid:620a4525fc13ae30cf000066","quantity":174,"price":232,"subTotal":40368}
{"id":{"$oid":"620a4ceefc13ae63ed000072"},"orderId":"$oid:620a4808fc13ae40eb0004b6","productId":"$oid:620a4525fc13ae30cf000065","quantity":65,"price":788,"subTotal":51220}
{"id":{"$oid":"620a4ceefc13ae63ed000073"},"orderId":"$oid:620a4808fc13ae40eb0004b6","productId":"$oid:620a4525fc13ae30cf000066","quantity":848,"price":471,"subTotal":399408}
{"id":{"$oid":"620a4ceefc13ae63ed000074"},"orderId":"$oid:620a4808fc13ae40eb0004b7","productId":"$oid:620a4525fc13ae30cf000064","quantity":780,"price":186,"subTotal":145080}
{"id":{"$oid":"620a4ceefc13ae63ed000075"},"orderId":"$oid:620a4808fc13ae40eb0004b5","productId":"$oid:620a4525fc13ae30cf000066","quantity":861,"price":241,"subTotal":207501}
{"id":{"$oid":"620a4ceefc13ae63ed000076"},"orderId":"$oid:620a4808fc13ae40eb0004b7","productId":"$oid:620a4525fc13ae30cf000066","quantity":367,"price":2,"subTotal":734}
{"id":{"$oid":"620a4ceefc13ae63ed000077"},"orderId":"$oid:620a4808fc13ae40eb0004b7","productId":"$oid:620a4525fc13ae30cf000066","quantity":749,"price":208,"subTotal":155792}
{"id":{"$oid":"620a4ceefc13ae63ed000078"},"orderId":"$oid:620a4808fc13ae40eb0004b6","productId":"$oid:620a4525fc13ae30cf000066","quantity":759,"price":655,"subTotal":497145}
{"id":{"$oid":"620a4ceefc13ae63ed000079"},"orderId":"$oid:620a4808fc13ae40eb0004b7","productId":"$oid:620a4525fc13ae30cf000066","quantity":766,"price":620,"subTotal":474920}
{"id":{"$oid":"620a4ceefc13ae63ed00007a"},"orderId":"$oid:620a4808fc13ae40eb0004b6","productId":"$oid:620a4525fc13ae30cf000065","quantity":800,"price":811,"subTotal":648800}
{"id":{"$oid":"620a4ceefc13ae63ed00007b"},"orderId":"$oid:620a4808fc13ae40eb0004b5","productId":"$oid:620a4525fc13ae30cf000064","quantity":707,"price":714,"subTotal":504798}
{"id":{"$oid":"620a4ceefc13ae63ed00007c"},"orderId":"$oid:620a4808fc13ae40eb0004b7","productId":"$oid:620a4525fc13ae30cf000064","quantity":329,"price":503,"subTotal":165487}
{"id":{"$oid":"620a4ceefc13ae63ed00007d"},"orderId":"$oid:620a4808fc13ae40eb0004b5","productId":"$oid:620a4525fc13ae30cf000065","quantity":120,"price":565,"subTotal":67800}
{"id":{"$oid":"620a4ceefc13ae63ed00007e"},"orderId":"$oid:620a4808fc13ae40eb0004b7","productId":"$oid:620a4525fc13ae30cf000065","quantity":331,"price":187,"subTotal":61897}
{"id":{"$oid":"620a4ceefc13ae63ed00007f"},"orderId":"$oid:620a4808fc13ae40eb0004b6","productId":"$oid:620a4525fc13ae30cf000064","quantity":65,"price":21,"subTotal":1365}
{"id":{"$oid":"620a4ceefc13ae63ed000080"},"orderId":"$oid:620a4808fc13ae40eb0004b6","productId":"$oid:620a4525fc13ae30cf000064","quantity":189,"price":672,"subTotal":127008}
{"id":{"$oid":"620a4ceefc13ae63ed000081"},"orderId":"$oid:620a4808fc13ae40eb0004b5","productId":"$oid:620a4525fc13ae30cf000064","quantity":80,"price":655,"subTotal":52400}
{"id":{"$oid":"620a4ceefc13ae63ed000082"},"orderId":"$oid:620a4808fc13ae40eb0004b5","productId":"$oid:620a4525fc13ae30cf000064","quantity":87,"price":527,"subTotal":45849}
{"id":{"$oid":"620a4ceefc13ae63ed000083"},"orderId":"$oid:620a4808fc13ae40eb0004b5","productId":"$oid:620a4525fc13ae30cf000066","quantity":563,"price":679,"subTotal":382277}
{"id":{"$oid":"620a4ceefc13ae63ed000084"},"orderId":"$oid:620a4808fc13ae40eb0004b6","productId":"$oid:620a4525fc13ae30cf000065","quantity":743,"price":469,"subTotal":348467}
{"id":{"$oid":"620a4ceefc13ae63ed000085"},"orderId":"$oid:620a4808fc13ae40eb0004b7","productId":"$oid:620a4525fc13ae30cf000065","quantity":270,"price":726,"subTotal":196020}
{"id":{"$oid":"620a4ceefc13ae63ed000086"},"orderId":"$oid:620a4808fc13ae40eb0004b5","productId":"$oid:620a4525fc13ae30cf000064","quantity":637,"price":164,"subTotal":104468}
{"id":{"$oid":"620a4ceefc13ae63ed000087"},"orderId":"$oid:620a4808fc13ae40eb0004b5","productId":"$oid:620a4525fc13ae30cf000066","quantity":848,"price":375,"subTotal":318000}
{"id":{"$oid":"620a4ceefc13ae63ed000088"},"orderId":"$oid:620a4808fc13ae40eb0004b5","productId":"$oid:620a4525fc13ae30cf000066","quantity":715,"price":18,"subTotal":12870}
{"id":{"$oid":"620a4ceefc13ae63ed000089"},"orderId":"$oid:620a4808fc13ae40eb0004b5","productId":"$oid:620a4525fc13ae30cf000066","quantity":641,"price":870,"subTotal":557670}
{"id":{"$oid":"620a4ceefc13ae63ed00008a"},"orderId":"$oid:620a4808fc13ae40eb0004b6","productId":"$oid:620a4525fc13ae30cf000065","quantity":186,"price":748,"subTotal":139128}
{"id":{"$oid":"620a4ceefc13ae63ed00008b"},"orderId":"$oid:620a4808fc13ae40eb0004b5","productId":"$oid:620a4525fc13ae30cf000064","quantity":317,"price":453,"subTotal":143601}
{"id":{"$oid":"620a4ceefc13ae63ed00008c"},"orderId":"$oid:620a4808fc13ae40eb0004b6","productId":"$oid:620a4525fc13ae30cf000065","quantity":294,"price":752,"subTotal":221088}
{"id":{"$oid":"620a4ceefc13ae63ed00008d"},"orderId":"$oid:620a4808fc13ae40eb0004b5","productId":"$oid:620a4525fc13ae30cf000066","quantity":738,"price":457,"subTotal":337266}
{"id":{"$oid":"620a4ceefc13ae63ed00008e"},"orderId":"$oid:620a4808fc13ae40eb0004b5","productId":"$oid:620a4525fc13ae30cf000065","quantity":408,"price":364,"subTotal":148512}
{"id":{"$oid":"620a4ceefc13ae63ed00008f"},"orderId":"$oid:620a4808fc13ae40eb0004b6","productId":"$oid:620a4525fc13ae30cf000064","quantity":87,"price":508,"subTotal":44196}
{"id":{"$oid":"620a4ceefc13ae63ed000090"},"orderId":"$oid:620a4808fc13ae40eb0004b6","productId":"$oid:620a4525fc13ae30cf000065","quantity":703,"price":172,"subTotal":120916}
{"id":{"$oid":"620a4ceefc13ae63ed000091"},"orderId":"$oid:620a4808fc13ae40eb0004b6","productId":"$oid:620a4525fc13ae30cf000065","quantity":945,"price":331,"subTotal":312795}
{"id":{"$oid":"620a4ceefc13ae63ed000092"},"orderId":"$oid:620a4808fc13ae40eb0004b6","productId":"$oid:620a4525fc13ae30cf000065","quantity":998,"price":651,"subTotal":649698}
{"id":{"$oid":"620a4ceefc13ae63ed000093"},"orderId":"$oid:620a4808fc13ae40eb0004b6","productId":"$oid:620a4525fc13ae30cf000064","quantity":846,"price":382,"subTotal":323172}
{"id":{"$oid":"620a4ceefc13ae63ed000094"},"orderId":"$oid:620a4808fc13ae40eb0004b5","productId":"$oid:620a4525fc13ae30cf000066","quantity":847,"price":469,"subTotal":397243}
{"id":{"$oid":"620a4ceefc13ae63ed000095"},"orderId":"$oid:620a4808fc13ae40eb0004b5","productId":"$oid:620a4525fc13ae30cf000066","quantity":178,"price":633,"subTotal":112674}
{"id":{"$oid":"620a4ceefc13ae63ed000096"},"orderId":"$oid:620a4808fc13ae40eb0004b5","productId":"$oid:620a4525fc13ae30cf000066","quantity":975,"price":161,"subTotal":156975}
{"id":{"$oid":"620a4ceefc13ae63ed000097"},"orderId":"$oid:620a4808fc13ae40eb0004b7","productId":"$oid:620a4525fc13ae30cf000066","quantity":645,"price":206,"subTotal":132870}
{"id":{"$oid":"620a4ceefc13ae63ed000098"},"orderId":"$oid:620a4808fc13ae40eb0004b7","productId":"$oid:620a4525fc13ae30cf000065","quantity":736,"price":99,"subTotal":72864}
{"id":{"$oid":"620a4ceefc13ae63ed000099"},"orderId":"$oid:620a4808fc13ae40eb0004b6","productId":"$oid:620a4525fc13ae30cf000065","quantity":805,"price":869,"subTotal":699545}
{"id":{"$oid":"620a4ceefc13ae63ed00009a"},"orderId":"$oid:620a4808fc13ae40eb0004b5","productId":"$oid:620a4525fc13ae30cf000065","quantity":165,"price":17,"subTotal":2805}
{"id":{"$oid":"620a4ceefc13ae63ed00009b"},"orderId":"$oid:620a4808fc13ae40eb0004b7","productId":"$oid:620a4525fc13ae30cf000065","quantity":523,"price":457,"subTotal":239011}
{"id":{"$oid":"620a4ceefc13ae63ed00009c"},"orderId":"$oid:620a4808fc13ae40eb0004b5","productId":"$oid:620a4525fc13ae30cf000066","quantity":196,"price":232,"subTotal":45472}
{"id":{"$oid":"620a4ceefc13ae63ed00009d"},"orderId":"$oid:620a4808fc13ae40eb0004b5","productId":"$oid:620a4525fc13ae30cf000066","quantity":588,"price":238,"subTotal":139944}
{"id":{"$oid":"620a4ceefc13ae63ed00009e"},"orderId":"$oid:620a4808fc13ae40eb0004b7","productId":"$oid:620a4525fc13ae30cf000065","quantity":802,"price":488,"subTotal":391376}
{"id":{"$oid":"620a4ceefc13ae63ed00009f"},"orderId":"$oid:620a4808fc13ae40eb0004b6","productId":"$oid:620a4525fc13ae30cf000065","quantity":439,"price":145,"subTotal":63655}
{"id":{"$oid":"620a4ceefc13ae63ed0000a0"},"orderId":"$oid:620a4808fc13ae40eb0004b5","productId":"$oid:620a4525fc13ae30cf000066","quantity":790,"price":187,"subTotal":147730}
{"id":{"$oid":"620a4ceefc13ae63ed0000a1"},"orderId":"$oid:620a4808fc13ae40eb0004b6","productId":"$oid:620a4525fc13ae30cf000065","quantity":525,"price":59,"subTotal":30975}
{"id":{"$oid":"620a4ceefc13ae63ed0000a2"},"orderId":"$oid:620a4808fc13ae40eb0004b5","productId":"$oid:620a4525fc13ae30cf000066","quantity":505,"price":316,"subTotal":159580}
{"id":{"$oid":"620a4ceefc13ae63ed0000a3"},"orderId":"$oid:620a4808fc13ae40eb0004b6","productId":"$oid:620a4525fc13ae30cf000065","quantity":526,"price":390,"subTotal":205140}
{"id":{"$oid":"620a4ceefc13ae63ed0000a4"},"orderId":"$oid:620a4808fc13ae40eb0004b7","productId":"$oid:620a4525fc13ae30cf000064","quantity":495,"price":15,"subTotal":7425}
{"id":{"$oid":"620a4ceefc13ae63ed0000a5"},"orderId":"$oid:620a4808fc13ae40eb0004b7","productId":"$oid:620a4525fc13ae30cf000065","quantity":475,"price":665,"subTotal":315875}
{"id":{"$oid":"620a4ceefc13ae63ed0000a6"},"orderId":"$oid:620a4808fc13ae40eb0004b5","productId":"$oid:620a4525fc13ae30cf000065","quantity":677,"price":574,"subTotal":388598}
{"id":{"$oid":"620a4ceefc13ae63ed0000a7"},"orderId":"$oid:620a4808fc13ae40eb0004b7","productId":"$oid:620a4525fc13ae30cf000065","quantity":109,"price":289,"subTotal":31501}
{"id":{"$oid":"620a4ceefc13ae63ed0000a8"},"orderId":"$oid:620a4808fc13ae40eb0004b6","productId":"$oid:620a4525fc13ae30cf000064","quantity":277,"price":68,"subTotal":18836}
{"id":{"$oid":"620a4ceefc13ae63ed0000a9"},"orderId":"$oid:620a4808fc13ae40eb0004b7","productId":"$oid:620a4525fc13ae30cf000065","quantity":635,"price":4,"subTotal":2540}
{"id":{"$oid":"620a4ceefc13ae63ed0000aa"},"orderId":"$oid:620a4808fc13ae40eb0004b7","productId":"$oid:620a4525fc13ae30cf000064","quantity":561,"price":104,"subTotal":58344}
{"id":{"$oid":"620a4ceefc13ae63ed0000ab"},"orderId":"$oid:620a4808fc13ae40eb0004b5","productId":"$oid:620a4525fc13ae30cf000064","quantity":895,"price":250,"subTotal":223750}
{"id":{"$oid":"620a4ceefc13ae63ed0000ac"},"orderId":"$oid:620a4808fc13ae40eb0004b6","productId":"$oid:620a4525fc13ae30cf000065","quantity":424,"price":738,"subTotal":312912}
{"id":{"$oid":"620a4ceefc13ae63ed0000ad"},"orderId":"$oid:620a4808fc13ae40eb0004b5","productId":"$oid:620a4525fc13ae30cf000065","quantity":339,"price":899,"subTotal":304761}
{"id":{"$oid":"620a4ceefc13ae63ed0000ae"},"orderId":"$oid:620a4808fc13ae40eb0004b7","productId":"$oid:620a4525fc13ae30cf000064","quantity":746,"price":199,"subTotal":148454}
{"id":{"$oid":"620a4ceefc13ae63ed0000af"},"orderId":"$oid:620a4808fc13ae40eb0004b6","productId":"$oid:620a4525fc13ae30cf000066","quantity":422,"price":92,"subTotal":38824}
{"id":{"$oid":"620a4ceefc13ae63ed0000b0"},"orderId":"$oid:620a4808fc13ae40eb0004b6","productId":"$oid:620a4525fc13ae30cf000064","quantity":376,"price":183,"subTotal":68808}
{"id":{"$oid":"620a4ceefc13ae63ed0000b1"},"orderId":"$oid:620a4808fc13ae40eb0004b7","productId":"$oid:620a4525fc13ae30cf000066","quantity":839,"price":374,"subTotal":313786}
{"id":{"$oid":"620a4ceefc13ae63ed0000b2"},"orderId":"$oid:620a4808fc13ae40eb0004b7","productId":"$oid:620a4525fc13ae30cf000065","quantity":53,"price":137,"subTotal":7261}
{"id":{"$oid":"620a4ceefc13ae63ed0000b3"},"orderId":"$oid:620a4808fc13ae40eb0004b5","productId":"$oid:620a4525fc13ae30cf000065","quantity":151,"price":298,"subTotal":44998}
{"id":{"$oid":"620a4ceefc13ae63ed0000b4"},"orderId":"$oid:620a4808fc13ae40eb0004b7","productId":"$oid:620a4525fc13ae30cf000065","quantity":350,"price":876,"subTotal":306600}
{"id":{"$oid":"620a4ceefc13ae63ed0000b5"},"orderId":"$oid:620a4808fc13ae40eb0004b6","productId":"$oid:620a4525fc13ae30cf000066","quantity":15,"price":412,"subTotal":6180}
{"id":{"$oid":"620a4ceefc13ae63ed0000b6"},"orderId":"$oid:620a4808fc13ae40eb0004b7","productId":"$oid:620a4525fc13ae30cf000065","quantity":38,"price":272,"subTotal":10336}
{"id":{"$oid":"620a4ceefc13ae63ed0000b7"},"orderId":"$oid:620a4808fc13ae40eb0004b5","productId":"$oid:620a4525fc13ae30cf000066","quantity":750,"price":455,"subTotal":341250}
{"id":{"$oid":"620a4ceefc13ae63ed0000b8"},"orderId":"$oid:620a4808fc13ae40eb0004b6","productId":"$oid:620a4525fc13ae30cf000065","quantity":747,"price":501,"subTotal":374247}
{"id":{"$oid":"620a4ceefc13ae63ed0000b9"},"orderId":"$oid:620a4808fc13ae40eb0004b5","productId":"$oid:620a4525fc13ae30cf000065","quantity":832,"price":705,"subTotal":586560}
{"id":{"$oid":"620a4ceefc13ae63ed0000ba"},"orderId":"$oid:620a4808fc13ae40eb0004b7","productId":"$oid:620a4525fc13ae30cf000066","quantity":984,"price":38,"subTotal":37392}
{"id":{"$oid":"620a4ceefc13ae63ed0000bb"},"orderId":"$oid:620a4808fc13ae40eb0004b7","productId":"$oid:620a4525fc13ae30cf000064","quantity":742,"price":128,"subTotal":94976}
{"id":{"$oid":"620a4ceefc13ae63ed0000bc"},"orderId":"$oid:620a4808fc13ae40eb0004b6","productId":"$oid:620a4525fc13ae30cf000066","quantity":624,"price":367,"subTotal":229008}
{"id":{"$oid":"620a4ceefc13ae63ed0000bd"},"orderId":"$oid:620a4808fc13ae40eb0004b6","productId":"$oid:620a4525fc13ae30cf000066","quantity":147,"price":650,"subTotal":95550}
{"id":{"$oid":"620a4ceefc13ae63ed0000be"},"orderId":"$oid:620a4808fc13ae40eb0004b5","productId":"$oid:620a4525fc13ae30cf000066","quantity":539,"price":20,"subTotal":10780}
{"id":{"$oid":"620a4ceefc13ae63ed0000bf"},"orderId":"$oid:620a4808fc13ae40eb0004b6","productId":"$oid:620a4525fc13ae30cf000064","quantity":278,"price":61,"subTotal":16958}
{"id":{"$oid":"620a4ceefc13ae63ed0000c0"},"orderId":"$oid:620a4808fc13ae40eb0004b6","productId":"$oid:620a4525fc13ae30cf000066","quantity":606,"price":88,"subTotal":53328}
{"id":{"$oid":"620a4ceefc13ae63ed0000c1"},"orderId":"$oid:620a4808fc13ae40eb0004b5","productId":"$oid:620a4525fc13ae30cf000065","quantity":276,"price":328,"subTotal":90528}
{"id":{"$oid":"620a4ceefc13ae63ed0000c2"},"orderId":"$oid:620a4808fc13ae40eb0004b6","productId":"$oid:620a4525fc13ae30cf000064","quantity":144,"price":740,"subTotal":106560}
{"id":{"$oid":"620a4ceefc13ae63ed0000c3"},"orderId":"$oid:620a4808fc13ae40eb0004b5","productId":"$oid:620a4525fc13ae30cf000064","quantity":203,"price":863,"subTotal":175189}
{"id":{"$oid":"620a4ceefc13ae63ed0000c4"},"orderId":"$oid:620a4808fc13ae40eb0004b6","productId":"$oid:620a4525fc13ae30cf000064","quantity":743,"price":557,"subTotal":413851}
{"id":{"$oid":"620a4ceefc13ae63ed0000c5"},"orderId":"$oid:620a4808fc13ae40eb0004b5","productId":"$oid:620a4525fc13ae30cf000065","quantity":351,"price":884,"subTotal":310284}
{"id":{"$oid":"620a4ceefc13ae63ed0000c6"},"orderId":"$oid:620a4808fc13ae40eb0004b7","productId":"$oid:620a4525fc13ae30cf000066","quantity":69,"price":431,"subTotal":29739}
{"id":{"$oid":"620a4ceefc13ae63ed0000c7"},"orderId":"$oid:620a4808fc13ae40eb0004b5","productId":"$oid:620a4525fc13ae30cf000066","quantity":380,"price":63,"subTotal":23940}