// function iterate(obj, stack) {
	
//     for (let property in obj) {
//         if (obj.hasOwnProperty(property)) {
//             if (typeof obj[property] == "object") {
//                 iterate(obj[property], stack + '.' + property);
//             } else {
//                 console.log(property + "\t:\t" + obj[property]);
//             }
//         }
//     }
// }
//iterate(favArtist, '')

// const isObject = function(val) {
// 	if(val === null) {
// 		return false
// 	}
// 	return (typeof val === 'object')
// }
