<svg width="32" height="32" xmlns="http://www.w3.org/2000/svg">

 <title/>
 <g>
  <title>background</title>
  <rect fill="none" id="canvas_background" height="402" width="582" y="-1" x="-1"/>
 </g>
 <g>
  <title>Layer 1</title>
  <path fill="#ffca04" id="svg_1" d="m14.47,29.36a12.47,12.47 0 1 1 0,-24.93l0.66,0a0.93,0.93 0 1 1 -0.13,1.87l-0.55,0a10.61,10.61 0 1 0 10.62,10.6c0,-0.19 0,-0.37 0,-0.56a0.93,0.93 0 0 1 1.86,-0.11c0,0.23 0,0.44 0,0.67a12.47,12.47 0 0 1 -12.46,12.46z" class="cls-1"/>
  <path fill-opacity="0.8" fill="#ffca04" id="svg_2" d="m25,9l4.78,-4.77a0.93,0.93 0 0 0 -1.32,-1.32l-4.83,4.77l-4.77,-4.77a0.93,0.93 0 0 0 -1.32,1.32l4.77,4.77l-4.77,4.78a0.94,0.94 0 0 0 0,1.32a0.94,0.94 0 0 0 1.32,0l4.77,-4.78l4.78,4.78a0.93,0.93 0 0 0 0.66,0.27a0.93,0.93 0 0 0 0.66,-1.59l-4.73,-4.78z" class="cls-2"/>
 </g>
</svg>