<svg width="303" height="57" viewBox="0 0 303 57" fill="none" xmlns="http://www.w3.org/2000/svg">
<g clip-path="url(#clip0_1_9907)">
<path d="M23.2028 51.6739C16.7838 51.6739 11.569 49.8255 7.66292 46.144C-0.880774 38.0935 -3.21149e-05 24.3604 0.0447514 23.7799C0.0895348 23.1332 0.607033 22.624 1.23898 22.6036C11.569 22.2268 19.3862 24.8696 24.4716 30.4657C31.7614 38.4907 30.6717 49.5455 30.6169 50.014C30.5572 50.5843 30.1293 51.0425 29.577 51.1342C27.3378 51.4957 25.2081 51.679 23.2028 51.679V51.6739ZM2.49789 25.1191C2.49291 28.4646 3.04027 38.338 9.35971 44.2803C13.7286 48.3845 20.063 49.8917 28.1986 48.7664C28.2733 46.0269 27.9747 38.0477 22.6355 32.1817C18.3612 27.492 11.8178 25.1191 3.16467 25.1191C2.94573 25.1191 2.72181 25.1191 2.49789 25.1191Z" fill="white"/>
<path d="M27.1342 50.1003C26.8257 50.1003 26.5122 49.9832 26.2733 49.7489C17.8043 41.4439 10.6937 35.9139 10.624 35.863C10.0766 35.4404 9.96718 34.6409 10.3852 34.0808C10.7982 33.5207 11.5794 33.4087 12.1267 33.8364C12.1964 33.8924 19.4264 39.5089 27.995 47.9158C28.4926 48.4046 28.5075 49.2092 28.0348 49.7184C27.791 49.9781 27.4626 50.1105 27.1391 50.1105L27.1342 50.1003Z" fill="white"/>
<path d="M37.8124 47.3355C36.7774 47.3355 36.1255 47.2744 36.0161 47.2592C35.4588 47.1981 35.006 46.7652 34.9164 46.2C33.3639 36.5812 34.9562 29.0247 39.6435 23.7392C47.4508 14.9402 60.8709 15.7549 61.4431 15.7905C62.0751 15.8364 62.5776 16.3557 62.6025 17.0075C63.0454 27.5785 60.5126 35.5934 55.0789 40.833C49.0779 46.6176 41.2856 47.3305 37.8124 47.3305V47.3355ZM37.2203 44.7743C39.8973 44.8252 47.6946 44.4738 53.3921 38.9694C58.0645 34.4528 60.3385 27.5072 60.1544 18.3162C56.8852 18.3314 47.2418 18.9578 41.4797 25.4653C37.4989 29.9616 36.0658 36.4539 37.2252 44.7743H37.2203Z" fill="white"/>
<path d="M36.2698 46.7649C36.0707 46.7649 35.8717 46.7191 35.6876 46.6172C35.0805 46.2863 34.8516 45.5174 35.1751 44.8961C35.4438 44.3768 41.8876 32.1254 50.8791 26.6769C51.4713 26.3205 52.2326 26.5191 52.5809 27.125C52.9292 27.731 52.7352 28.51 52.143 28.8665C43.7536 33.9483 37.4292 45.9655 37.3645 46.0877C37.1406 46.5154 36.7077 46.7649 36.2648 46.7649H36.2698Z" fill="white"/>
<path d="M32.856 27.6742C32.8112 27.6742 32.7664 27.6742 32.7216 27.6691C25.3323 26.8544 20.1026 24.0385 17.1917 19.308C12.3451 11.4409 15.7487 1.2772 15.893 0.849471C16.102 0.238429 16.7289 -0.112919 17.3459 0.029657C25.193 1.89333 30.5521 5.52394 33.269 10.8094C37.1751 18.3965 34.1398 26.5183 34.0104 26.8595C33.8213 27.3534 33.3585 27.6691 32.851 27.6691L32.856 27.6742ZM17.9281 2.79971C17.2464 5.4883 15.9527 12.5306 19.3015 17.9586C21.6651 21.7827 25.9294 24.1505 31.9901 25.006C32.5972 22.8215 33.7367 17.149 31.0646 11.9755C28.8205 7.63203 24.4068 4.55136 17.9281 2.79971Z" fill="white"/>
<path d="M31.8762 27.2015C31.3985 27.2015 30.9407 26.9163 30.7367 26.4427C28.1492 20.4393 21.8895 12.8216 21.8298 12.7452C21.3869 12.2055 21.4516 11.406 21.9791 10.9528C22.5065 10.4996 23.2877 10.5658 23.7306 11.1056C23.9943 11.4264 30.2789 19.0746 33.0157 25.4192C33.2943 26.0608 33.0107 26.8145 32.3788 27.0996C32.2146 27.176 32.0454 27.2065 31.8762 27.2065V27.2015Z" fill="white"/>
<path d="M73.9072 14.4863H80.5899C81.401 16.5079 82.1474 18.341 82.844 19.9908C83.5407 21.6406 84.2024 23.2344 84.8394 24.7773C85.4763 26.3202 86.1232 27.9242 86.785 29.5892C87.4418 31.2543 88.1285 33.1078 88.84 35.1548C89.0341 35.7149 89.2082 36.2547 89.3774 36.7639C89.5416 37.2782 89.6909 37.7772 89.8302 38.2711C89.9696 37.7823 90.1188 37.2782 90.2831 36.7639C90.4473 36.2496 90.6264 35.7149 90.8205 35.1548C91.5469 33.1078 92.2336 31.2492 92.8855 29.5892C93.5373 27.9242 94.1792 26.3253 94.8161 24.7773C95.4531 23.2344 96.1198 21.6355 96.8214 19.9908C97.523 18.3461 98.2694 16.5079 99.0656 14.4863H105.748L93.1392 46.0568H86.5163L73.9072 14.4863Z" fill="white"/>
<path d="M109.461 37.3442C109.829 38.5102 110.516 39.4573 111.506 40.1855C112.501 40.9137 113.661 41.2803 114.994 41.2803C116.422 41.2803 117.601 41.046 118.542 40.5776C119.482 40.1091 120.333 39.4981 121.105 38.7546L124.682 43.1338C123.09 44.4119 121.518 45.2877 119.96 45.7663C118.403 46.245 116.915 46.4843 115.487 46.4843C113.213 46.4843 111.202 46.0108 109.461 45.0636C107.719 44.1165 106.356 42.813 105.366 41.1479C104.38 39.4828 103.883 37.5937 103.883 35.4754C103.883 33.3571 104.356 31.524 105.301 29.8894C106.246 28.2549 107.54 26.9615 109.177 26.0144C110.814 25.0673 112.675 24.5938 114.76 24.5938C116.845 24.5938 118.671 25.0622 120.284 26.0042C121.896 26.9463 123.165 28.2345 124.1 29.8793C125.031 31.5189 125.498 33.4029 125.498 35.5212V37.3543H109.456L109.461 37.3442ZM119.418 33.9783C119.129 32.7461 118.542 31.748 117.651 30.9893C116.761 30.2306 115.691 29.8538 114.442 29.8538C113.193 29.8538 112.088 30.2408 111.163 31.0097C110.237 31.7837 109.63 32.7715 109.341 33.9783H119.418Z" fill="white"/>
<path d="M137.57 24.5898C138.914 24.5898 140.158 24.8241 141.302 25.2925C142.447 25.761 143.452 26.4281 144.317 27.2835L144.462 25.0125H150.055V43.5983C150.055 46.292 149.557 48.6445 148.562 50.6508C147.567 52.657 146.178 54.2203 144.387 55.3354C142.596 56.4506 140.496 57.0107 138.083 57.0107C136.754 57.0107 135.341 56.8223 133.848 56.4404C132.355 56.0636 130.823 55.4729 129.26 54.6735L131.052 49.6426C131.738 50.2332 132.699 50.7322 133.933 51.1498C135.167 51.5622 136.351 51.771 137.49 51.771C139.536 51.771 141.153 51.0734 142.342 49.6782C143.531 48.283 144.133 46.3989 144.133 44.0261V43.9853C143.268 44.7695 142.282 45.3856 141.173 45.8286C140.063 46.2716 138.864 46.4906 137.575 46.4906C135.654 46.4906 133.938 46.017 132.425 45.0699C130.912 44.1228 129.718 42.8243 128.857 41.1745C127.991 39.5247 127.563 37.6509 127.563 35.5428C127.563 33.4347 127.996 31.5608 128.857 29.911C129.723 28.2612 130.912 26.9627 132.425 26.0156C133.938 25.0685 135.659 24.5949 137.575 24.5949L137.57 24.5898ZM138.909 41.2204C140.416 41.2204 141.665 40.6806 142.651 39.6011C143.636 38.5216 144.133 37.1671 144.133 35.5377C144.133 33.9082 143.641 32.5538 142.651 31.4742C141.665 30.3947 140.416 29.855 138.909 29.855C137.401 29.855 136.152 30.3947 135.167 31.4742C134.181 32.5538 133.684 33.9082 133.684 35.5377C133.684 37.1671 134.177 38.5216 135.167 39.6011C136.152 40.6806 137.401 41.2204 138.909 41.2204Z" fill="white"/>
<path d="M159.116 37.3442C159.484 38.5102 160.171 39.4573 161.161 40.1855C162.156 40.9137 163.316 41.2803 164.649 41.2803C166.077 41.2803 167.257 41.046 168.197 40.5776C169.138 40.1091 169.989 39.4981 170.76 38.7546L174.338 43.1338C172.745 44.4119 171.173 45.2877 169.615 45.7663C168.058 46.245 166.57 46.4843 165.142 46.4843C162.868 46.4843 160.858 46.0108 159.116 45.0636C157.375 44.1165 156.011 42.813 155.021 41.1479C154.036 39.4828 153.538 37.5937 153.538 35.4754C153.538 33.3571 154.011 31.524 154.956 29.8894C155.902 28.2549 157.195 26.9615 158.832 26.0144C160.47 25.0673 162.331 24.5938 164.416 24.5938C166.5 24.5938 168.327 25.0622 169.939 26.0042C171.551 26.9463 172.82 28.2345 173.755 29.8793C174.686 31.5189 175.154 33.4029 175.154 35.5212V37.3543H159.111L159.116 37.3442ZM169.073 33.9783C168.784 32.7461 168.197 31.748 167.307 30.9893C166.416 30.2306 165.346 29.8538 164.097 29.8538C162.848 29.8538 161.743 30.2408 160.818 31.0097C159.892 31.7837 159.285 32.7715 158.997 33.9783H169.073Z" fill="white"/>
<path d="M176.776 25.012H180.169V19.752H186.091V25.012H191.086V30.2721H186.091V38.017C186.091 39.015 186.404 39.7941 187.026 40.3644C187.648 40.9347 188.439 41.2148 189.4 41.2148C190.111 41.2148 190.848 41.0518 191.599 40.731V45.6958C190.295 46.2151 189.011 46.4748 187.753 46.4748C185.309 46.4748 183.438 45.8027 182.125 44.4635C180.816 43.1243 180.159 41.2046 180.159 38.7095V30.267H176.766V25.0069L176.776 25.012Z" fill="white"/>
<path d="M194.634 40.2682C194.634 38.8679 195.027 37.6101 195.818 36.5001C196.604 35.39 197.694 34.5142 199.077 33.8675C200.461 33.2208 202.048 32.9 203.829 32.9C204.392 32.9 204.984 32.9357 205.611 33.0069C206.233 33.0782 206.86 33.1699 207.492 33.2819C207.039 30.9956 205.417 29.8499 202.615 29.8499C200.958 29.8499 199.291 30.4864 197.619 31.7645L195.584 26.6521C197.012 25.9494 198.416 25.43 199.799 25.094C201.182 24.7579 202.501 24.5898 203.75 24.5898C205.74 24.5898 207.462 24.9717 208.925 25.7355C210.388 26.4993 211.517 27.5789 212.328 28.9792C213.139 30.3744 213.542 32.014 213.542 33.893V46.0578H208.566L208.173 43.8071C207.407 44.6371 206.472 45.2889 205.367 45.7624C204.262 46.2411 203.053 46.4804 201.734 46.4804C199.65 46.4804 197.948 45.905 196.624 44.7542C195.301 43.6034 194.639 42.1115 194.639 40.2732L194.634 40.2682ZM200.555 38.878C200.555 39.5807 200.819 40.1459 201.346 40.5737C201.874 41.0014 202.57 41.2153 203.436 41.2153C204.616 41.2153 205.606 40.8486 206.407 40.1205C207.208 39.3923 207.611 38.491 207.611 37.4268V37.0042C207.104 36.8361 206.556 36.7037 205.974 36.6019C205.392 36.5052 204.82 36.4542 204.257 36.4542C203.093 36.4542 202.182 36.663 201.53 37.0856C200.879 37.5083 200.555 38.104 200.555 38.8729V38.878Z" fill="white"/>
<path d="M236.093 43.3633C235.093 44.3461 233.894 45.1099 232.505 45.6598C231.112 46.2047 229.604 46.4796 227.972 46.4796C225.793 46.4796 223.847 46.0061 222.14 45.059C220.434 44.1119 219.085 42.8134 218.1 41.1636C217.115 39.5138 216.617 37.6399 216.617 35.5318C216.617 33.4237 217.11 31.5499 218.1 29.9C219.09 28.2502 220.434 26.9518 222.14 26.0047C223.847 25.0575 225.793 24.584 227.972 24.584C229.604 24.584 231.117 24.859 232.505 25.4038C233.899 25.9537 235.093 26.7175 236.093 27.7003L231.918 31.7179C230.933 30.4704 229.614 29.844 227.967 29.844C226.46 29.844 225.211 30.3838 224.225 31.4633C223.24 32.5428 222.743 33.8973 222.743 35.5267C222.743 37.1562 223.235 38.5106 224.225 39.5901C225.211 40.6697 226.46 41.2094 227.967 41.2094C229.614 41.2094 230.928 40.5831 231.918 39.3355L236.093 43.3531V43.3633Z" fill="white"/>
<path d="M245.503 13.6406V46.0564H239.582V13.6406H245.503Z" fill="white"/>
<path d="M249.772 17.8521C249.772 16.8439 250.076 16.0292 250.678 15.4131C251.28 14.7969 252.076 14.4863 253.062 14.4863C254.047 14.4863 254.843 14.7969 255.445 15.4131C256.047 16.0292 256.351 16.8439 256.351 17.8521C256.351 18.8604 256.047 19.6751 255.445 20.2912C254.843 20.9074 254.047 21.218 253.062 21.218C252.076 21.218 251.28 20.9074 250.678 20.2912C250.076 19.6751 249.772 18.8604 249.772 17.8521ZM250.101 46.0568V25.0115H256.027V46.0568H250.101Z" fill="white"/>
<path d="M278.657 43.3633C277.657 44.3461 276.458 45.1099 275.07 45.6598C273.677 46.2047 272.169 46.4796 270.537 46.4796C268.357 46.4796 266.412 46.0061 264.705 45.059C262.998 44.1119 261.65 42.8134 260.664 41.1636C259.679 39.5138 259.182 37.6399 259.182 35.5318C259.182 33.4237 259.674 31.5499 260.664 29.9C261.655 28.2502 262.998 26.9518 264.705 26.0047C266.412 25.0575 268.357 24.584 270.537 24.584C272.169 24.584 273.682 24.859 275.07 25.4038C276.463 25.9537 277.657 26.7175 278.657 27.7003L274.483 31.7179C273.497 30.4704 272.179 29.844 270.532 29.844C269.024 29.844 267.775 30.3838 266.79 31.4633C265.805 32.5428 265.307 33.8973 265.307 35.5267C265.307 37.1562 265.8 38.5106 266.79 39.5901C267.775 40.6697 269.024 41.2094 270.532 41.2094C272.179 41.2094 273.492 40.5831 274.483 39.3355L278.657 43.3531V43.3633Z" fill="white"/>
<path d="M282.146 46.0568V14.4863H288.067V33.6425C288.48 32.9856 288.933 32.3389 289.425 31.7177C289.918 31.0914 290.46 30.4294 291.052 29.7267L295.043 25.0115H301.522L293.625 34.4623L303.005 46.0619H295.745L289.863 38.9484L288.072 41.0972V46.0619H282.15L282.146 46.0568Z" fill="white"/>
</g>
<defs>
<clipPath id="clip0_1_9907">
<rect width="303" height="57" fill="white"/>
</clipPath>
</defs>
</svg>
