<svg width="180" height="34" viewBox="0 0 180 34" fill="none" xmlns="http://www.w3.org/2000/svg">
<g id="Calque_1" clip-path="url(#clip0_95_4137)">
<g id="Group 446">
<path id="Vector" d="M13.7844 30.8241C9.97117 30.8241 6.87327 29.7216 4.55281 27.5256C-0.522652 22.7235 0.000561058 14.5318 0.0271651 14.1856C0.0537692 13.7998 0.361194 13.4961 0.736606 13.4839C6.87327 13.2592 11.5172 14.8356 14.5382 18.1736C18.8687 22.9604 18.2214 29.5545 18.1889 29.8339C18.1534 30.1741 17.8992 30.4475 17.5711 30.5022C16.2409 30.7178 14.9757 30.8272 13.7844 30.8272V30.8241ZM1.48448 14.9844C1.48152 16.9799 1.80668 22.8693 5.56081 26.4139C8.15618 28.862 11.9192 29.761 16.7522 29.0898C16.7966 27.4557 16.6192 22.6962 13.4474 19.1972C10.9082 16.3998 7.02107 14.9844 1.88058 14.9844C1.75052 14.9844 1.6175 14.9844 1.48448 14.9844Z" fill="#46A17A"/>
<path id="Vector_2" d="M16.1195 29.8858C15.9363 29.8858 15.75 29.8159 15.6081 29.6762C10.577 24.7223 6.35289 21.4238 6.31151 21.3934C5.98635 21.1413 5.92132 20.6644 6.16962 20.3303C6.41497 19.9962 6.87906 19.9294 7.20422 20.1845C7.24561 20.2179 11.5407 23.5681 16.6309 28.5828C16.9265 28.8744 16.9354 29.3543 16.6546 29.658C16.5097 29.8129 16.3146 29.8919 16.1225 29.8919L16.1195 29.8858Z" fill="#46A17A"/>
<path id="Vector_3" d="M22.4627 28.2354C21.8479 28.2354 21.4606 28.199 21.3956 28.1899C21.0645 28.1534 20.7955 27.8953 20.7423 27.5581C19.82 21.8206 20.766 17.3132 23.5505 14.1604C28.1885 8.91188 36.1608 9.39785 36.5008 9.41911C36.8762 9.44645 37.1747 9.75626 37.1895 10.145C37.4526 16.4506 35.948 21.2313 32.72 24.3568C29.1551 27.8072 24.526 28.2324 22.4627 28.2324V28.2354ZM22.1109 26.7077C23.7013 26.738 28.3333 26.5285 31.718 23.2451C34.4936 20.551 35.8445 16.408 35.7352 10.9256C33.7931 10.9347 28.0643 11.3083 24.6413 15.1901C22.2765 17.872 21.4251 21.7446 22.1139 26.7077H22.1109Z" fill="#46A17A"/>
<path id="Vector_4" d="M21.5471 27.8964C21.4288 27.8964 21.3106 27.8691 21.2012 27.8083C20.8406 27.6109 20.7046 27.1523 20.8968 26.7817C21.0564 26.4719 24.8844 19.1641 30.2259 15.9141C30.5777 15.7015 31.0299 15.82 31.2369 16.1814C31.4438 16.5429 31.3285 17.0076 30.9767 17.2202C25.9929 20.2514 22.2358 27.4196 22.1974 27.4925C22.0644 27.7476 21.8072 27.8964 21.5441 27.8964H21.5471Z" fill="#46A17A"/>
<path id="Vector_5" d="M19.5184 16.5086C19.4918 16.5086 19.4652 16.5086 19.4386 16.5055C15.0489 16.0196 11.9422 14.3399 10.2129 11.5182C7.33374 6.82554 9.35565 0.763004 9.44137 0.507867C9.56552 0.143386 9.93798 -0.0661904 10.3045 0.0188552C14.9661 1.13052 18.1498 3.29615 19.7637 6.44891C22.0842 10.9745 20.281 15.8191 20.2042 16.0226C20.0919 16.3172 19.8169 16.5055 19.5154 16.5055L19.5184 16.5086ZM10.6504 1.67117C10.2454 3.27489 9.47684 7.47553 11.4662 10.7133C12.8703 12.9944 15.4036 14.4067 19.004 14.917C19.3647 13.614 20.0416 10.2304 18.4542 7.14446C17.1211 4.55361 14.4991 2.71601 10.6504 1.67117Z" fill="#61D7A3"/>
<path id="Vector_6" d="M18.9366 16.2269C18.6528 16.2269 18.3808 16.0568 18.2596 15.7743C16.7225 12.1933 13.0039 7.64941 12.9684 7.60385C12.7053 7.2819 12.7437 6.80503 13.0571 6.53471C13.3704 6.26439 13.8345 6.30387 14.0976 6.62583C14.2542 6.81718 17.9877 11.3793 19.6135 15.1638C19.779 15.5465 19.6105 15.996 19.2351 16.1661C19.1376 16.2117 19.0371 16.2299 18.9366 16.2299V16.2269Z" fill="#61D7A3"/>
</g>
<path id="Vector_7" d="M43.9053 8.64062H47.8752C48.357 9.84645 48.8004 10.9399 49.2143 11.924C49.6281 12.9081 50.0212 13.8588 50.3996 14.7791C50.778 15.6994 51.1623 16.6562 51.5554 17.6494C51.9456 18.6426 52.3535 19.7482 52.7762 20.9692C52.8915 21.3033 52.995 21.6253 53.0955 21.929C53.193 22.2358 53.2817 22.5334 53.3645 22.828C53.4473 22.5365 53.5359 22.2358 53.6335 21.929C53.731 21.6222 53.8375 21.3033 53.9527 20.9692C54.3843 19.7482 54.7922 18.6396 55.1795 17.6494C55.5667 16.6562 55.948 15.7024 56.3264 14.7791C56.7048 13.8588 57.1009 12.9051 57.5177 11.924C57.9345 10.9429 58.3779 9.84645 58.8508 8.64062H62.8207L55.3302 27.4721H51.3958L43.9053 8.64062Z" fill="#374E3E"/>
<path id="Vector_8" d="M65.0266 22.2754C65.2453 22.971 65.6532 23.5359 66.2415 23.9703C66.8327 24.4046 67.5214 24.6233 68.3137 24.6233C69.162 24.6233 69.8626 24.4836 70.4213 24.2041C70.98 23.9247 71.4854 23.5602 71.9436 23.1168L74.069 25.7289C73.1231 26.4913 72.189 27.0137 71.2637 27.2992C70.3385 27.5847 69.4547 27.7275 68.6063 27.7275C67.2554 27.7275 66.0612 27.445 65.0266 26.88C63.992 26.3151 63.182 25.5375 62.5938 24.5443C62.0085 23.5511 61.7129 22.4243 61.7129 21.1607C61.7129 19.8972 61.9937 18.8037 62.5553 17.8288C63.117 16.8538 63.8856 16.0823 64.8581 15.5173C65.8306 14.9524 66.9362 14.6699 68.1747 14.6699C69.4133 14.6699 70.4981 14.9494 71.4559 15.5113C72.4136 16.0732 73.1674 16.8416 73.7231 17.8227C74.2759 18.8007 74.5538 19.9245 74.5538 21.1881V22.2815H65.0236L65.0266 22.2754ZM70.9415 20.2677C70.7701 19.5327 70.4213 18.9374 69.8922 18.4848C69.363 18.0323 68.7275 17.8075 67.9855 17.8075C67.2436 17.8075 66.5873 18.0383 66.0375 18.497C65.4877 18.9586 65.1271 19.5479 64.9556 20.2677H70.9415Z" fill="#374E3E"/>
<path id="Vector_9" d="M81.7248 14.668C82.5229 14.668 83.2619 14.8077 83.9418 15.0871C84.6217 15.3666 85.2188 15.7644 85.7331 16.2747L85.8189 14.9201H89.1414V26.0064C89.1414 27.6131 88.8458 29.0164 88.2546 30.2131C87.6634 31.4098 86.8387 32.3423 85.7745 33.0074C84.7104 33.6726 83.4629 34.0067 82.0293 34.0067C81.24 34.0067 80.4005 33.8943 79.5137 33.6665C78.6269 33.4418 77.7165 33.0894 76.7883 32.6126L77.8524 29.6117C78.2604 29.964 78.8309 30.2617 79.564 30.5107C80.2971 30.7568 81.0006 30.8813 81.6775 30.8813C82.8924 30.8813 83.8531 30.4652 84.5596 29.6329C85.2661 28.8007 85.6238 27.6769 85.6238 26.2615V26.2372C85.1094 26.705 84.5241 27.0725 83.8649 27.3367C83.2058 27.601 82.4934 27.7316 81.7278 27.7316C80.5867 27.7316 79.5669 27.4491 78.6683 26.8842C77.7697 26.3192 77.0602 25.5447 76.5488 24.5606C76.0345 23.5765 75.7803 22.4588 75.7803 21.2013C75.7803 19.9438 76.0374 18.8261 76.5488 17.842C77.0632 16.8579 77.7697 16.0834 78.6683 15.5184C79.5669 14.9535 80.5897 14.671 81.7278 14.671L81.7248 14.668ZM82.52 24.5879C83.4156 24.5879 84.1576 24.266 84.7429 23.6221C85.3282 22.9781 85.6238 22.1702 85.6238 21.1983C85.6238 20.2263 85.3311 19.4184 84.7429 18.7745C84.1576 18.1305 83.4156 17.8086 82.52 17.8086C81.6243 17.8086 80.8823 18.1305 80.2971 18.7745C79.7118 19.4184 79.4162 20.2263 79.4162 21.1983C79.4162 22.1702 79.7088 22.9781 80.2971 23.6221C80.8823 24.266 81.6243 24.5879 82.52 24.5879Z" fill="#374E3E"/>
<path id="Vector_10" d="M94.5246 22.2754C94.7434 22.971 95.1513 23.5359 95.7395 23.9703C96.3307 24.4046 97.0195 24.6233 97.8117 24.6233C98.6601 24.6233 99.3606 24.4836 99.9193 24.2041C100.478 23.9247 100.983 23.5602 101.442 23.1168L103.567 25.7289C102.621 26.4913 101.687 27.0137 100.762 27.2992C99.8366 27.5847 98.9527 27.7275 98.1043 27.7275C96.7534 27.7275 95.5592 27.445 94.5246 26.88C93.49 26.3151 92.6801 25.5375 92.0918 24.5443C91.5065 23.5511 91.2109 22.4243 91.2109 21.1607C91.2109 19.8972 91.4918 18.8037 92.0534 17.8288C92.615 16.8538 93.3836 16.0823 94.3561 15.5173C95.3287 14.9524 96.4342 14.6699 97.6728 14.6699C98.9113 14.6699 99.9962 14.9494 100.954 15.5113C101.912 16.0732 102.665 16.8416 103.221 17.8227C103.774 18.8007 104.052 19.9245 104.052 21.1881V22.2815H94.5217L94.5246 22.2754ZM100.44 20.2677C100.268 19.5327 99.9193 18.9374 99.3902 18.4848C98.8611 18.0323 98.2255 17.8075 97.4836 17.8075C96.7416 17.8075 96.0854 18.0383 95.5356 18.497C94.9858 18.9586 94.6251 19.5479 94.4537 20.2677H100.44Z" fill="#374E3E"/>
<path id="Vector_11" d="M105.015 14.9188H107.031V11.7812H110.548V14.9188H113.516V18.0564H110.548V22.6762C110.548 23.2715 110.735 23.7362 111.104 24.0764C111.474 24.4166 111.944 24.5836 112.514 24.5836C112.937 24.5836 113.374 24.4864 113.821 24.2951V27.2565C113.046 27.5663 112.284 27.7212 111.536 27.7212C110.084 27.7212 108.973 27.3203 108.192 26.5215C107.415 25.7226 107.025 24.5776 107.025 23.0893V18.0534H105.009V14.9158L105.015 14.9188Z" fill="#374E3E"/>
<path id="Vector_12" d="M115.624 24.0199C115.624 23.1847 115.858 22.4345 116.328 21.7723C116.795 21.1102 117.442 20.5877 118.264 20.202C119.086 19.8163 120.028 19.6249 121.087 19.6249C121.421 19.6249 121.773 19.6462 122.145 19.6887C122.514 19.7312 122.887 19.7859 123.262 19.8527C122.993 18.4889 122.03 17.8055 120.365 17.8055C119.381 17.8055 118.391 18.1852 117.398 18.9476L116.189 15.8981C117.037 15.4789 117.871 15.1691 118.692 14.9687C119.514 14.7682 120.297 14.668 121.039 14.668C122.222 14.668 123.245 14.8958 124.114 15.3514C124.983 15.807 125.654 16.4509 126.136 17.2862C126.617 18.1184 126.857 19.0964 126.857 20.2172V27.4734H123.901L123.667 26.1309C123.212 26.626 122.656 27.0148 122 27.2972C121.344 27.5827 120.626 27.7255 119.842 27.7255C118.604 27.7255 117.593 27.3823 116.806 26.6958C116.02 26.0094 115.627 25.1195 115.627 24.023L115.624 24.0199ZM119.142 23.1907C119.142 23.6099 119.298 23.947 119.612 24.2022C119.925 24.4573 120.339 24.5849 120.853 24.5849C121.554 24.5849 122.142 24.3662 122.618 23.9319C123.094 23.4975 123.333 22.9599 123.333 22.3251V22.073C123.032 21.9728 122.707 21.8938 122.361 21.8331C122.015 21.7753 121.675 21.745 121.341 21.745C120.649 21.745 120.108 21.8695 119.721 22.1216C119.334 22.3737 119.142 22.7291 119.142 23.1877V23.1907Z" fill="#374E3E"/>
<path id="Vector_13" d="M140.253 25.8658C139.659 26.452 138.947 26.9076 138.122 27.2356C137.294 27.5606 136.399 27.7246 135.429 27.7246C134.134 27.7246 132.979 27.4422 131.965 26.8772C130.951 26.3123 130.15 25.5377 129.564 24.5536C128.979 23.5695 128.684 22.4518 128.684 21.1943C128.684 19.9369 128.976 18.8191 129.564 17.835C130.153 16.8509 130.951 16.0764 131.965 15.5115C132.979 14.9465 134.134 14.6641 135.429 14.6641C136.399 14.6641 137.297 14.8281 138.122 15.1531C138.95 15.4811 139.659 15.9367 140.253 16.5229L137.773 18.9194C137.188 18.1752 136.405 17.8016 135.426 17.8016C134.531 17.8016 133.789 18.1236 133.203 18.7675C132.618 19.4114 132.322 20.2194 132.322 21.1913C132.322 22.1633 132.615 22.9712 133.203 23.6151C133.789 24.259 134.531 24.581 135.426 24.581C136.405 24.581 137.185 24.2074 137.773 23.4632L140.253 25.8597V25.8658Z" fill="#374E3E"/>
<path id="Vector_14" d="M145.844 8.13672V27.4724H142.326V8.13672H145.844Z" fill="#374E3E"/>
<path id="Vector_15" d="M148.38 10.6483C148.38 10.0469 148.56 9.56094 148.918 9.19342C149.276 8.8259 149.749 8.64062 150.334 8.64062C150.919 8.64062 151.392 8.8259 151.75 9.19342C152.107 9.56094 152.288 10.0469 152.288 10.6483C152.288 11.2497 152.107 11.7357 151.75 12.1032C151.392 12.4707 150.919 12.656 150.334 12.656C149.749 12.656 149.276 12.4707 148.918 12.1032C148.56 11.7357 148.38 11.2497 148.38 10.6483ZM148.575 27.4721V14.9188H152.096V27.4721H148.575Z" fill="#374E3E"/>
<path id="Vector_16" d="M165.54 25.8658C164.945 26.452 164.233 26.9076 163.408 27.2356C162.581 27.5606 161.685 27.7246 160.715 27.7246C159.421 27.7246 158.265 27.4422 157.251 26.8772C156.237 26.3123 155.436 25.5377 154.851 24.5536C154.265 23.5695 153.97 22.4518 153.97 21.1943C153.97 19.9369 154.262 18.8191 154.851 17.835C155.439 16.8509 156.237 16.0764 157.251 15.5115C158.265 14.9465 159.421 14.6641 160.715 14.6641C161.685 14.6641 162.584 14.8281 163.408 15.1531C164.236 15.4811 164.945 15.9367 165.54 16.5229L163.059 18.9194C162.474 18.1752 161.691 17.8016 160.712 17.8016C159.817 17.8016 159.075 18.1236 158.489 18.7675C157.904 19.4114 157.609 20.2194 157.609 21.1913C157.609 22.1633 157.901 22.9712 158.489 23.6151C159.075 24.259 159.817 24.581 160.712 24.581C161.691 24.581 162.471 24.2074 163.059 23.4632L165.54 25.8597V25.8658Z" fill="#374E3E"/>
<path id="Vector_17" d="M167.611 27.4721V8.64062H171.129V20.0671C171.374 19.6753 171.643 19.2895 171.936 18.919C172.229 18.5454 172.551 18.1505 172.903 17.7314L175.273 14.9188H179.122L174.431 20.5561L180.003 27.4752H175.69L172.196 23.232L171.132 24.5138V27.4752H167.614L167.611 27.4721Z" fill="#374E3E"/>
</g>
<defs>
<clipPath id="clip0_95_4137">
<rect width="180" height="34" fill="white"/>
</clipPath>
</defs>
</svg>
