verilog work "stoper.v"
verilog work "seg7.v"
verilog work "display_mux.v"
verilog work "prescaler.v"
verilog work "stopwatch.v"
verilog work "synchronizer.v"
verilog work "bintobcd.v"
verilog work "divider.v"
