struct {x=0, y=0, }
struct {x=1, y=0, }
struct {x=2, y=0, }
struct {x=3, y=0, }
array[4] = [struct {x=0, y=0, }, struct {x=1, y=0, }, struct {x=2, y=0, }, struct {x=3, y=0, }, ]
struct {x=0, y=0, }
struct {x=1, y=1, }
struct {x=2, y=2, }
struct {x=3, y=3, }
array[4] = [struct {x=0, y=0, }, struct {x=1, y=1, }, struct {x=2, y=2, }, struct {x=3, y=3, }, ]
