[
  {
    "id": "erlang",
    "label": "erlang",
    "value": 550,
    "color": "hsl(329, 70%, 50%)"
  },
  {
    "id": "haskell",
    "label": "haskell",
    "value": 77,
    "color": "hsl(128, 70%, 50%)"
  },
  {
    "id": "java",
    "label": "java",
    "value": 516,
    "color": "hsl(354, 70%, 50%)"
  },
  {
    "id": "hack",
    "label": "hack",
    "value": 570,
    "color": "hsl(178, 70%, 50%)"
  },
  {
    "id": "php",
    "label": "php",
    "value": 600,
    "color": "hsl(186, 70%, 50%)"
  }
]