<svg width="25" height="23" viewBox="0 0 25 23" fill="none" xmlns="http://www.w3.org/2000/svg">
<path fill-rule="evenodd" clip-rule="evenodd" d="M12.5 22L10.8325 20.4951C4.91 15.145 1 11.6144 1 7.29428C1 3.76376 3.77725 1 7.325 1C9.326 1 11.2465 1.92698 12.5 3.3861C13.7535 1.92698 15.674 1 17.675 1C21.2227 1 24 3.76376 24 7.29428C24 11.6144 20.09 15.145 14.1675 20.4951L12.5 22Z" stroke="#D91A5E" stroke-width="2" stroke-linejoin="round"/>
</svg>
